##TITLE=$$ Begin of the data block
##JCAMP-DX=5.00 $$ ACD/SpecManager v 10.08
##SPECTROMETER/DATA SYSTEM=16PC
##DATE=28 May 2013 10:15:58
##DATA TYPE=INFRARED SPECTRUM
##DATA CLASS=XYDATA
##ORIGIN=
##OWNER=
##NPOINTS=3601
##FIRSTX=400.00000000
##LASTX=4000.00000000
##MAXX=4000.00000000
##MINX=400.00000000
##MAXY=73.76671600
##MINY=13.81102943
##XFACTOR=1.0000000000
##YFACTOR=0.000000100000000
##FIRSTY=29.73598862
##DELTAX=1.00000000
##XUNITS=1/CM
##YUNITS=TRANSMITTANCE
##XYDATA=(X++(Y..Y))
400 297359886 374044647 433491478 470440559 486557541 488399811 483743858 478327637 474486198
408 474486198 471847343 469090996 465442886 461106529 456740303 452692947 448679085 444073296 438480148
417 438480148 432078514 425496178 419366570 413944168 409045029 404298859 399466705 394586105 389886398
426 389886398 385611153 381922417 378948669 376886292 376016655 376589050 378647118 381942291 386007652
435 386007652 390342827 394579735 398521805 402058754 405051804 407289314 408543167 408669014 407661819
444 407661819 405626450 402693558 398946762 394408302 389072685 382943535 376041107 368383179 359974174
453 359974174 350825996 340999222 330627213 319896450 308989601 298034954 287099171 276234913
461 276234913 265546055 255231800 245582123 236935997 229628601 223953667 220139561 218334160
469 218334160 218591957 220872822 225064259 231023979 238619556 247736645 258247547 269959927 282587929
478 282587929 295773430 309154091 322437706 335439644 348062057 360230141 371830940 382688675
486 382688675 392589951 401341057 408823700 415024490 420026703 423974228 427019653 429277878 430797844
495 430797844 431566391 431539574 430690765 429048920 426708565 423804550 420468178 416789780 412810173
504 412810173 408540382 403991165 399192467 394190521 389030151 383740692 378333549 372814140 367193184
513 367193184 361489716 355725555 349916878 344074326 338206444 332323990 326435356 320538101 314614067
522 314614067 308638363 302598038 296513443 290445118 284482937 278725567 273262081 268165989 263501453
531 263501453 259332218 255725899 252753754 250486488 248995209 248350315 248615246 249830704 251994476
540 251994476 255047741 258879604 263348999 268312721 273646412 279248886 285035877 290931625 296870689
549 296870689 302807102 308723793 314633198 320564651 326545258 332585640 338676567 344797173 350928497
558 350928497 357063904 363211517 369388733 375611725 381883392 388186531 394485855 400738945 406911697
567 406911697 412992401 418992271 424933357 430828590 436666641 442411118 448016548 453447495 458691483
576 458691483 463754616 468645935 473365631 477903595 482252769 486423874 490450554 494378128 498240929
585 498240929 502046089 505772018 509383659 512855148 516186447 519401741 522536049 525613441 528631859
594 528631859 531560669 534351997 536962090 539373703 541608429 543725815 545802917 547906113 550067329
603 550067329 552278671 554509621 556738472 558976555 561270485 563676262 566220665 568873215 571547050
612 571547050 574132462 576544800 578761559 580830688 582842979 584886436 587003136 589166946 591293259
621 591293259 593272934 595017204 596494102 597738113 598830872 599858170 600864372 601829147 602678452
630 602678452 603324394 603715515 603865280 603847351 603759804 603682747 603653641 603670731 603714752 603773651 603851852
641 603851852 603965759 604135170 604378815 604711990 605140953 605650063 606191368 606691208 607083702 607353058
651 607353058 607554741 607788086 608128014 608557472 608956299 609168358 609113541 608865776 608623390 608570709
661 608570709 608705177 608751793 608249817 606790237 604276314 601052094 597799454 595244713 593825684
670 593825684 593501587 593801575 594073715 593787842 592731552 591015053 588925514 586737022 584592133
679 584592133 582495575 580386047 578214226 575972786 573675385 571321030 568882904 566331139 563672295
688 563672295 560975342 558372192 556040344 554185143 553029137 552799644 553697205 555847435 559250107
697 559250107 563757095 569099197 574953117 581021767 587093582 593061028 598902550 604646568 610336037
706 610336037 616001472 621643372 627220612 632647972 637810135 642588806 646896820 650703278 654034729
715 654034729 656955490 659536209 661829605 663858948 665625839 667120361 668333359 669263611 669921112
724 669921112 670327530 670511475 670495911 670284805 669852524 669151688 668134766 666785812 665136414 663259506
734 663259506 661235199 659113083 656887207 654506989 651912994 649082031 646053162 642923584 639815254
743 639815254 636833267 634035835 631431313 628997650 626714973 624590836 622671700 621030655 619743805
752 619743805 618860893 618383904 618263092 618408890 618717117 619096375 619486008 619859962 620213242 620539055
762 620539055 620808029 620957108 620896263 620530357 619784851 618626633 617068291 615151711 612925224 610422897
772 610422897 607667465 604692535 601578522 598476219 595600929 593188362 591430550 590413971 590092812
781 590092812 590303307 590812836 591381035 591806870 591950035 591728325 591100769 590051231 588580399 586708755
791 586708755 584490318 582035332 579533310 577267838 575608330 574969101 575737343 578187027 582409210
800 582409210 588283005 595503235 603652840 612293091 621040802 629606895 637794724 645472336 652540359
809 652540359 658915482 664534607 669374008 673468399 676913605 679848175 682419128 684742432 686877670
818 686877670 688824463 690540695 691976700 693104858 693934326 694508133 694882202 695104446 695202255 695184860
828 695184860 695058060 694840012 694568024 694291611 694053574 693870621 693723526 693562012 693324814 692960892
838 692960892 692447586 691792526 691024551 690175629 689266891 688300095 687260742 686125870 684875259 683500214
848 683500214 682007294 680418091 678761749 677064667 675338364 673573837 671742172 669807968 667747269
857 667747269 665560837 663277435 660939560 658582382 656211853 653797989 651284256 648610687 645737610
866 645737610 642661285 639411087 636035271 632581978 629083328 625554428 622001305 618436852 614892044
875 614892044 611419067 608079071 604920006 601950569 599124947 596342316 593467445 590362549 586921616
884 586921616 583092461 578878555 574322128 569475632 564376144 559028358 553405418 547461624 541151543
893 541151543 534446373 527340584 519848213 511990700 503783302 495229797 486325493 477071686 467493477
902 467493477 457656746 447679024 437734566 428054581 418924866 410674667 403654251 398196259 394565887
911 394565887 392911606 393233185 395378799 399074554 403974304 409715042 415960846 422426338 428882408
920 428882408 435151672 441099129 446625328 451661491 456164246 460111656 463500404 466345024 468679657
929 468679657 470561218 472069740 473303490 474372025 475383873 476436920 477610550 478962326 480529366
938 480529366 482330894 484370270 486635094 489093170 491688156 494336510 496930618 499350548 501480713
947 501480713 503226166 504523239 505339279 505661354 505482330 504788284 503555489 501757889 499379425
956 499379425 496425476 492926178 488930054 484490013 479649734 474435501 468858986 462926559 456651802
965 456651802 450063858 443207359 436135750 428900642 421543846 414094086 406569786 398985252 391356163
974 391356163 383703079 376049957 368420753 360834427 353302078 345823860 338392105 330993958 323615227
983 323615227 316243801 308869839 301484680 294077225 286632843 279132881 271556549 263885250 256106434
992 256106434 248218765 240236912 232195988 224151382 216177063 208357162 200777225 193518620 186660862
1001 186660862 180290966 174515209 169464779 165288582 162131195 160102558 159248762 159533138 160832634
1010 160832634 162948685 165626335 168578453 171509418 174137745 176217117 177552586 178011742 177527180
1019 177527180 176094608 173766117 170644741 166878567 162655582 158194618 153731918 149503841 145727615
1028 145727615 142586403 140218525 138713293 138110294 138403568 139546614 141461506 144048805 147200403
1037 147200403 150808640 154773741 159005785 163423500 167952843 172527657 177092266 181604538 186037369
1046 186037369 190374470 194603558 198709316 202669621 206458588 210054035 213445683 216638641 219651299
1055 219651299 222506599 225223312 227810230 230266685 232584858 234754391 236762924 238595257 240230732
1064 240230732 241644211 242809830 243705921 244320335 244653168 244717350 244538231 244152870 243609047 242962246
1074 242962246 242271233 241590805 240966511 240432434 240011768 239720478 239571075 239572392 239729500 240041752
1084 240041752 240503426 241106071 241842556 242710266 243711319 244850044 246130371 247551842 249108257
1093 249108257 250788307 252577839 254462414 256429939 258471203 260578899 262744961 264958229 267202396
1102 267202396 269456825 271697330 273898582 276035480 278087749 280046482 281924591 283769646 285671520
1111 285671520 287761173 290196400 293135872 296709251 300992031 305992222 311650620 317854519 324457512
1120 324457512 331300774 338233871 345131111 351900673 358487930 364869881 371045074 377021446 382806816
1129 382806816 388405380 393819351 399051743 404108963 408999023 413729019 418302803 422720146 426979904
1138 426979904 431083260 435036278 438850365 442541161 446126060 449620819 453037224 456380615 459649467
1147 459649467 462839165 465947762 468982582 471960983 474901390 477805901 480639763 483322182 485734329
1156 485734329 487752266 489291344 490346794 491010742 491456642 491893578 492510567 493430023 494689331
1165 494689331 496252594 498042946 499979591 502002716 504081154 506205826 508375854 510587959 512832031
1174 512832031 515092354 517352905 519602165 521836395 524060402 526285629 528525200 530786057 533063812
1183 533063812 535340996 537592163 539795303 541942062 544042015 546118889 548196297 550285416 552377129
1192 552377129 554445763 556462364 558408813 560288010 562121964 563941574 565772400 567623940 569486465
1201 569486465 571338272 573157043 574931107 576663895 578371735 580073051 581778450 583483849 585171509
1210 585171509 586817932 588404884 589927101 591393738 592823601 594235916 595642776 597045822 598437653
1219 598437653 599806175 601139297 602429123 603673172 604875603 606045494 607194252 608330269 609454575
1228 609454575 610559578 611631126 612656822 613634453 614575729 615503960 616444130 617411575 618403473
1237 618403473 619399796 620371742 621294670 622159462 622976112 623768806 624565887 625387306 626239014 627112579
1247 627112579 627992554 628865776 629728508 630586472 631448860 632318687 633184967 634021072 634791031 635460968
1257 635460968 636012459 636450958 636807022 637129517 637473068 637883072 638385201 638979912 639646034 640350723
1267 640350723 641061783 641758347 642433548 643091049 643737411 644374008 644994659 645589294 646149902 646676559
1277 646676559 647179108 647673721 648177719 648703384 649254684 649826355 650405655 650977325 651527939 652051926
1287 652051926 652554398 653049316 653553085 654075165 654611282 655144501 655651169 656114044 656530762 656916504
1297 656916504 657296524 657695160 658124695 658580780 659046631 659502029 659933090 660338287 660728378 661119995
1307 661119995 661528702 661961136 662413635 662874527 663330002 663770828 664194183 664604340 665006638 665405502
1317 665405502 665801315 666192322 666576462 666952515 667320557 667681580 668037109 668391037 668749237 669117966
1327 669117966 669501419 669898605 670305557 670719833 671142883 671578979 672026901 672471085 672880630 673220444
1337 673220444 673468628 673634415 673758469 673896179 674091721 674359360 674681168 675023117 675356522 675670090
1347 675670090 675965652 676245880 676504593 676732635 676932220 677130585 677375259 677712402 678156662 678674088
1357 678674088 679189224 679613724 679884872 679990387 679972916 679912415 679897537 679997253 680241928 680616684 681067276
1368 681067276 681518707 681899490 682165833 682313843 682375488 682398148 682420807 682461014 682516937 682584991 682674789
1379 682674789 682810669 683017273 683299484 683631210 683966522 684266052 684526520 684791336 685133438 685616989
1389 685616989 686255264 686988754 687697983 688246002 688535004 688549500 688362885 688107834 687919464 687881012
1399 687881012 687998886 688215561 688450623 688643036 688773499 688855972 688915024 688967743 689028778 689128571 689327087
1410 689327087 689701538 690302811 691106339 691986160 692741928 693170853 693155975 692726212 692054901 691395493
1420 691395493 690981903 690938263 691236954 691725388 692206192 692536621 692699280 692806931 693035507 693517075
1430 693517075 694245682 695053482 695677109 695883713 695592575 694925690 694156494 693588181 693427505 693717346
1440 693717346 694350204 695139694 695896912 696478271 696805725 696877747 696787872 696730576 696961365 697690582
1450 697690582 698946686 700490646 701858444 702549286 702276917 701145782 699634171 698374405 697840881
1459 697840881 698122253 698910446 699712296 700153122 700191193 700114822 700334244 701101685 702334442 703643723
1469 703643723 704545746 704723053 704183807 703236771 702312851 701747055 701643219 701883926 702254257 702593536
1479 702593536 702885056 703240204 703801193 704626236 705623016 706569519 707209549 707378159 707097321 706587601
1489 706587601 706183014 706176453 706664352 707474060 708230133 708545074 708249664 707534485 706906433 706952057
1499 706952057 708020782 709993134 712279892 714068375 714700546 713983002 712267990 710269165 708721390
1508 708721390 708074493 708366776 709314804 710526505 711699448 712701874 713526459 714190903 714663467
1517 714663467 714864502 714720154 714220734 713443832 712536469 711676788 711035614 710741043 710844345 711291656
1527 711291656 711926956 712548752 713009872 713312607 713631287 714223022 715261841 716685486 718156967
1536 718156967 719183273 719337234 718470230 716797104 714810944 713073807 711994629 711698074 712029877
1545 712029877 712678757 713341446 713859558 714277954 714806747 715701904 717105865 718910065 720710068
1554 720710068 721903000 721914520 720472031 717794113 714577560 711759262 710139847 710048904 711217728
1563 711217728 712929764 714374390 715019684 714819183 714154739 713568344 713438492 713781891 714272919 714453430
1573 714453430 713999939 712896957 711433334 710039215 709066467 708638153 708629837 708776550 708823929 708638992
1583 708638992 708232651 707703171 707152710 706629868 706121140 705581360 704972458 704286270 703543930 702779999
1593 702779999 702023926 701287231 700557480 699803619 698992233 698108902 697174301 696238098 695347214 694504013
1603 694504013 693647461 692682343 691549301 690294876 689083557 688123856 687537689 687252579 686993103
1612 686993103 686401520 685227432 683481903 681458206 679598312 678279419 677635269 677509689 677557297
1621 677557297 677424774 676913223 676046906 675034943 674169846 673717880 673838348 674539413 675661774 676898270
1631 676898270 677858810 678191376 677731857 676617737 675294495 674378281 674410324 675609894 677755051
1640 677755051 680265579 682473068 683948212 684716415 685235672 686127548 687796021 690142136 692547302
1649 692547302 694163818 694373856 693166656 691214294 689583664 689223022 690504227 693070450 696067810
1658 696067810 698621063 700275879 701159668 701798935 702731323 704171295 705922852 707563019 708746796
1667 708746796 709413605 709773712 710107803 710546570 710996170 711261520 711267014 711201630 711467056 712438354
1677 712438354 714189224 716361923 718281250 719263000 718952637 717507095 715527267 713785629 712898407
1686 712898407 713105621 714251480 715940704 717759781 719441147 720895844 722130203 723125534 723773804
1695 723773804 723910980 723427963 722381058 721025314 719736176 718856735 718548431 718733139 719156113
1704 719156113 719539795 719743118 719841156 720081024 720736923 721937332 723553925 725210724 726414108
1713 726414108 726753082 726080627 724593811 722771301 721189194 720290985 720220184 720794525 721637955 722402420
1723 722402420 722959137 723446579 724147720 725263290 726722336 728151398 729039078 729008865 728041992 726516495
1733 726516495 725031891 724116516 723983917 724468536 725169220 725701599 725907745 725908661 725985107 726372910
1743 726372910 727103729 727976608 728668518 728908005 728611603 727916641 727104111 726466522 726191864 726311569
1753 726311569 726724014 727262192 727765808 728124924 728290405 728265457 728095474 727866592 727704010 727751541
1763 727751541 728123245 728839874 729783173 730704117 731299591 731333313 730745087 729690094 728483200 727473145
1773 727473145 726907272 726852188 727198639 727734909 728240433 728556366 728617249 728449860 728158112 727900543
1783 727900543 727848434 728122482 728722610 729491806 730151901 730414963 730125427 729354477 728388748 727602234
1793 727602234 727278442 727474365 728001099 728531494 728769836 728595276 728104095 727539368 727156219 727097397
1803 727097397 727338715 727723846 728054886 728189316 728095093 727842789 727554245 727334900 727230911 727224655
1813 727224655 727266541 727315826 727366257 727442780 727578583 727789764 728066635 728383331 728710709 729020996 729279099
1824 729279099 729434509 729431915 729242630 728898849 728501205 728185043 728056107 728137741 728368607 728655319
1834 728655319 728946457 729271622 729712601 730319138 731028900 731655884 731964951 731800156 731183395 730321426
1844 730321426 729512253 729004593 728888168 729077606 729385376 729632263 729731064 729700089 729615860 729545517 729505081
1855 729505081 729463501 729381027 729251480 729120255 729065399 729154510 729399109 729731445 730018463 730110855 729906616
1866 729906616 729401932 728700180 727974701 727398071 727073975 727005310 727109985 727274551 727408829 727475662
1876 727475662 727484512 727465744 727446747 727445984 727479172 727563019 727706146 727892303 728074036 728187103 728183289 728060760
1888 728060760 727868805 727683334 727566299 727535858 727566681 727616653 727655792 727680740 727705688 727743378 727794800 727854919
1900 727854919 727927017 728027649 728173065 728357468 728540421 728663483 728687057 728626709 728558807 728585892 728777924
1911 728777924 729126816 729541779 729891663 730069427 730043488 729865494 729636002 729450760 729358444 729350967 729384842
1922 729384842 729415894 729424133 729420166 729428329 729468231 729540176 729624939 729696274 729736938 729749680 729758606 729799347 729901047
1935 729901047 730071182 730284653 730489731 730625534 730645752 730539017 730335846 730096664 729889069 729762726
1945 729762726 729734726 729790497 729897461 730022354 730143280 730251160 730343628 730418167 730469818 730497360 730507355
1956 730507355 730518265 730552750 730626526 730736923 730860748 730962448 731010132 730989685 730912247 730807877 730712967
1967 730712967 730654297 730639572 730657959 730688171 730710373 730716019 730709457 730703812 730712051 730738525 730775909 730809708 730827103
1980 730827103 730827408 730824814 730844269 730908432 731021729 731163254 731289520 731351929 731317673 731187592 730998154
1991 730998154 730808334 730675735 730632172 730673141 730761566 730847931 730892563 730883026 730835266 730782776 730756760 730770798
2003 730770798 730815659 730866394 730897751 730898895 730880280 730867767 730890198 730962219 731076126 731203003 731305466
2014 731305466 731355133 731345596 731296234 731243286 731223450 731255951 731334915 731432495 731511993 731545334 731525040 731465759
2026 731465759 731395874 731343994 731327133 731346817 731392593 731450729 731511230 731570969 731632385 731698532 731770554 731845703
2038 731845703 731919250 731986694 732045517 732096252 732141495 732184982 732231140 732283096 732341614 732405014 732469101 732528000
2050 732528000 732577972 732617569 732650757 732684555 732726440 732781448 732849655 732925797 733001556 733067474 733117523 733149796
2062 733149796 733166428 733173599 733177567 733183975 733197021 733218918 733250351 733290482 733336639 733385239 733432465 733475876
2074 733475876 733516464 733557358 733603821 733659744 733725662 733798981 733874588 733946991 734012222 734068756 734116898 734159012
2086 734159012 734197845 734236603 734277115 734320068 734363785 734405060 734441452 734472275 734500656 734531326 734568634 734612503
2098 734612503 734658508 734700012 734731674 734753113 734769669 734790497 734823227 734871063 734930267 734992599 735048676 735092621
2110 735092621 735123825 735147629 735171509 735201874 735240860 735284729 735326691 735360031 735381851 735395355 735407715 735426025
2122 735426025 735453110 735485535 735515289 735534286 735538177 735530319 735519409 735516739 735530624 735563049 735609665 735660858
2134 735660858 735705414 735735779 735749741 735752106 735752792 735762939 735790405 735836639 735896454 735960693 736019135 736064911
2146 736064911 736097031 736118088 736134491 736152496 736177368 736211929 736255341 736304321 736353836 736399231 736439285 736476669
2158 736476669 736517334 736567001 736626663 736690521 736747665 736787109 736804504 736805115 736802368 736811676 736842422 736893463 736952362
2171 736952362 737002182 737029266 737029495 737011108 736990891 736987152 737011337 737063065 737130737 737195206 737238693 737251434
2183 737251434 737235489 737205353 737181091 737180634 737211990 737268677 737332687 737381287 737399597 737386322 737356415 737334061
2195 737334061 737340469 737383118 737451248 737521515 737569656 737583847 737569809 737547607 737539978 737559128 737600174 737643738
2207 737643738 737667160 737655640 737610855 737551193 737502136 737485733 737509537 737563477 737623978 737664185 737665863 737627106
2219 737627106 737563553 737500916 737463455 737462540 737492905 737535400 737567520 737574539 737555847 737524414 737499695 737496185 737517548
2232 737517548 737554092 737587891 737601013 737584457 737542038 737490005 737449570 737437515 737456741 737494278 737526627 737529755
2244 737529755 737491531 737418823 737332535 737258759 737214661 737201157 737203598 737200165 737174225 737121506 737050934 736978760
2256 736978760 736919479 736878815 736851883 736826553 736789474 736734238 736663513 736588516 736522827 736475525 736445465 736422729
2268 736422729 736393433 736348038 736286011 736216354 736151123 736100159 736069336 736061478 736081161 736135178 736229477 736361008
2280 736361008 736513901 736661377 736773529 736828766 736819992 736752701 736639023 736490707 736314392 736113739 735892410
2291 735892410 735655518 735409927 735162506 734919434 734687195 734472504 734280624 734111862 733958588 733805618
2301 733805618 733634262 733425598 733162918 732829590 732409286 731890259 731275024 730590744 729891586 729246674
2311 729246674 728715744 728319702 728020477 727719498 727280273 726572876 725522537 724149551 722578506
2320 722578506 721002960 719615479 718525009 717701721 716987762 716173935 715112152 713801117 712393646
2329 712393646 711116257 710145798 709518661 709123459 708778534 708329163 707697296 706848373 705719986 704196167
2339 704196167 702186279 699792862 697454147 695931244 696078720 698466492 703039093 709003983 715038528
2348 715038528 719741898 722120667 721885681 719441223 715608978 711255722 707008514 703162842 699766159
2357 699766159 696773071 694165649 691983948 690289078 689111023 688431015 688200989 688376770 688933640
2366 688933640 689857330 691122437 692679977 694464645 696415558 698492889 700682678 702988510 705420456
2375 705420456 707986221 710685577 713502197 716395950 719293823 722095718 724692688 726991501 728937912
2384 728937912 730521927 731769104 732722321 733427887 733929901 734270859 734493332 734636307 734730606 734794159
2394 734794159 734835205 734858627 734871902 734885635 734908066 734939728 734972305 734993439 734995575 734980011 734956207 734936523
2406 734936523 734928131 734932098 734943695 734957047 734968262 734975204 734977646 734975662 734970398 734963226 734953918 734940948 734920197
2419 734920197 734886703 734839172 734782486 734726181 734680328 734650955 734635086 734623566 734605331 734573517 734529800 734481812
2431 734481812 734440384 734413834 734404755 734408569 734414597 734410629 734386368 734338074 734271469 734199753 734138565 734099274 734082184
2444 734082184 734076691 734065552 734033203 733974838 733896942 733815765 733748016 733703461 733679657 733663788 733638611 733591003
2456 733591003 733519211 733433838 733354034 733298798 733277054 733282242 733295059 733291855 733255844 733187027 733102493 733028030
2468 733028030 732985306 732980423 733000183 733018112 733006973 732951584 732855682 732739563 732631149 732553482 732515488 732509613
2480 732509613 732515869 732510986 732479401 732418518 732340622 732266159 732213593 732192001 732196426 732209702 732211151 732186813 732135315
2493 732135315 732069092 732007980 731969681 731960754 731973114 731988144 731985168 731951904 731891098 731817780 731752167 731708374
2505 731708374 731686630 731674271 731651840 731605377 731534958 731455994 731392822 731366272 731382828 731431503 731487427 731522751
2517 731522751 731518250 731471176 731394196 731309738 731239395 731193924 731170502 731154709 731128845 731081467 731013336 730936508
2529 730936508 730868683 730823898 730804825 730802231 730799484 730781326 730740509 730680008 730609970 730541992 730483551 730435486
2541 730435486 730394058 730354385 730312958 730269699 730226288 730185394 730147552 730111694 730075073 730033951 729986343 729932480
2553 729932480 729875565 729821243 729775238 729741211 729718857 729704208 729691696 729675369 729652023 729621124 729583664 729542236
2565 729542236 729499817 729459152 729423523 729396439 729380035 729374390 729375763 729378204 729373550 729354324 729317856 729265594 729205399
2578 729205399 729147644 729102249 729074020 729061661 729057770 729053345 729041748 729022598 729000092 728980331 728966599 728956223
2590 728956223 728941345 728913956 728870468 728814926 728758240 728713303 728689270 728686981 728698196 728708725 728705063 728679504
2602 728679504 728634262 728578873 728527832 728492355 728477249 728477783 728482590 728479691 728461533 728428192 728386612 728345108 728308105
2615 728308105 728273544 728232956 728177872 728104935 728019791 727934952 727864990 727819061 727797318 727789993 727783432 727767029
2627 727767029 727737045 727699356 727663727 727638550 727625961 727620239 727611160 727589188 727550964 727500992 727448883 727404938
2639 727404938 727374878 727356567 727342529 727322540 727288895 727239838 727179413 727115173 727054443 727001877 726957703 726919098
2651 726919098 726882248 726845093 726807556 726771393 726738434 726708450 726679153 726646194 726605072 726553040 726490250 726420288
2663 726420288 726349869 726286240 726235275 726199493 726177673 726165085 726156082 726146469 726136093 726127396 726124802 726130371 726142120
2676 726142120 726154480 726159821 726151581 726127319 726088409 726040192 725988007 725935516 725883484 725829391 725769196 725700836
2688 725700836 725625687 725550003 725484085 725438232 725417099 725417252 725427017 725430908 725416946 725382309 725333710 725283661 725242462
2701 725242462 725212479 725187912 725158615 725116425 725060654 724998474 724940643 724896240 724869690 724857864 724853897 724850311
2713 724850311 724841461 724824982 724802475 724778214 724757309 724743576 724737396 724733810 724723969 724698792 724652481 724587402 724512863
2726 724512863 724442139 724386826 724352112 724334946 724325714 724313202 724289932 724254379 724211884 724170532 724137115 724113159
2738 724113159 724095078 724074860 724045715 724006424 723961639 723919907 723888016 723865738 723845825 723816605 723769150 723702850
2750 723702850 723626556 723555450 723501892 723470612 723455276 723443222 723421173 723382187 723328400 723268890 723214569 723172684
2762 723172684 723144836 723126068 723108215 723083878 723049240 723005447 722957153 722911072 722871323 722838364 722807541 722771301
2774 722771301 722721786 722655258 722575150 722491226 722416534 722362671 722333755 722325592 722325439 722318344 722292252 722244110 722180557
2787 722180557 722114258 722058487 722020569 721999207 721984863 721964340 721927414 721870270 721797714 721720276 721649780 721593170
2799 721593170 721550140 721512604 721469193 721411057 721336823 721253967 721175385 721112747 721070328 721041718 721013260 720970688
2811 720970688 720906830 720824966 720737534 720659485 720601730 720566635 720547791 720534439 720514832 720482101 720435028 720377808
2823 720377808 720317001 720259628 720208893 720164108 720119476 720069351 720011063 719947586 719888077 719841537 719812317 719794922
2835 719794922 719775391 719736099 719664154 719556580 719419937 719267273 719110260 718954163 718797836 718635864
2845 718635864 718463745 718280029 718088303 717894440 717705002 717525711 717360916 717214203 717088776 716986389
2855 716986389 716907120 716848831 716806793 716775055 716747665 716719742 716688232 716652222 716613083 716573257 716535568 716502075
2867 716502075 716472168 716442795 716407471 716358490 716289749 716199265 716091003 715973969 715858994 715753555 715659409
2878 715659409 715572586 715487595 715400848 715313950 715233307 715164261 715108414 715060577 715011826 714954453 714886780 714813538
2890 714813538 714742508 714678268 714617920 714550400 714461746 714343948 714198227 714038391 713883667 713751373 713647995
2901 713647995 713567581 713494644 713413467 713318253 713215714 713123169 713058624 713029556 713026657 713025131 712995300 712914276
2913 712914276 712776260 712593231 712386475 712175751 711971588 711772308 711570663 711362228 711152420 710955429
2923 710955429 710789795 710669174 710596924 710564346 710556946 710559311 710562744 710567017 710578079 710604858 710653229 710724487
2935 710724487 710814438 710917664 711029205 711147156 711272125 711404495 711541748 711676483 711798859 711899109
2945 711899109 711971359 712016754 712040634 712051773 712056046 712055511 712047272 712024994 711981583 711910477 711806564 711666641
2957 711666641 711489410 711276932 711036606 710780106 710522995 710280914 710065536 709882202 709731216 709609528
2967 709609528 709515305 709450073 709417877 709422150 709462738 709534760 709629440 709738312 709855347 709976730 710099258
2978 710099258 710217285 710321274 710400848 710449524 710468674 710467834 710461273 710461578 710473633 710492554 710507431 710506821 710483932
2991 710483932 710440445 710383835 710323486 710266800 710215378 710166397 710114822 710056000 709988174 709912186 709830933 709748688
3003 709748688 709670639 709603806 709556427 709535446 709543610 709573822 709609146 709625778 709599991 709518127 709382095 709209518
3015 709209518 709028091 708864746 708736801 708647537 708586426 708535690 708477554 708399582 708298874 708180008 708053284
3026 708053284 707929993 707818298 707719879 707630005 707539291 707438431 707323074 707197647 707073898 706967468
3036 706967468 706890869 706847305 706828461 706815872 706786728 706722260 706614456 706468964 706303024 706139069 705994720
3047 705994720 705876465 705777435 705682068 705574265 705446548 705304718 705164566 705045013 704957809 704901428 704861450
3058 704861450 704817123 704751129 704657288 704541855 704418411 704299622 704189987 704083328 703967514 703833237
3068 703833237 703682404 703530807 703402252 703318024 703285599 703292313 703309860 703305359 703254776 703152084 703008041
3079 703008041 702842865 702674561 702512207 702354736 702196732 702035980 701876450 701726990 701595688 701482925
3089 701482925 701380692 701275253 701154022 701010513 700846405 700669022 700487518 700308533 700135574 699970474
3099 699970474 699814377 699669189 699535904 699413223 699296570 699179916 699057693 698927841 698792725 698656921
3109 698656921 698525848 698402863 698288956 698182907 698082352 697983322 697878418 697757263 697605972 697412415
3119 697412415 697171555 696889725 696586304 696288605 696023560 695807190 695639114 695500488 695362701 695198975
3129 695198975 694996414 694762802 694524155 694312439 694151077 694041977 693964157 693881226 693757172 693571777
3139 693571777 693326797 693044128 692753830 692482910 692247314 692049866 691884003 691737061 691594391 691440201
3149 691440201 691260071 691044464 690792465 690512619 690220108 689930038 689652557 689389572 689137573 688891754
3159 688891754 688649826 688411789 688175888 687936478 687684708 687413330 687123184 686825333 686536789 686272125
3169 686272125 686033249 685807190 685569305 685295639 684974136 684610672 684227600 683852692 683507690 683199387
3179 683199387 682918472 682645874 682362366 682058029 681735382 681406021 681083908 680778503 680490036 680210342
3189 680210342 679926376 679624329 679293747 678929443 678532791 678111801 677681122 677258148 676859436 676493607
3199 676493607 676159134 675843506 675528107 675196304 674838104 674454651 674054337 673648911 673247528 672854691
3209 672854691 672469025 672086258 671700668 671307526 670904236 670491180 670073166 669657516 669253464 668868332
3219 668868332 668503952 668154831 667808838 667451172 667070694 666665421 666243973 665822678 665417938 665038528
3229 665038528 664680557 664329071 663965302 663575592 663158035 662722702 662284393 661854630 661435089 661018295
3239 661018295 660593719 660155258 659706650 659258652 658823853 658409424 658014450 657631989 657255249 656880798
3249 656880798 656510773 656149673 655800018 655458984 655120316 654776154 654422379 654059677 653692474 653326569
3259 653326569 652966080 652612915 652268372 651936340 651623764 651338577 651084747 650857162 650639114 650405807
3269 650405807 650132446 649802551 649414902 648983002 648529663 648077774 647643509 647233429 646844711 646470795
3279 646470795 646104660 645741501 645379944 645021210 644667969 644321976 643981857 643640823 643288193 642912064
3289 642912064 642504730 642065201 641600494 641121292 640637436 640153809 639671326 639189682 638711777 638243752
3299 638243752 637791939 637357559 636932526 636498489 636031876 635509682 634917793 634254875 633533707 632778358
3309 632778358 632017097 631274872 630565605 629888077 629227982 628565102 627881889 627171249 626437759 625692520
3319 625692520 624947395 624207687 623470840 622728767 621971970 621192513 620386887 619555016 618701553 617834396
3329 617834396 616963730 616099052 615245285 614401016 613558121 612705650 611833763 610936584 610011826 609058456
3339 609058456 608074799 607060776 606019897 604963646 603909683 602875862 601872330 600894966 599924736
3348 599924736 598934021 597898064 596804237 595657425 594477921 593292732 592125359 590987854 589877281
3357 589877281 588779182 587675705 586553612 585410652 584255142 583101501 581961365 580836563 579717484
3366 579717484 578586578 577426529 576228485 574997673 573751984 572516365 571314850 570162926 569064293
3375 569064293 568011360 566988373 565977898 564966202 563947678 562927437 561921234 560951462 560040207
3384 560040207 559201927 558434906 557720108 557024231 556310120 555549507 554733963 553878632 553016739 552187462
3394 552187462 551421242 550728073 550094147 549486961 548867950 548205910 547489433 546730080 545957718 545207939
3404 545207939 544508667 543869133 543279724 542718735 542164650 541605988 541043472 540484962 539936638 539397354
3414 539397354 538859482 538315277 537765160 537220192 536698532 536218529 535792122 535421791 535103073 534827766
3424 534827766 534586411 534370079 534171562 533986931 533817596 533670273 533551254 533460999 533388748 533315773
3434 533315773 533224487 533109360 532982597 532868958 532792053 532760010 532759743 532764931 532752533 532717781 532680283 532674484
3446 532674484 532732010 532865906 533065300 533303528 533553619 533802643 534055367 534327087 534630127 534963379
3456 534963379 535311203 535651741 535970535 536269302 536566582 536887741 537252464 537664642 538110657 538564949
3466 538564949 538999825 539393349 539735298 540029564 540294724 540560875 540861893 541223183 541649628 542120247
3476 542120247 542594337 543030319 543404808 543723793 544018707 544327469 544675255 545065346 545483017 545909424
3486 545909424 546333008 546752014 547168617 547583656 547997894 548417778 548861237 549350166 549895134 550478821
3496 550478821 551054153 551562576 551963425 552257996 552490768 552725296 553011703 553362389 553752937 554145432
3506 554145432 554516830 554874611 555251312 555682640 556185226 556748314 557341805 557933006 558502083 559046097
3516 559046097 559572182 560086670 560586281 561056023 561475143 561824760 562098198 562306099 562478828 562662048
3526 562662048 562905045 563245583 563694992 564230690 564802208 565350227 565834961 566257248 566663361 567123795
3536 567123795 567693863 568374939 569099960 569754410 570228119 570472107 570525742 570498505 570513039 570643501
3546 570643501 570884132 571169281 571426849 571629829 571811981 572039528 572363396 572790642 573294029 573848495
3556 573848495 574459343 575148773 575902863 576618156 577097015 577115479 576536942 575409203 573978920 572608604
3566 572608604 571632996 571228714 571364250 571843376 572409973 572852478 573064537 573050613 572897530 572736244
3576 572736244 572704163 572901268 573338737 573898392 574333725 574339104 573672562 572278900 570341034 568219032
3586 568219032 566297531 564815941 563773804 562958183 562073593 560898705 559385147 557657623 555935287
3595 555935287 554431839 553290977 552570610 552258224 552279816 552491341 552669411 552530022 551790161 550250206
3605 550250206 547856255 544698524 540942879 536723862 532051125 526774101 520626259 513341331 504815979
3614 504815979 495274696 485376434 476198425 469052734 465148926 465199509 469129906 476042290 484489326
3623 484489326 492966805 500413361 506491127 511531258 516198463 521070862 526351509 531831093 537067413
3632 537067413 541638374 545322037 548136177 550271759 551997032 553583031 555245132 557071381 558937378
3641 558937378 560465622 561102753 560334892 557963562 554288254 550068779 546251144 543587456 542349243
3650 542349243 542285080 542827110 543415146 543752136 543871155 544022064 544481773 545410080 546804504 548530998
3660 548530998 550373001 552065735 553328018 553923302 553747330 552895699 551645355 550331192 549173279
3669 549173279 548162384 547086372 545693169 543890686 541852646 539959068 538603554 537985229 538001213
3678 538001213 538286057 538344269 537685165 535894432 532649498 527734184 521099319 512951813 503799782
3687 503799782 494385529 485498428 477748871 471417999 466460457 462649040 459766464 457739258 456659088
3696 456659088 456717491 458125877 461071472 465705147 472115555 480254326 489835663 500287247 510827827
3705 510827827 520679550 529331055 536718941 543223267 549469910 556038780 563221703 570933952 578796463
3714 578796463 586319847 593085251 598853531 603583565 607393875 610504532 613186073 615715866 618339119
3723 618339119 621230316 624458313 627957039 631508560 634751129 637239532 638580246 638621635 637625542
3732 637625542 636305618 635647697 636532516 639314880 643584671 648277206 652126312 654246140 654526901
3741 654526901 653619385 652511749 651945114 652018051 652212448 651812973 650445023 648392181 646488419
3750 646488419 645662994 646417770 648556595 651315308 653791275 655406570 656138916 656421890 656815948
3759 656815948 657668991 658951340 660326004 661365128 661769867 661487045 660697174 659723663 658924713
3768 658924713 658602905 658933029 659909210 661325760 662819443 663987579 664545364 664446030 663896179 663245163
3778 663245163 662808380 662721939 662914429 663201294 663435135 663611603 663860016 664342499 665133514 666170807
3788 666170807 667309189 668426285 669494705 670558548 671629944 672591019 673190460 673159027 672378159
3797 672378159 670984421 669325104 667784348 666588211 665726166 665043869 664443665 664044113 664168472
3806 664168472 665150604 667076416 669637833 672211685 674128723 674974976 674741745 673748169 672401428
3815 672401428 670968933 669506989 667974396 666419678 665088959 664357071 664525223 665622559 667357330
3824 667357330 669257126 670911865 672162628 673118973 673997574 674898758 675669327 675948486 675369644
3833 675369644 673795700 671445618 668830795 666539841 664998932 664343643 664473953 665241165 666631699
3842 666631699 668801498 671906967 675813293 679870148 682945633 683784180 681565933 676396713 669446259
3851 669446259 662608948 657805481 656237869 657953720 661920547 666550064 670396500 672686081 673455276
3860 673455276 673295822 672903366 672689896 672642059 672447891 671771698 670503387 668852997 667263718 666211548
3870 666211548 666001129 666655273 667933578 669453506 670844650 671861038 672414474 672535019 672304535
3879 672304535 671812134 671151276 670436020 669798737 669347229 669105911 668990097 668854294 668603210 668296890
3889 668296890 668168335 668519363 669540253 671155624 672997513 674525757 675240402 674869995 673451614
3898 673451614 671286011 668813324 666482162 664657745 663574371 663317719 663823090 664898911 666281815
3907 666281815 667707291 668971786 669950790 670579529 670821915 670667191 670158234 669421005 668652878 668055344
3917 668055344 667744675 667704163 667814713 667944870 668038025 668128052 668278732 668494797 668680725 668682404 668388138
3928 668388138 667813568 667113342 666511993 666198883 666251831 666620178 667160873 667698212 668078079 668210220
3938 668210220 668093491 667814484 667510910 667302399 667222137 667199020 667106400 666857681 666475525 666084366
3948 666084366 665826645 665765305 665847626 665956268 666001816 665977020 665931549 665896912 665838165 665682602 665401382
3959 665401382 665063934 664802933 664709091 664748001 664778366 664669800 664418030 664149628 664002991 663985291 663942871
3970 663942871 663687668 663176193 662577591 662143631 661982269 661934280 661692047 661080475 660252914 659595566
3980 659595566 659376907 659439316 659244843 658310013 656691284 655052948 654139023 654002228 653680878 651786270
3990 651786270 647733002 642635117 638826828 637790985 637546730 631351089 609187965 561966209
3998 561966209 486529198 388692284
4000 388692284
##END=$$ End of the data block
