##TITLE=$$ Begin of the data block
##JCAMP-DX=5.00 $$ ACD/SpecManager v 10.08
##SPECTROMETER/DATA SYSTEM=16PC
##DATE=28 May 2013 10:06:24
##DATA TYPE=INFRARED SPECTRUM
##DATA CLASS=XYDATA
##ORIGIN=
##OWNER=
##NPOINTS=3601
##FIRSTX=400.00000000
##LASTX=4000.00000000
##MAXX=4000.00000000
##MINX=400.00000000
##MAXY=73.63790894
##MINY=7.90866375
##XFACTOR=1.0000000000
##YFACTOR=0.000000100000000
##FIRSTY=26.50513840
##DELTAX=1.00000000
##XUNITS=1/CM
##YUNITS=TRANSMITTANCE
##XYDATA=(X++(Y..Y))
400 265051384 334137955 388026428 421763115 436562271 438103180 433303604 427377090 422524681
408 422524681 418482742 414090309 408684158 402556648 396500854 391052208 386077843 380953331 375086594
417 375086594 368343849 361091576 353900719 347188110 341049805 335346413 329902916 324650955 319643154
426 319643154 314997959 310872211 307492256 305183487 304318199 305168095 307748127 311757469 316671658
435 316671658 321926689 327076683 331838036 336023216 339450989 341915665 343239822 343354073 342325554
444 342325554 340304184 337422638 333721428 329149628 323632393 317148094 309761295 301598835 292796478
453 292796478 283460007 273661041 263459091 252921410 242130432 231178665 220170574 209235401
461 209235401 198546371 188329201 178850231 170393181 163231182 157605019 153706350 151662226
469 151662226 151521330 153254890 156774158 161964893 168717365 176935196 186517696 197329884 209181557
478 209181557 221831322 235008526 248438416 261851711 274984779 287580853 299407883 310286751
486 310286751 320114899 328862877 336543808 343174438 348752022 353262138 356705666 359122887 360592957
495 360592957 361208954 361047478 360154228 358555069 356280479 353386497 349953690 346071091 341815529
504 341815529 337240524 332380180 327260895 321911850 316368504 310669670 304853535 298952675 292992611
513 292992611 286991177 280960579 274912605 268864689 262840042 256860638 250934525 245044689 239153080
522 239153080 233218403 227222595 221188717 215179939 209282646 203583794 198161049 193086548 188437424
531 188437424 184301872 180771427 177923603 175812149 174467354 173908577 174154301 175220451 177105255
540 177105255 179772472 183146667 187125683 191602573 196482353 201685772 207140255 212770309 218499336
549 218499336 224261742 230019073 235767746 241531773 247345886 253239117 259226227 265310574 271491375
558 271491375 277771358 284157333 290657768 297275467 304001408 310810776 317666054 324523773 331347618
567 331347618 338118019 344832726 351497002 358105774 364631691 371026878 377239838 383237228 389017639
576 389017639 394606323 400036888 405330696 410489922 415505257 420372391 425101433 429714088 434227867
585 434227867 438643570 442942162 447097015 451089439 454922295 458619728 462217178 465747375 469227715
594 469227715 472652931 475994415 479206238 482239037 485061684 487680016 490145912 492546501 494976578
603 494976578 497506561 500163727 502934570 505786858 508693199 511643715 514637794 517665215 520691185
612 520691185 523660774 526517601 529232330 531818466 534325104 536812744 539317665 541828575 544283142
621 544283142 546590424 548667831 550475159 552029114 553387756 554614525 555739212 556739006 557553444
630 557553444 558124008 558436432 558538589 558523407 558486481 558488007 558540154 558626289 558733177 558873444 559080887
641 559080887 559387932 559803009 560306511 560865059 561450844 562047844 562645874 563229904 563783112 564299583
651 564299583 564794617 565293198 565798225 566263008 566601601 566742401 566696892 566581764 566557312 566697197
661 566697197 566868172 566717644 565812111 563874321 560991669 557657013 554593353 552437935 551447868
670 551447868 551391258 551676903 551648026 550873947 549291153 547141457 544774704 542446594 540221672 538010902
680 538010902 535684586 533175354 530509834 527767334 525013847 522260475 519472733 516612854 513689842
689 513689842 510790024 508085861 505827637 504320412 503884735 504795227 507208519 511106339 516285057
698 516285057 522406082 529090004 536018143 542996025 549958344 556922379 563921318 570951538 577953606
707 577953606 584827232 591462631 597770424 603696823 609220047 614332733 619022675 623259621 627000618
716 627000618 630209503 632885284 635079041 636888351 638424225 639768066 640938568 641889267 642540283
725 642540283 642822952 642717056 642257004 641505890 640518799 639313202 637865906 636134796 634087715
734 634087715 631724243 629078484 626205254 623158302 619975204 616673965 613261185 609747963 606168137
743 606168137 602586746 599097404 595807571 592813339 590179710 587929649 586052437 584524155 583329659
752 583329659 582472725 581968117 581820602 582004814 582456055 583080559 583778610 584467201 585090942 585616379
762 585616379 586013107 586236458 586219673 585882950 585153542 583987045 582378998 580359497 577976341 575276718
772 575276718 572300987 569096642 565745621 562391396 559241829 556538773 554496231 553231926 552718468
781 552718468 552782249 553149643 553525925 553673553 553457413 552844124 551862106 550547829 548910866 546935997
791 546935997 544625473 542058792 539442711 537121201 535535545 535144424 536328621 539314194 544135399
800 544135399 550643654 558552170 567494469 577076950 586918182 596671486 606042480 614803467 622805672
809 622805672 629985504 636355057 641978531 646940308 651313400 655141983 658442001 661217728 663484344
818 663484344 665284271 666692047 667800217 668700180 669461823 670124512 670699921 671182938 671563110 671831360
828 671831360 671978989 671996536 671875763 671616974 671236954 670772095 670267792 669761581 669264526 668754959
838 668754959 668187637 667516251 666713409 665781708 664744644 663629227 662445908 661181564 659808350
847 659808350 658299713 656648102 654869308 652994385 651052170 649053879 646987762 644827194 642546768
856 642546768 640136948 637608795 634985733 632286377 629511185 626637306 623629684 620458527 617114525
865 617114525 613612747 609979973 606236610 602383194 598402367 594277534 590017662 585672798 581333046
874 581333046 577103004 573069839 569273300 565694771 562266655 558894768 555483017 551947784 548219337
883 548219337 544236259 539939117 535272827 530196037 524693985 518782310 512499275 505885201 498961258
892 498961258 491716270 484110870 476097221 467642365 458744736 449434280 439757004 429755821 419458504
901 419458504 408884277 398065796 387081413 376083031 365311470 355090675 345803185 337846375
909 337846375 331580429 327275848 325072556 324962425 326797981 330323944 335220413 341144371 347759857
918 347759857 354757156 361861610 368841095 375510902 381735229 387422791 392516556 396980705 400796280
927 400796280 403965530 406524391 408553467 410177803 411551018 412829895 414147263 415597954 417239723
936 417239723 419107285 421228180 423630333 426335831 429343300 432608604 436035461 439482841 442788582
945 442788582 445800285 448400002 450514030 452103157 453143387 453606262 453453178 452642479 451147308
954 451147308 448970490 446145706 442726669 438767090 434303665 429351540 423912125 417989006 411602211
963 411602211 404793091 397619705 390144844 382425461 374507256 366424828 358209877 349896469 341525459
972 341525459 333141708 324787636 316496048 308284950 300159016 292116089 284155064 276281834 268509312
981 268509312 260850906 253313560 245890923 238563900 231305981 224089603 216892719 209699917 202499752
990 202499752 195282211 188037720 180761452 173459091 166153316 158884821 151708670 144685783 137875738
999 137875738 131333189 125112982 119280014 113920012 109142609 105073452 101833372 99513416 98152027
1008 98152027 97723789 98139477 99258261 100901432 102867212 104941111 106906958 108558865 109716291
1017 109716291 110239735 110042601 109096985 107431183 105123005 102289476 99076252 95648317 92180529
1026 92180529 88847456 85813065 83221645 81188841 79797249 79093037 79086637 79757237 81057796
1035 81057796 82923489 85279274 88046560 91148682 94514933 98082952 101800222 105622749 109513559
1044 109513559 113440819 117375116 121291027 125166531 128984661 132730951 136390486 139945393 143374414
1053 143374414 146655931 149773998 152721710 155502300 158123837 160593758 162913055 165076389 167073460
1062 167073460 168892994 170523891 171952248 173159561 174122181 174816055 175226364 175356274 175233250
1071 175233250 174906349 174437923 173891373 173321190 172767925 172260342 171819344 171464729 171217155 171097145
1081 171097145 171121826 171301308 171638184 172129440 172770157 173556805 174488258 175565338 176788273 178154526
1091 178154526 179657574 181288471 183036079 184890919 186846466 188899212 191048737 193293343 195627136
1100 195627136 198036671 200501156 202995548 205493317 207970066 210402908 212770214 215053616 217247620
1109 217247620 219374332 221501198 223747330 226275616 229265022 232872219 237195606 242254124 247988281
1118 247988281 254281139 260987854 267964134 275083504 282243309 289360104 296365967 303205204 309837704
1127 309837704 316244087 322428169 328414841 334238777 339930649 345503540 350947723 356238022 361346893
1136 361346893 366262283 370994225 375571861 380028191 384383545 388636589 392769547 396762314 400609550
1145 400609550 404328499 407953873 411524544 415068130 418593903 422093391 425545845 428919449 432166214
1154 432166214 435214348 437967453 440320740 442194405 443573303 444533463 445239639 445910645 446760254
1163 446760254 447940292 449507599 451426888 453605347 455939789 458355103 460818100 463327293 465890198
1172 465890198 468502998 471144600 473786049 476404762 478996696 481576080 484164543 486776848 489411392
1181 489411392 492048759 494662399 497230949 499749069 502228203 504689064 507146797 509601402 512033882
1190 512033882 514416046 516725311 518958664 521135445 523287010 525438728 527593727 529729042 531809540
1199 531809540 533808479 535727882 537601662 539480362 541404915 543382835 545382538 547348633 549231339
1208 549231339 551013794 552722321 554412117 556136551 557915764 559722557 561494102 563165092 564703636
1217 564703636 566131020 567512741 568924294 570410271 571958275 573504639 574968414 576294479 577484512
1226 577484512 578594627 579703674 580869026 582094765 583331871 584507103 585567093 586509628 587385635
1235 587385635 588271751 589226837 590258789 591320381 592334442 593237610 594016495 594717255 595423546
1244 595423546 596213570 597118721 598108559 599108124 600040894 600871620 601627083 602380104 603206100 604135704
1254 604135704 605130386 606094971 606922607 607549477 607988434 608325882 608682823 609159050 609791107 610542717
1264 610542717 611332016 612079468 612749710 613367157 613996353 614698830 615492897 616337204 617149734 617852936
1274 617852936 618416824 618879929 619330826 619861450 620517082 621271706 622042809 622737389 623303833 623759918
1284 623759918 624181938 624661446 625254440 625951080 626682014 627357979 627917175 628358536 628740234 629147377
1294 629147377 629646530 630251045 630915565 631561584 632120132 632567673 632938004 633301849 633728333 634248085
1304 634248085 634838219 635438461 635986977 636456146 636868706 637282982 637758942 638323288 638953209 639588318
1314 639588318 640162811 640638809 641026230 641373672 641742935 642176285 642676163 643208084 643721237 644177704
1324 644177704 644572296 644933243 645304489 645720444 646188507 646689682 647194595 647685013 648163681 648647156
1334 648647156 649144592 649640579 650093384 650455246 650700378 650845642 650947189 651073685 651273346 651552582
1344 651552582 651877594 652198639 652477646 652705765 652901001 653093643 653309860 653563461 653858719 654198227
1354 654198227 654586182 655026093 655513000 656026764 656531296 656981354 657335892 657572479 657700043 657762222
1364 657762222 657827301 657967148 658227768 658606644 659048920 659466476 659774857 659929047 659942093 659873962
1374 659873962 659800873 659778900 659825668 659924774 660049667 660188217 660354462 660578918 660888672 661287537 661752625
1385 661752625 662250290 662757721 663280106 663846436 664485626 665194855 665918884 666558838 667007904 667201843
1395 667201843 667155457 666964264 666767883 666691055 666794052 667055206 667394028 667717133 667962036 668117142
1405 668117142 668213806 668303604 668438797 668664474 669019547 669533386 670213928 671027374 671887970 672667770
1415 672667770 673231277 673483047 673408127 673083954 672661209 672313156 672178421 672314148 672680969 673167877
1425 673167877 673648148 674041214 674351501 674659805 675069427 675633316 676303253 676934814 677349396 677422028
1435 677422028 677146530 676647186 676126633 675787125 675760727 676074677 676656570 677362137 678015137 678455200
1445 678455200 678595276 678476715 678289413 678323364 678845367 679945068 681434631 682878647 683767929 683764801
1455 683764801 682887344 681523285 680248489 679543228 679564209 680098953 680728378 681094284 681113663 681010742
1465 681010742 681157684 681826019 683001785 684375916 685504913 686046066 685925446 685353241 684691925
1474 684691925 684264679 684216537 684492874 684928894 685379105 685808487 686295471 686960983 687868500 688958817
1484 688958817 690054626 690933304 691433945 691542740 691416779 691322098 691509094 692080841 692921906 693739548
1494 693739548 694213715 694186707 693791351 693430557 693595581 694607468 696416016 698575363 700426025
1503 700426025 701391373 701239471 700170212 698695908 697389908 696647186 696575012 697042084 697822952 698730927
1513 698730927 699669113 700594025 701448441 702127914 702505722 702495117 702100067 701420975 700619354 699865036
1523 699865036 699296112 698996201 698985596 699218369 699593735 699992981 700340576 700659103 701078110 701771393
1533 701771393 702842407 704220505 705634766 706697006 707061691 706578979 705366364 703758621 702172852
1542 702172852 700953598 700271912 700108719 700312805 700694733 701118622 701558533 702104645 702910538 704092712
1552 704092712 705614166 707213440 708431015 708759460 707867279 705794601 703008423 700261230 698298798
1561 698298798 697549667 697952728 699012833 700056305 700553360 700342484 699649048 698904724 698480835 698483276
1571 698483276 698714142 698802490 698418350 697448425 696043243 694526749 693231125 692348862 691871338 691629791
1581 691629791 691398849 691001740 690369186 689539032 688612213 687694550 686852341 686091690 685363312 684588165
1591 684588165 683692169 682640915 681456528 680208054 678977814 677819443 676732178 675667648 674564514
1600 674564514 673385925 672136078 670844574 669536133 668213882 666871567 665526886 664243393 663109512
1609 663109512 662180099 661413651 660657120 659702072 658393402 656725845 654868622 653096466 651662064
1618 651662064 650680161 650087433 649691162 649272308 648684540 647903214 647018585 646192627 645608902 645426254
1628 645426254 645733566 646501312 647552032 648576965 649227066 649258041 648672028 647771454 647075882 647113724
1638 647113724 648183517 650203705 652741165 655220032 657208176 658634720 659809799 661226578 663245163
1647 663245163 665832138 668514404 670592270 671512070 671196747 670143127 669215622 669237442 670595703
1656 670595703 673077927 676023178 678694458 680656204 681945038 682958679 684154968 685760880 687664185
1665 687664185 689531784 691049423 692112350 692848663 693479385 694138565 694787369 695286026 695562057
1674 695562057 695742340 696138687 697076263 698668594 700684357 702601624 703834000 704011993 703163834
1683 703163834 701708908 700269318 699408035 699422226 700282898 701722107 703399353 705047379 706531372
1692 706531372 707813492 708870163 709631653 709986038 709846191 709230347 708300171 707322083 706565399 706191330
1702 706191330 706193314 706423874 706694107 706891022 707050018 707340546 707969818 709051971 710511093 712065735
1712 712065735 713312836 713881836 713590775 712538223 711079330 709694138 708795853 708571930 708932724
1721 708932724 709597778 710273285 710823822 711337509 712043076 713126907 714559631 716046753 717145767
1730 717145767 717491379 717000351 715935593 714785690 714027481 713904800 714341202 715029602 715631866 715968857
1740 715968857 716095963 716233444 716606445 717295685 718181610 719004059 719496613 719516525 719107895 718473434
1750 718473434 717881393 717556458 717603302 717989349 718577118 719187622 719663315 719909821 719915009 719744797
1760 719744797 719526672 719418106 719566269 720055695 720864487 721846390 722761536 723352356 723440552 723003616
1770 723003616 722187042 721247635 720451813 719978256 719870682 720053864 720390244 720740509 721001205 721113968
1780 721113968 721065674 720893326 720691147 720598145 720750351 721208344 721897430 722607727 723071060 723087463
1790 723087463 722634583 721892624 721166458 720738754 720733719 721065292 721492538 721752014 721689758 721327057
1800 721327057 720832367 720423813 720259247 720367813 720652313 720950851 721117783 721086807 720885544 720606842
1810 720606842 720354996 720198135 720149002 720177307 720240631 720313187 720397110 720514832 720690842 720937195 721248856
1821 721248856 721604919 721971130 722300491 722537460 722632294 722565231 722365494 722111740 721901245 721806641
1831 721806641 721844559 721979218 722164841 722393723 722714081 723195267 723857880 724616470 725282669 725639801
1841 725639801 725553055 725049820 724319000 723624039 723179550 723058243 723181305 723385925 723526154 723543777
1851 723543777 723476028 723403778 723385239 723415527 723436432 723383560 723238754 723050919 722917404 722931366 723125992
1862 723125992 723444443 723752365 723890228 723743286 723295441 722641296 721948471 721387482 721062927 720979538
1872 720979538 721057816 721184082 721268311 721274872 721220093 721144714 721086044 721065521 721092224 721170731 721300125 721464920
1884 721464920 721629562 721744843 721772614 721707230 721584091 721461105 721387177 721377182 721409302 721444778 721457138
1895 721457138 721446533 721435699 721451187 721506729 721601257 721726608 721875687 722042542 722213593 722363663 722463913
1906 722463913 722503281 722506180 722530518 722642136 722876053 723211212 723573227 723870926 724039383 724071045 724010315
1917 724010315 723923416 723859482 723829422 723810196 723773270 723707657 723632431 723583450 723589859 723654938 723750992 723835526
1929 723835526 723873520 723859024 723820496 723808060 723870392 724029770 724268036 724530945 724748383 724862823 724852600
1940 724852600 724739990 724579163 724432373 724342422 724320068 724346466 724390945 724432602 724471741 724525223 724612656
1951 724612656 724736633 724876938 724997177 725064545 725069580 725034103 725001907 725018234 725105057 725249405 725409851
1962 725409851 725535660 725591965 725574188 725507812 725432587 725381241 725366135 725376968 725391617 725393524 725381393 725370407
1974 725370407 725381699 725427780 725502396 725582886 725641174 725660706 725647278 725629349 725643539 725715179 725841293 725989304
1986 725989304 726108475 726154633 726110153 725992889 725847244 725723343 725652695 725638199 725656128 725674438 725671539
1997 725671539 725646667 725618973 725612259 725640030 725696716 725759811 725803833 725814819 725799103 725781708 725793304 725854874
2009 725854874 725966492 726106567 726241913 726343536 726397476 726410370 726402283 726395645 726405029 726432343 726471176 726512985
2021 726512985 726554108 726596146 726641846 726690521 726735306 726765976 726776047 726767960 726754608 726754837 726784286 726847992
2033 726847992 726937561 727034988 727122345 727190628 727244644 727299728 727373428 727473907 727595139 727718048 727821045
2044 727821045 727892227 727936401 727973709 728028336 728114319 728227005 728344727 728442383 728505936 728542786 728578415
2055 728578415 728642731 728751297 728895187 729043427 729158401 729215469 729216766 729190826 729177856 729208832 729290771
2066 729290771 729402084 729506607 729571915 729588165 729572906 729562073 729588928 729666901 729780197 729892807 729969940
2077 729969940 729997330 729992599 729997025 730053329 730181274 730364075 730554276 730697174 730758820 730745010 730698929
2088 730698929 730679703 730731201 730859375 731028976 731182938 731272736 731285172 731248245 731216125 731239471 731337891
2099 731337891 731490097 731646042 731754608 731791306 731771851 731741562 731751785 731829987 731965790 732116241 732228546
2110 732228546 732268753 732239075 732176437 732133255 732149048 732231522 732353516 732469025 732538986 732553406 732535172
2121 732535172 732528458 732572021 732677536 732821045 732953720 733029022 733026199 732963867 732890778 732860718 732905197 733015976
2133 733015976 733149414 733250046 733279572 733238373 733166428 733121719 733150558 733263321 733428421 733589630 733694611
2144 733694611 733722839 733694763 733658524 733663864 733734741 733857727 733991241 734090729 734132462 734126968 734110870 734126816
2156 734126816 734197845 734316254 734447937 734551315 734599762 734594727 734564743 734549484 734579773 734662094 734775925
2167 734775925 734885101 734955902 734974518 734953918 734926834 734930115 734985504 735089874 735215530 735325470 735391312
2178 735391312 735407181 735391006 735373840 735383453 735428848 735498199 735565567 735607605 735615463 735600204 735584869 735592041
2190 735592041 735631638 735696411 735766144 735820541 735848236 735851746 735845566 735845947 735863953 735899429 735942917 735981445 736005173
2203 736005173 736011505 736005554 735997086 735996628 736011276 736043167 736088791 736140366 736187515 736220856 736234283 736228485 736210480
2216 736210480 736191711 736183777 736191711 736212997 736237946 736254425 736255646 736243591 736228943 736225739 736243515 736281815 736328735
2229 736328735 736366119 736379089 736363220 736326904 736287689 736263199 736261826 736278305 736296082 736296310 736267166 736210327
2241 736210327 736141510 736081619 736047592 736043472 736057816 736070633 736063995 736031418 735982742 735937576 735914993 735919876
2253 735919876 735938873 735945816 735915146 735836945 735724411 735608215 735521927 735483093 735483398 735492325 735473251 735401993
2265 735401993 735281296 735139542 735017242 734947510 734938660 734970932 735004959 735002975 734949036 734859390 734779892 734765091
2277 734765091 734851990 735040741 735288773 735527267 735689163 735736542 735673294 735535812 735368729 735200119
2287 735200119 735028305 734829865 734579544 734271164 733925476 733580856 733272552 733013687 732789383 732564240
2297 732564240 732302628 731986389 731623230 731240616 730867691 730514221 730156784 729740982 729202423 728497391
2307 728497391 727631607 726670227 725720596 724892654 724251175 723782043 723388672 722920227 722223892 721196976
2317 721196976 719825974 718194046 716456985 714792252 713336411 712134094 711121292 710156631 709090271
2326 709090271 707842712 706449127 705043869 703789139 702788620 702038498 701443863 700884476 700278320
2335 700278320 699592285 698794022 697795334 696455765 694687271 692617950 690702896 689675827 690300903
2344 690300903 693014297 697634354 703304367 708733673 712638855 714184494 713221130 710231857 706045685
2353 706045685 701486816 697126846 693226471 689832382 686925278 684516983 682659454 681393661 680702820
2362 680702820 680510330 680724258 681287766 682198486 683486481 685168991 687214508 689541550 692044830
2371 692044830 694636230 697271118 699953842 702720947 705613556 708649673 711806641 715013885 718163757
2380 718163757 721134033 723817978 726149673 728111496 729724884 731026764 732049789 732815857 733344421
2389 733344421 733667831 733840027 733927994 733993683 734074173 734173355 734270859 734342041 734375458 734381638 734384537 734407883
2401 734407883 734460602 734530563 734591827 734618073 734596786 734536896 734464874 734412003 734398880 734423523 734462738 734482803
2413 734482803 734459305 734391022 734302139 734231110 734209595 734244537 734313889 734376831 734395828 734355316 734269028 734172134
2425 734172134 734101562 734076614 734089966 734114456 734117889 734082947 734014816 733938141 733883438 733867950 733886795 733913879
2437 733913879 733916550 733873291 733786087 733680649 733593597 733552322 733561249 733597565 733623810 733606796 733535690 733426514
2449 733426514 733314819 733235321 733205338 733215179 733234711 733229980 733180847 733091660 732987671 732901001 732853012 732843246
2461 732843246 732849579 732841339 732795639 732709961 732604065 732508469 732448502 732430267 732437744 732441254 732414703 732350082
2473 732350082 732261887 732179413 732130814 732127151 732155151 732184296 732181320 732128830 732033463 731922531 731830978 731783066
2485 731783066 731781769 731807861 731831207 731825714 731782455 731712265 731639252 731587143 731567307 731574020 731588287 731588364 731561813
2498 731561813 731510086 731447144 731390152 731348953 731321106 731293411 731250458 731185226 731103668 731024628 730969467 730952225
2510 730952225 730972900 731016922 731062851 731092529 731097946 731083527 731060867 731040878 731028900 731021194 731009521 730985565
2522 730985565 730946655 730896835 730845490 730801392 730768890 730744400 730718536 730680466 730623398 730548782 730465622 730387192
2534 730387192 730324860 730282059 730254288 730230789 730201035 730160294 730111542 730063019 730024490 730000381 729987869 729977875
2546 729977875 729958878 729922638 729867401 729798431 729725189 729657059 729599762 729554749 729519577 729492264 729471512 729457169
2558 729457169 729448929 729443817 729435959 729419403 729390488 729351883 729310379 729274063 729247513 729228897 729211273 729186935
2570 729186935 729151535 729107590 729061127 729018936 728983841 728954163 728925323 728894348 728861008 728827667 728796539 728766708
2582 728766708 728734741 728696671 728651657 728604050 728561325 728530731 728515930 728513718 728517303 728518829 728512878 728498688 728478622
2595 728478622 728456497 728435440 728415527 728394241 728367691 728331833 728285675 728231964 728177795 728132935 728105240 728096771
2607 728096771 728101807 728107376 728099823 728070450 728020401 727959671 727901688 727854691 727817307 727779160 727727737 727656631
2619 727656631 727571640 727489166 727427826 727400055 727404709 727427826 727450485 727456818 727441559 727409515 727370758 727333450
2631 727333450 727298584 727259445 727206879 727134094 727042923 726942596 726848526 726774521 726727753 726705170 726694794 726680298
2643 726680298 726648254 726594238 726524124 726452408 726394196 726358490 726343765 726338882 726328888 726302795 726257782 726200562
2655 726200562 726142120 726092377 726054840 726026459 725999832 725968246 725928268 725881348 725831909 725784378 725741806 725704880
2667 725704880 725672836 725643539 725615234 725586166 725556030 725526276 725499191 725477829 725463181 725451965 725437469 725409927
2679 725409927 725361481 725290222 725202026 725108414 725022202 724951553 724897766 724855423 724817810 724779968 724742203 724707870
2691 724707870 724679337 724654312 724625397 724583130 724520264 724436798 724340897 724245529 724165649 724111176 724085159 724081573
2703 724081573 724088287 724089966 724074631 724037170 723981247 723917618 723858490 723810959 723773956 723738632 723695068 723639297
2715 723639297 723576889 723522568 723490982 723489151 723509903 723534851 723542175 723517609 723461227 723387909 723319473 723275070
2727 723275070 723260498 723266525 723271790 723253403 723198013 723108139 723001099 722902069 722831192 722794189 722779846 722766571
2739 722766571 722734909 722678223 722606888 722541809 722501907 722491608 722496643 722491837 722455139 722380676 722283783 722192841
2751 722192841 722133942 722115402 722123489 722127609 722098007 722020645 721905670 721782379 721683807 721630478 721619568 721627350
2763 721627350 721622543 721581802 721502380 721403580 721315231 721262283 721250839 721264725 721272659 721244125 721164703 721042786
2775 721042786 720905533 720783691 720696487 720641327 720595932 720532379 720433121 720303650 720171204 720072098 720031967
2786 720031967 720050430 720099487 720134201 720113754 720021973 719872513 719702454 719553604 719451752 719396667 719364014
2797 719364014 719320145 719239349 719116592 718968658 718823853 718706894 718627396 718575134 718527222 718460541 718364639
2808 718364639 718246231 718125839 718023758 717948456 717889099 717821045 717719650 717575607 717403259 717235718
2818 717235718 717108078 717039185 717019653 717015457 716984406 716896973 716750946 716569824 716388855 716236115 716116714
2829 716116714 716014404 715902176 715760269 715587845 715402908 715229492 715081940 714952774 714813766 714628143
2839 714628143 714367828 714026718 713622513 713186646 712747955 712319107 711891785 711444473 710957489 710426178
2849 710426178 709869690 709325333 708835754 708433533 708128204 707904358 707729950 707569580 707399521 707215729
2859 707215729 707031631 706867981 706739426 706644211 706564178 706472931 706350250 706192474 706014099 705839157
2869 705839157 705686951 705559769 705442734 705312042 705150604 704960480 704764023 704593506 704475555 704417419
2879 704417419 704405365 704411697 704412003 704395065 704366913 704342651 704334793 704342880 704352493 704342117 704293900 704201736 704073868
2892 704073868 703925781 703771744 703618622 703462601 703295059 703108521 702902374 702684402 702466507 702259674
2902 702259674 702069473 701894226 701728287 701565628 701403809 701242981 701083908 700922089 700745163 700532761
2912 700532761 700262146 699917984 699497452 699015274 698498459 697978058 697480316 697020874 696605148 696235046
2922 696235046 695914078 695650864 695455551 695332947 695277634 695273361 695299759 695342331 695399323 695482788 695611725
2933 695611725 695801468 696054687 696360245 696698837 697052155 697409592 697769318 698132324 698494949 698843384
2943 698843384 699155045 699406281 699582596 699684448 699726944 699732132 699719849 699698792 699664612 699603653 699500351
2954 699500351 699344559 699136581 698887177 698614502 698340073 698083115 697857132 697669220 697521210 697413559
2964 697413559 697349548 697336502 697385025 697503815 697694092 697946777 698245163 698570709 698911362 699262772
2974 699262772 699627914 700008621 700399704 700786591 701149216 701471024 701746140 701981277 702193222 702400436
2984 702400436 702615280 702839508 703063965 703273544 703452072 703587494 703675461 703719101 703728409 703716125 703694077
2995 703694077 703671494 703653107 703641357 703636169 703636703 703639832 703641434 703636856 703625107 703611145 703606415 703624191 703670807
3008 703670807 703738632 703805771 703841553 703820496 703732605 703588486 703413773 703237534 703078003 702937775 702805710
3019 702805710 702666626 702511368 702343292 702176285 702027435 701908493 701820755 701754532 701695251 701630020 701551819
3030 701551819 701461487 701364594 701266632 701170654 701076126 700982285 700891342 700808258 700737991 700680237 700625229 700554962
3042 700554962 700449371 700296631 700100708 699882889 699674911 699505081 699386520 699311371 699253922 699182739
3052 699182739 699074707 698924789 698746719 698565521 698405457 698279343 698184357 698106003 698026047 697931213 697816772
3063 697816772 697684937 697539520 697381973 697211685 697029800 696844940 696673737 696536331 696446838 696404724
3073 696404724 696392365 696381149 696343460 696262054 696136932 695979691 695805817 695625687 695442200 695253601 695060120
3084 695060120 694867020 694683228 694515076 694359894 694205399 694034195 693833237 693601379 693351364 693103333
3094 693103333 692876358 692679291 692508087 692350082 692190781 692021408 691842728 691662216 691490707 691335602
3104 691335602 691197586 691070023 690940857 690797577 690633545 690451508 690264206 690090103 689944534 689831467
3114 689831467 689738464 689638443 689500198 689300079 689031906 688708725 688357162 688006592 687679367 687385101
3124 687385101 687121277 686876526 686636429 686388702 686125946 685849915 685570602 685305176 685070953 684877167
3134 684877167 684718246 684572296 684408493 684197845 683925171 683595657 683231964 682865677 682525940 682231445
3144 682231445 681986313 681783676 681607971 681440277 681261368 681054535 680808563 680518723 680188599 679828339
3154 679828339 679450836 679069366 678693390 678328629 677977982 677642517 677322693 677018204 676726685 676442871
3164 676442871 676160049 675870514 675568085 675249252 674912720 674559174 674189835 673806229 673410645 673006439
3174 673006439 672598648 672192993 671793671 671402969 671019592 670640793 670263519 669885330 669504852 669120483
3184 669120483 668729782 668329086 667915726 667488937 667050552 666603241 666148758 665686188 665213089 664728470
3194 664728470 664234924 663739548 663252411 662781754 662331085 661896591 661468811 661035461 660584869 660109177
3204 660109177 659605560 659077835 658535995 657994080 657466736 656965408 656493225 656044693 655606537 655162506
3214 655162506 654698944 654208450 653692322 653158798 652619553 652084732 651558990 651039658 650519943 649992752
3224 649992752 649457932 648924866 648409576 647926636 647480164 647057190 646631622 646174088 645665512 645105743
3234 645105743 644512787 643912506 643326797 642764130 642220230 641685028 641151962 640623169 640107040 639612312
3244 639612312 639141464 638687630 638239365 637785759 637322578 636852722 636382675 635917244 635455437 634991302
3254 634991302 634517860 634032784 633540802 633052444 632578392 632124405 631689339 631267853 630856705 630459900
3264 630459900 630087509 629749260 629444656 629156990 628855591 628506393 628085976 627592468 627045021 626476059
3274 626476059 625917664 625390587 624901009 624442596 624003792 623572197 623137512 622692184 622231255 621754341
3284 621754341 621265907 620773315 620283928 619799614 619314346 618816605 618293495 617736702 617145500 616524124
3294 616524124 615879784 615219383 614550476 613883324 613232460 612613029 612033768 611488762 610954552 610392876
3304 610392876 609762344 609032593 608194351 607262917 606272202 605263023 604271164 603318367 602409973 601537323
3314 601537323 600683746 599831581 598966942 598082047 597175026 596247635 595301552 594336739 593349800 592335739
3324 592335739 591290703 590214386 589111404 587990761 586862679 585736580 584619293 583514175 582421074
3333 582421074 581335945 580250244 579150276 578019066 576840286 575603561 574309120 572968941 571605225
3342 571605225 570243874 568908043 567612114 566357193 565130501 563907471 562658157 561355667 559986115
3351 559986115 558554001 557082520 555605354 554153557 552743301 551370850 550015831 548653412 547267532
3360 547267532 545858765 544443588 543044624 541677437 540341110 539015465 537668533 536268654 534797707
3369 534797707 533259659 531680489 530100250 528560104 527089577 525698738 524378395 523106918 521861496
3378 521861496 520626144 519396591 518178406 516983299 515823326 514708824 513646202 512637787 511679344
3387 511679344 510759888 509861488 508963051 508047028 507107010 506151657 505203819 504291344 503434601 502634850
3397 502634850 501870308 501102524 500290833 499410286 498464203 497484398 496519203 495613785 494794006 494058151
3407 494058151 493382492 492735367 492090836 491437607 490777626 490118866 489468040 488827019 488192673 487561913
3417 487561913 486935425 486319618 485727272 485176010 484683990 484265404 483923187 483646851 483413582 483197937
3427 483197937 482982521 482766609 482564697 482396660 482272453 482183800 482106400 482013855 481893539 481756248
3437 481756248 481631584 481552544 481537323 481580887 481658783 481743050 481818581 481891670 481985931 482128868 482336617
3448 482336617 482606468 482919464 483251801 483586731 483921509 484265289 484631348 485026932 485449905 485890770
3458 485890770 486339302 486791954 487253456 487734909 488247185 488794136 489369583 489956245 490529594 491064491
3468 491064491 491543770 491967888 492359352 492758331 493209610 493742790 494355927 495013466 495659943 496245537
3478 496245537 496749458 497187119 497599602 498030128 498503494 499019852 499565086 500125275 500698967 501294365
3488 501294365 501919289 502572479 503243446 503921127 504602966 505294762 506001587 506714363 507406464 508042107
3498 508042107 508594971 509063835 509473915 509863586 510265617 510694199 511147499 511620445 512117386 512654991
3508 512654991 513252182 513915176 514627953 515358124 516071701 516751175 517402611 518049583 518715897 519408531
3518 519408531 520109901 520783386 521388931 521900635 522317886 522666130 522989082 523335342 523745995 524245262
3528 524245262 524834404 525492630 526182098 526860619 527497559 528089218 528663750 529269066 529947815 530709152
3538 530709152 531513367 532282867 532936516 533428726 533773651 534035950 534295502 534605598 534970818 535358238
3548 535358238 535730667 536076927 536420479 536799927 537241211 537744904 538299294 538905296 539587708 540372009
3558 540372009 541236916 542073822 542693672 542893677 542556534 541728630 540626869 539562492 538818169 538540268
3568 538540268 538699303 539130058 539621162 540004044 540201530 540229034 540166779 540123978 540206490 540483475 540949860
3579 540949860 541497421 541917000 541954575 541409721 540234528 538576469 536730804 535015144 533629684
3588 533629684 532575073 531672134 530669518 529377136 527755623 525924149 524095879 522489967 521263618
3597 521263618 520485039 520135651 520118179 520260162 520320740 520018425 519085770 517334557 514696884 511220131
3607 511220131 507008057 502136574 496580086 490185280 482711639 473938828 463820267 452642593
3615 452642593 441127510 430409851 421850090 416701393 415731354 418950157 425579033 434300003
3623 434300003 443695030 452686501 460788231 468074341 474918327 481666489 488415833 494985847 501051254
3632 501051254 506322937 510669212 514134140 516884232 519140854 521128426 523029213 524919930 526697464
3641 526697464 528046417 528508759 527668304 525378380 521908340 517905998 514170609 511344147 509683037
3650 509683037 509025497 508958206 509071693 509158249 509258804 509567795 510279961 511478233 513104248 514992790
3660 514992790 516920319 518640060 519908524 520529861 520420837 519661369 518482475 517174606 515954475
3669 515954475 514869995 513808098 512605629 511192894 509674416 508290138 507280045 506736679 506529503
3678 506529503 506335449 505736351 504317284 501718941 497653160 491924019 484488297 475533333 465515480
3687 465515480 455100479 445003624 435798950 427792091 421022758 415385437 410790215 407274513
3695 407274513 405017357 404277573 405311508 408321266 413430786 420661774 429881210 440738678 452647171
3704 452647171 464862289 476661034 487551727 497413063 506483498 515202293 523980293 533012619
3712 533012619 542213249 551280632 559838448 567573318 574314880 580049210 584887962 589023819 592689590
3721 592689590 596124306 599540710 603094711 606856308 610782280 614698830 618304634 621222305 623117485
3730 623117485 623863411 623688889 623207016 623259010 624590683 627497749 631628151 636081123 639790993
3739 639790993 642013321 642655334 642259598 641651001 641450958 641749649 642126999 641997986 641058807 639548035
3749 639548035 638160210 637669029 638495293 640479889 642987061 645260468 646807861 647598953 647988586
3758 647988586 648447952 649279022 650472641 651756668 652771072 653252945 653140335 652574005 651829987
3767 651829987 651229858 651055603 651475372 652486954 653897095 655366135 656523514 657113419 657103348
3776 657103348 656689911 656192780 655891266 655897369 656136703 656438065 656672058 656841812 657073288 657521896
3786 657521896 658263397 659251556 660360260 661476364 662560959 663633575 664689484 665621185 666216049
3795 666216049 666252518 665634308 664474869 663061218 661714172 660633011 659833298 659217758 658732071
3804 658732071 658485947 658737946 659740143 661535416 663847427 666150894 667890472 668721848 668631744
3813 668631744 667872543 666773987 665560303 664293976 662965164 661636200 660521851 659929962 660097198
3822 660097198 661035538 662500153 664107361 665532455 666656036 667569809 668438797 669319077 670053711
3831 670053711 670322189 669814987 668431625 666377869 664103851 662116776 660778580 660204544 660316162
3840 660316162 661003494 662276306 664280701 667141724 670707626 674364929 677085419 677757568 675682449
3849 675682449 670997162 664777527 658720551 654516678 653198853 654772720 658300858 662378311 665747604
3858 665747604 667752991 668446274 668350525 668062286 667919540 667892914 667706451 667081223 665944290 664498749
3868 664498749 663137207 662263412 662121201 662709351 663807831 665088196 666243668 667079086 667531738
3877 667531738 667630920 667440720 667027435 666460571 665834045 665263596 664851227 664629288 664534531 664446182
3887 664446182 664279709 664077759 664028702 664382401 665298157 666715012 668324280 669667892 670314484 670018082
3897 670018082 668792725 666881027 664657745 662520294 660805588 659739685 659412460 659772949 660654068
3906 660654068 661823883 663054657 664171524 665065079 665669327 665937729 665845261 665422287 664782715 664111176
3916 664111176 663595352 663343582 663339462 663470840 663613815 663711472 663791046 663911591 664085846 664241333 664253693
3927 664253693 664026718 663563995 662981186 662454987 662143250 662123795 662374954 662795639 663242950 663576736
3937 663576736 663702011 663603439 663353500 663078232 662888031 662811813 662779465 662674026 662422256 662056122
3947 662056122 661698303 661476440 661434555 661508636 661584625 661588058 661528778 661466446 661433182 661390076 661261215
3958 661261215 661015472 660718002 660490189 660409775 660434418 660429611 660282898 660009079 659741974 659610901 659607468
3969 659607468 659570770 659322433 658840637 658310623 657981720 657937698 657987976 657802200 657201080 656348267
3979 656348267 655645370 655373764 655387268 655161896 654228363 652648239 651072006 650212936 650094223 649747314
3989 649747314 647806396 643723221 638631554 634847488 633810158 633511238 627240257 605081978 558070335
3998 558070335 483124161 386026154
4000 386026154
##END=$$ End of the data block
