##TITLE=$$ Begin of the data block
##JCAMP-DX=5.00 $$ ACD/SpecManager v 10.08
##SPECTROMETER/DATA SYSTEM=16PC
##DATE=28 May 2013 09:56:26
##DATA TYPE=INFRARED SPECTRUM
##DATA CLASS=XYDATA
##ORIGIN=
##OWNER=
##NPOINTS=3601
##FIRSTX=400.00000000
##LASTX=4000.00000000
##MAXX=4000.00000000
##MINX=400.00000000
##MAXY=74.91805267
##MINY=19.66628265
##XFACTOR=1.0000000000
##YFACTOR=0.000000100000000
##FIRSTY=29.98866272
##DELTAX=1.00000000
##XUNITS=1/CM
##YUNITS=TRANSMITTANCE
##XYDATA=(X++(Y..Y))
400B99886627P3680382N7915878L7222138J7582702L501168l495751m797935l353081
408D78142128j907806j811104k871514m085769m604836m304123l703766l449859l802185
417D47601166m491196m984207m910851m329223l657761l356056l599587m164772m579773
426D09527740m414291l513336k046127l73154J150513K317390L091545L543053L762894
435D13046227L809509L700905L429565K978478K333374J498260N13573n32608j525154
444D29252129k365075l019828l540039m027367m569778n188218n829734o414223o896477
453C87401390p301559p702790q164673q688354r202080r600639r802094r779472r546776
462C07612953r113769q447667p476291o131935m409294k393761k44732J861038L790322
$$ y = [299886627, 373567009, 431482887, 468705025, 486287727, 489788895, 486293144, 481495209, 478142128, 476234322, 474423218, 471551704, 467465935, 462861099, 458556976, 454853210, 451403351, 447601166, 443109970, 438125763, 433214912, 428885689, 425227928, 421871872, 418272285, 414107513, 409527740, 405113449, 401600113, 399553986, 399180832, 400331345, 402648735, 405740280, 409283333, 413046227, 416855736, 420556641, 423986206, 426964684, 429298058, 430796318, 431309891, 430777283, 429252129, 426887054, 423867226, 420327187, 416299820, 411730042, 406541824, 400712090, 394297867, 387401390, 380099831, 372397041, 364232368, 355544014, 346341934, 336741295, 326939201, 317159729, 307612953, 298499184, 290051517, 282575226, 276443291, 272033997, 269640236, 269395504, 271256542, 275046864]
471B75046864N485782O960049Q260841R429531J0474511J1365318J2044334J2448044
479C51515274J2533150J2298698J1796761J1120643J0373574R625625Q885155Q102760
487D36251640P210274O175842N037995L899383K877426K043114J384239Q17910K41775
496D65939598m06647j116867j820411k434311k909127l248100l495521l701783l897209
505D42909622m083328m246979m379959m490280m598618m724731m875450n041352n204353
514D01264572n345917n456466n535012n589103n630493n671463n723343n790596n867043
523C50655136n936088n972100n947418n839004n630990n316467m896049m375458l765011
532C02976551l077106k321225j502742o23112L11832J278992K234535L115216L860492
$$ y = [275046864, 280532646, 287492695, 295753536, 305183067, 315657578, 327022896, 339067230, 351515274, 364048424, 376347122, 388143883, 399264526, 409638100, 419263725, 428148880, 436251640, 443461914, 449637756, 454675751, 458575134, 461452560, 463495674, 464879913, 465697823, 465939598, 465532951, 464416084, 462595673, 460161362, 457252235, 454004135, 450508614, 446806831, 442909622, 438826294, 434579315, 430199356, 425709076, 421110458, 416385727, 411510277, 406468925, 401264572, 395918655, 390462189, 384927177, 379338074, 373707581, 368036118, 362312775, 356522179, 350655136, 344719048, 338746948, 332799530, 326960526, 321329536, 316013069, 311117020, 306741562, 302976551, 299899445, 297578220, 296075478, 295452366, 295764198, 297043190, 299277725, 302392941, 306253433]
541C06253433M433899M840298N121288N334511N522537N694313N825539N881958N845718
550C54753494N733643N591163N471116N405616N394097N406952N408096N377502N322037
559D03863716N271263N257340N295105N372009N452614N495415N473022N386276N261956
568D52128716N138626N044670M983940M931297M847946M705849M504433M277229M073944
577D94636650L933830L864251L835830L800698L721160L594742L454705L349914L312836
586E27504616L336181L372040L358231L252449L056793K820816K614594K491569K459564
595E54266853K476464K472267K387314K207641J975899J773033J680527J738243J921005
604E72899246K149086K325554K383537K318001K185860K069282K029038K069282K136879
$$ y = [306253433, 310687332, 315527630, 320648918, 325983429, 331505966, 337200279, 343025818, 348907776, 354753494, 360487137, 366078300, 371549416, 376955032, 382349129, 387756081, 393164177, 398541679, 403863716, 409134979, 414392319, 419687424, 425059433, 430512047, 436007462, 441480484, 446866760, 452128716, 457267342, 462312012, 467295952, 472227249, 477075195, 481781044, 486285477, 490562706, 494636650, 498570480, 502434731, 506270561, 510071259, 513792419, 517387161, 520841866, 524191780, 527504616, 530840797, 534212837, 537571068, 540823517, 543880310, 546701126, 549315720, 551807289, 554266853, 556743317, 559215584, 561602898, 563810539, 565786438, 567559471, 569239998, 570978241, 572899246, 575048332, 577373886, 579757423, 582075424, 584261284, 586330566, 588359604, 590428886, 592565765]
613E92565765K157975K087059J940040J788750J716461J765137J901016K029038K043342
622F09994583J887818J592292J255265R91172Q66242Q62922Q93555Q54111O82869L98598
632F20279427Q7699j40724k11906j22376O2180K44484L43780L35617K58446J89743
642F21326370K01950L20702N08652O80885P49168O71463M79889K69509J49765J79176
652F25537529L28140M86870N28030L89901J21231j31836k13928o5155K15683M02336
662F27598801K56157l27988j234398k152595k717972k692833k092629j185493l63198
671F15087852M5968p5684o03943j264915j787796k032967k032318j929131j873665
680F03533401j936531k088890k246284k338066k354889k344246k369194k454834k564812
$$ y = [592565765, 594723740, 596810799, 598750839, 600539589, 602256050, 604021187, 605922203, 607951241, 609994583, 611882401, 613474693, 614729958, 615721130, 616587372, 617450294, 618343849, 619197960, 619880829, 620279427, 620367126, 620226402, 620014496, 619892120, 619954300, 620198784, 620542564, 620878181, 621136627, 621326370, 621528320, 621849022, 622357674, 623038559, 623787727, 624459190, 624939079, 625208588, 625358353, 625537529, 625865669, 626352539, 626880569, 627270470, 627391701, 627259865, 627045937, 626980782, 627196465, 627598801, 627854958, 627526970, 626292572, 624139977, 621422005, 618729172, 616636543, 615451050, 615087852, 615133820, 615058136, 614454193, 613189278, 611401482, 609368515, 607336197, 605407066, 603533401, 601596870, 599507980, 597261696, 594923630, 592568741, 590224495, 587855301, 585400467, 582835655]
689E82835655k611770k496262k144814j534996o96334L03001J372719K413673L335457
698E80776329M071350M593735M919777N102691N207062N283547N352859N405388N418091
707F26130829N365295N226479M976997M582749M005890L230133K294464J312790M62875
716F57588501o6071j46789K20947Q88596J594467K050629K048339J541291O70166k82212
726F66107864r94415j227264r18351k06146O20880J236115J402054J055298L18832
735F67394867n65872j349488j879882k149735k270889k393036k610550k909927l178940
744F48086548l270645l087540k635155k025032j419525r56955o89773n72243m97322
753F32932358l60947j18942J91727M81834O62193O95763O14891M97818M17404L92799
$$ y = [582835655, 580223885, 577727623, 575582809, 574047813, 573351479, 573654480, 575027199, 577440872, 580776329, 584847679, 589441414, 594361191, 599463882, 604670944, 609954491, 615307350, 620712738, 626130829, 631496124, 636722603, 641699600, 646282349, 650288239, 653518372, 655812836, 657125626, 657588501, 657522430, 657375641, 657596588, 658485184, 660079651, 662130280, 664178619, 665719910, 666390076, 666107864, 665113449, 663886185, 662967834, 662761688, 663382568, 664618683, 666020737, 667076035, 667394867, 666828995, 665479507, 663599625, 661449890, 659179001, 656785965, 654175415, 651265488, 648086548, 644815903, 641728363, 639093208, 637068176, 635648651, 634691696, 634001923, 633429680, 632932358, 632571411, 632452469, 632644196, 633126030, 633788223, 634483986, 635098877, 635596695, 636014099, 636406898]
763F36406898L75290K75002J6899m10004r34715j436691j803131j984329k014962j984825
773F26505432j981239k032738k088852k049599j826820j401863q51593l19977M5815
782F13998566J61705M2724k11525m72412o49719p31163p81746q91647j115837j423111
792F07925835j694222j764374j493187q26110J82190J391716K637634L790741M792061
801F14942284N642318O359825O936074P314567P413636P173309O605987N813294M954452
810F73155746M186936L600616L189850K871475K543412K147827J702499J287003R91592
819F95676956Q57773Q49533Q69293Q10700O15997L06625l2730l02505m45404m75693
829F98730545m64706m94995o05622p69119r04770r30023q12149n95169l82843k86637
$$ y = [636406898, 636782188, 637057190, 637074089, 636664085, 635729370, 634292679, 632489548, 630505219, 628490257, 626505432, 624524193, 622491455, 620402603, 618353004, 616526184, 615124321, 614272728, 613952751, 613998566, 614160271, 614202995, 613991470, 613519058, 612869339, 612138176, 611356430, 610464783, 609348946, 607925835, 606231613, 604467239, 602974052, 602147942, 602330132, 603721848, 606359482, 610150223, 614942284, 620584602, 626944427, 633880501, 641195068, 648608704, 655782013, 662388000, 668201294, 673155746, 677342682, 680943298, 684133148, 687004623, 689548035, 691695862, 693398361, 694685364, 695676956, 696534729, 697384262, 698253555, 699064255, 699680252, 699986877, 699954147, 699651642, 699206238, 698730545, 698265839, 697770844, 697165222, 696396103, 695491333, 694561310, 693749161, 693153992, 692771149, 692484512]
839F92484512l68347o10046r21784j191864j342773j367188j324691j304779j371842
848F82681198j533813j738282j908493j986541j967774j901474j861420j903152k035294
857F65844955k214355k374496k464829k478714k455444k457276k531433k686844k891769
866F43289795l097000l266106l394127l501434l610497l716964l780709l742103l556595
875F11624260l229446k825547k451172k211113k165603k310906k587661k915917l231697
884E87695198l510475l764877m024468m309730m619828m934425n230789n499764n753402
893E46047440o018906o323204o676750p068520p469635p847595q183060q476906q746185
902D79236679r006615r248428r416008r403152r071923q291244o987038n180550l002395
$$ y = [692484512, 692116165, 691506119, 690584335, 689392471, 688049698, 686682510, 685357819, 684053040, 682681198, 681147385, 679409103, 677500610, 675514069, 673546295, 671644821, 669783401, 667880249, 665844955, 663630600, 661256104, 658791275, 656312561, 653857117, 651399841, 648868408, 646181564, 643289795, 640192795, 636926689, 633532562, 630031128, 626420631, 622703667, 618922958, 615180855, 611624260, 608394814, 605569267, 603118095, 600906982, 598741379, 596430473, 593842812, 590926895, 587695198, 584184723, 580419846, 576395378, 572085648, 567465820, 562531395, 557300606, 551800842, 546047440, 540028534, 533705330, 527028580, 519960060, 512490425, 504642830, 496459770, 487982864, 479236679, 470230064, 460981636, 451565628, 442162476, 433090553, 424799309, 417812271, 412631721, 409629326]
911D09629326o66809J579017L520318N023803O057511O671600O960831P017936O907997
920D52701530O660958O287918N797691N209961M554367L864136L170547K502709J895409
929D92645226J389389J025352Q26798P84378Q54187R73816J093368J198769J312027
938E02103310J464843J653023J809654J816178J556091R92889K19994n46989j047097
947E10021896j090850o58913P2060P90672J177063J030159L37562p42797j968575l119354
957E05848923m064598m771080n257683n543518n623207n486260n160141m739418m374580
966D60828438m215851m344673m731407n243454n705414n975952o006089n847816n617332
975D13140450n433426n367279n423813n558052n710602n839348n933228o005821o077575
$$ y = [409629326, 408962517, 410541534, 414061852, 419085655, 425143166, 431814766, 438775597, 445793533, 452701530, 459362488, 465650406, 471448097, 476658058, 481212425, 485076561, 488247108, 490749817, 492645226, 494034615, 495059967, 495886765, 496671143, 497525330, 498499146, 499592514, 500791283, 502103310, 503568153, 505221176, 507030830, 508847008, 510403099, 511395988, 511615982, 511068993, 510021896, 508931046, 508272133, 508344193, 509134865, 510311928, 511342087, 511679649, 510936852, 508968277, 505848923, 501784325, 497013245, 491755562, 486212044, 480588837, 475102577, 469942436, 465203018, 460828438, 456612587, 452267914, 447536507, 442293053, 436587639, 430611687, 424605598, 418757782, 413140450, 407707024, 402339745, 396915932, 391357880, 385647278, 379807930, 373874702, 367868881, 361791306]
984C61791306o162034o259613o362876o467400o574516o692925o831550o992932p169342
993C02278118p343273p493057p597790p641869p615604p512569p324944p037792o627884
1002B36083336o065560n324172m390355l276710k027130p16458N60208J702709K621994
1011B19167862L252258L558007L533630L199139K594509J773967Q01754k52742j318798
1020B36309586k328434l221608l947830m468231m754105m787712m560642m078350l361378
1029B00801296k449722j401234k87513Q15849J840877K737732L479443M062157M497585
1038B14096470M805450N006981N119953N160981N145568N089379N007133M909668M801102
1047B59142685M680157M542827M385758M211502M024791L832760L639050L442764L240338
$$ y = [361791306, 355629272, 349369659, 343006783, 336539383, 329964867, 323271942, 316440392, 309447460, 302278118, 294934845, 287441788, 279843998, 272202129, 264586525, 257073956, 249749012, 242711220, 236083336, 230017776, 224693604, 220303249, 217026539, 214999409, 214282951, 214843159, 216545868, 219167862, 222420120, 225978127, 229511757, 232710896, 235305405, 237079372, 237881126, 237628384, 236309586, 233981152, 230759544, 226811714, 222343483, 217589378, 212801666, 208241024, 204162674, 200801296, 198351574, 196950340, 196662827, 197478676, 199319553, 202057285, 205536728, 209598885, 214096470, 218901920, 223908901, 229028854, 234189835, 239335403, 244424782, 249431915, 254341583, 259142685, 263822842, 268365669, 272751427, 276962929, 280987720, 284820480, 288459530, 291902294, 295142632]
1056B95142632L029937K815228K605877K413406K244968K096673J952896J791038J591778
1065C15684433J346683J064930P67632M81415K26841J1883j66760l18241m48914n56106
1075C18093796o29482o57025o33736n66959m74434l77235k89822k13508j38245n0202
1085C14063148N8461J82037L03021M01554M64992M97341N16453N45693O00490O80561
1095C18313751P69100Q43697Q87775R02482R07173R30099R93576J101074J232872J354027
1105C28235626J430550J446800J416626J381683J398468J519394J775399K168197K674027
1114C43446770L253860L866196M474525N047188N552406N955124O221619O329575O280784
1123C90428047O109696N875969N646476N469513N356789N281448N192147N043678M817772
$$ y = [295142632, 298172569, 300987797, 303593674, 306007080, 308252048, 310348721, 312301617, 314092655, 315684433, 317031116, 318096046, 318863678, 319345093, 319571934, 319583817, 319417057, 319098816, 318649902, 318093796, 317464314, 316807289, 316173553, 315606594, 315132160, 314754925, 314465103, 314251595, 314113350, 314063148, 314121609, 314303646, 314606667, 315008221, 315473213, 315970554, 316487007, 317032700, 317633190, 318313751, 319082851, 319926548, 320814323, 321716805, 322623978, 323554077, 324547653, 325648727, 326881599, 328235626, 329666176, 331112976, 332529602, 333911285, 335309753, 336829147, 338604546, 340772743, 343446770, 346700630, 350566826, 355041351, 360088539, 365640945, 371596069, 377817688, 384147263, 390428047, 396537743, 402413712, 408060188, 413529701, 418886490, 424167938, 429360085, 434403763, 439221535]
1132D39221535M536209M247093M001122L826026L713150L627205L527451L393173L235588
1141D73328552L090973K996712K967453K981796K991944K949485K833557K665291K499733
1150D99305496K395249K379150K427635K469979K421302K223740J878433J451111J045074
1159E17997169P59354O47507P00950Q60024J048241J208305J323051J411972J508446
1168E27465019J630974J769104J887436J947365J931381J856613J767082J711731J718407
1177E43685112J779747J858292J907539J897354J830635J740418J669960J649589J679230
1186E59697876J729164J758690J737061J662750J562347J475868J434517J443940J483192
1195E73985405J517487J518745J481247J423454J375199J360702J383095J424141J456184
$$ y = [439221535, 443757744, 448004837, 452005959, 455831985, 459545135, 463172340, 466699791, 470092964, 473328552, 476419525, 479416237, 482383690, 485365486, 488357430, 491306915, 494140472, 496805763, 499305496, 501700745, 504079895, 506507530, 508977509, 511398811, 513622551, 515500984, 516952095, 517997169, 518756523, 519404030, 520104980, 520965004, 522013245, 523221550, 524544601, 525956573, 527465019, 529095993, 530865097, 532752533, 534699898, 536631279, 538487892, 540254974, 541966705, 543685112, 545464859, 547323151, 549230690, 551128044, 552958679, 554699097, 556369057, 558018646, 559697876, 561427040, 563185730, 564922791, 566585541, 568147888, 569623756, 571058273, 572502213, 573985405, 575502892, 577021637, 578502884, 579926338, 581301537, 582662239, 584045334, 585469475, 586925659]
1204E86925659J457482J425514J376419J332970J311187J309548J311989J298637J260605
1213E99010010J205673J155205J129493J135750J161118J181030J172600J129951J067734
1222F09348564J013642R90791J002960J030769J039772J000786R05953P76672O52885
1231F17762794N74761N62324O06690O75278P30743P50198P37000P15294P14760P51495
1241F24581337Q16612Q79784R06410Q76122P96699P00035O26564O05011O37703P01409
1251F32127686P61299P90634P83539P53936P22809P01828O83861O49490N82161M86565
1261F39043808L92456L43895L74641M85688O38656P70340Q22754P72934O45828N01480
1271F44792480M04816L90930M48609N27191N67093N33600M37774L31040K76413L14102
$$ y = [586925659, 588383141, 589808655, 591185074, 592518044, 593829231, 595138779, 596450768, 597749405, 599010010, 600215683, 601370888, 602500381, 603636131, 604797249, 605978279, 607150879, 608280830, 609348564, 610362206, 611352997, 612355957, 613386726, 614426498, 615427284, 616333237, 617109909, 617762794, 618337555, 618899879, 619506569, 620181847, 620912590, 621662788, 622399788, 623115082, 623829842, 624581337, 625397949, 626277733, 627184143, 628060265, 628856964, 629556999, 630183563, 630788574, 631426277, 632127686, 632888985, 633679619, 634463158, 635217094, 635939903, 636641731, 637325592, 637975082, 638557243, 639043808, 639436264, 639780159, 640154800, 640640488, 641279144, 642049484, 642872238, 643645172, 644291000, 644792480, 645197296, 645588226, 646036835, 646564026, 647131119, 647664719, 648102493, 648433533, 648709946, 649024048]
1281F49024048M37088N93948P14798P49207O92138N86701M99191M81186N39627O33164
1291F54951096O93283O65359N40695L65067K15912J61895K25297L69339N18417N98907
1301F59305267N79071M83857L80401L36609L82843M95834O10428O59867O11419M86527
1311F64332123L46298K58408K57568L29208M18396M63639M32815L41873K47422K14538
1321F67642288K79007M26560N96008P10373P16324O12335M51126L13568K65732L26767
1331F72340088M56085N74875O07834N20630L41949J47324K1972J7167J25503K86255
1341F75439682M19617M66995M21143L23333K36359K06833K38418K94190L19290K79617
1351F78645477J80893O9580L739K0981J13449K32544L13491L12043K28653J08566J8005
$$ y = [649024048, 649461136, 650055084, 650769882, 651519089, 652211227, 652797928, 653297119, 653778305, 654317932, 654951096, 655644379, 656309738, 656850433, 657215500, 657431412, 657593307, 657818604, 658187943, 658706360, 659305267, 659884338, 660368195, 660748596, 661085205, 661468048, 661963882, 662574310, 663234177, 663845596, 664332123, 664678421, 664936829, 665194397, 665523605, 665942001, 666405640, 666838455, 667180328, 667427750, 667642288, 667921295, 668347855, 668943863, 669654236, 670370560, 670982895, 671434021, 671747589, 672013321, 672340088, 672796173, 673371048, 673978882, 674499512, 674841461, 674988785, 675010757, 675027924, 675153427, 675439682, 675859299, 676326294, 676747437, 677070770, 677307129, 677513962, 677752380, 678046570, 678365860, 678645477, 678826370, 678895950, 678899689, 678920670, 679034119, 679266663, 679580154, 679892197, 680120850, 680229416, 680247421]
1362F80247421R003R2316K32925L67813M38690M17862L20587J91575Q0871J6937m043
1373F82411957j2970m6921j25427k37503l44239l97186l61023k31552l6697J73568
1383F80792007L48282M52423M72794M13666K85873J01319j27411l77274o06308p57828
1393F80997543p73391o19889l10058R0179M76532P36847P90558O12869K46506k12097
1403F82035599o37360r07440r33304o80008j76925M86755J177750J750869K082520
1412F84198456K105408J825332J321106P21817J72424k07977l56979k88239q4305J30234
1422F89537277K32010J47476j19781m85153q20465j006546r85489p81403m82101j92032
1432F85043793J7700J34277J93634K46659L26309M34189N50155O49948P14875P26471
$$ y = [680247421, 680256424, 680348740, 680581665, 680949478, 681388168, 681806030, 682126617, 682318192, 682399063, 682416000, 682411957, 682398987, 682352066, 682226639, 681989136, 681644897, 681247711, 680886688, 680655136, 680618439, 680792007, 681140289, 681592712, 682065506, 682479172, 682765045, 682866364, 682738953, 682361679, 681755371, 680997543, 680224152, 679604263, 679294205, 679384384, 679860916, 680597763, 681388321, 682001190, 682247696, 682035599, 681398239, 680490799, 679557495, 678877487, 678700562, 679187317, 680365067, 682115936, 684198456, 686303864, 688129196, 689450302, 690172119, 690344543, 690136566, 689779587, 689491348, 689407043, 689537277, 689769287, 689916763, 689796982, 689311829, 688491364, 687484818, 686499329, 685717926, 685235825, 685043793, 685061493, 685195770, 685389404, 685636063, 685962372, 686396561, 686946716, 687596664, 688311539, 689038010]
1442F89038010O57653M81492J95465j47400m36631n46264m09851q6899K31476K92969
1452F89270020r6894r72214k186203l477630m591828n370483n764008n772476n376892
1461F55661392m530029l232498j637268r1629R51690J137696M18853q63723k101059
1470F45713425k695999k353592j221695K04925J350785J846160J667328J066437L61328
1479F45939102k70309q51517j499786k240677k880440l041534k349396o60515J805572
1488F33950500M509659O794586Q134003Q314667P473907O008149M407425L098983K340546
1497F85032425K179718K465973K909698L176270L003998K308807J231613R3460p33185
1506G01668777r85565o25229J49308J002044J612625J810227J620712J213226P91703
$$ y = [689038010, 689695663, 690177155, 690372620, 690225220, 689788589, 689242325, 688832474, 688745575, 688977051, 689270020, 689173126, 688200912, 686014709, 682537079, 677945251, 672574768, 666810760, 661038284, 655661392, 651131363, 647898865, 646261597, 646169968, 647121658, 648259354, 648678207, 647814484, 645713425, 643017426, 640663834, 639442139, 639647064, 640997849, 642844009, 644511337, 645577774, 645939102, 645668793, 644817276, 643317490, 641076813, 638196373, 635154839, 632805443, 632144928, 633950500, 638460159, 645254745, 653388748, 661703415, 669177322, 675185471, 679592896, 682691879, 685032425, 687212143, 689678116, 692587814, 695764084, 698768082, 701076889, 702308502, 702401962, 701668777, 700683212, 700057983, 700207291, 701209335, 702821960, 704632187, 706252899, 707466125, 708257828]
1515G08257828M88968L22113K17971Q4610j17950l49503n07888m91486k57034J42593
1525G07790222N73960Q77990R46427P79495M94766K74124K69623N14145Q84628J151581
1535G14556961J090241O06842j92948j034088j591263j641235j167603l68728M39529
1544G10697708R71375J097870Q93249N79071M04968N18189Q87909J313476J513672
1553G18877487J259918M95072o14548j722946k432098k459946j769180n98450O27899
1562G11663208J479950J704330J327897O23092l8376l73306l13415j1902K64587K95944
1572G16622009K2507m35486q59833j059417r64508o46592k62603L2348J53961J06125
1582G12708511m6539k26974l81623m89425n53132n83190n90821n89370n95246o25381
$$ y = [708257828, 708746796, 709068909, 709286880, 709371490, 709253540, 708904037, 708396149, 707904663, 707647629, 707790222, 708364182, 709242172, 710188599, 710968094, 711462860, 711736984, 712006607, 712520752, 713405380, 714556961, 715647202, 716254044, 716061096, 715027008, 713435745, 711794510, 710626907, 710258179, 710697708, 711669083, 712766953, 713660202, 714239273, 714644241, 715162430, 716050339, 717363815, 718877487, 720137405, 720632477, 720017929, 718294983, 715862885, 713402939, 711633759, 711035309, 711663208, 713143158, 714847488, 716175385, 716798477, 716760101, 716386795, 716073380, 716061478, 716326065, 716622009, 716644516, 716209030, 715349197, 714289780, 713325272, 712678680, 712416077, 712448425, 712602386, 712708511, 712661972, 712434998, 712053375, 711563950, 711010818, 710427628, 709836807, 709247437, 708652191, 708026810]
1592G08026810o88629p77665q69445r35135r54590r27048q73871q30307q32901r03167
1602F99434052j037140j198807j329346j365814j270828j059113q05359o22024o11649
1611F90133972q14056j174393j557846j805573j807785j557388j151657p45010m74701
1620F79045563m01001m90723o45370p54624p40814n77927k85186Q5525M58450P35779
1630F76429672Q12073O12106J46103m51431r36737j043320o15692K84271J363678K210770
1640F78811493K493133K136460J382675O74057M19083P55844J460647K059174K091598
1649F92284164J391221K05459r07669j367874q85925L74984J878510K992630L309708
1658F99275208K833938J938095J131821P79953R32541J349029J680069J686173J355591
$$ y = [708026810, 707338181, 706560516, 705691071, 704755936, 703801346, 702874298, 702000427, 701170120, 700337219, 699434052, 698396912, 697198105, 695868759, 694502945, 693232117, 692173004, 691367645, 690745621, 690133972, 689319916, 688145523, 686587677, 684782104, 682974319, 681416931, 680265274, 679520264, 679045563, 678644562, 678153839, 677508469, 676753845, 676013031, 675435104, 675149918, 675235443, 675693893, 676429672, 677241745, 677853851, 677999954, 677548523, 676611786, 675568466, 674952774, 675237045, 676600723, 678811493, 681304626, 683441086, 684823761, 685497818, 685916901, 686672745, 688133392, 690192566, 692284164, 693675385, 693880844, 692973175, 691605301, 690719376, 691094360, 692972870, 695965500, 699275208, 702109146, 704047241, 705179062, 705959015, 706891556, 708240585, 709920654, 711606827, 712962418]
1667G12962418Q73413M74929K95258L10822L95355M39911M41513M96216P05566J067047
1677G18462448J429138J557465J270065N63126l52555j137771j481552j247788n28717
1686G18533859M09317J257248J791153J939240J762542J386185R24988M46472j7319
1695G28433685m39377p70416r47799r23768p00073l41568M3946L48587N10101N38254
1705G25751572N07126N16052O36368Q65860J115875J241455J104812O50330m7531p93228
1715G31548691j337891j484909j182251n51681J63574P10678R48791R04236P38907
1724G30458145O43311P15332Q97522J010132Q65249L92533k97242r50622j298218j195450
1734G31240692p00760m4174M92706P21207O31027L75443J67541J53961L34855N76477
$$ y = [712962418, 713835831, 714310760, 714606018, 714916840, 715312195, 715752106, 716193619, 716689835, 717395401, 718462448, 719891586, 721449051, 722719116, 723282242, 722929687, 721791916, 720310364, 719062576, 718533859, 718943176, 720200424, 721991577, 723930817, 725693359, 727079544, 728004532, 728451004, 728433685, 727994308, 727223892, 726276093, 725352325, 724652252, 724310684, 724354630, 724703217, 725213318, 725751572, 726258698, 726774750, 727411118, 728276978, 729392853, 730634308, 731739120, 732389450, 732341919, 731548691, 730210800, 728725891, 727543640, 726991959, 727155533, 727866211, 728815002, 729719238, 730458145, 731101456, 731816788, 732714310, 733724442, 734589691, 734982224, 734684982, 733734360, 732436142, 731240692, 730539932, 730495758, 730988464, 731709671, 732340698, 732716141, 732883682, 733037643, 733372498, 733948975]
1744G33948975O97174N78460K32697k03400n44891o49338m85000j32294K62375N58319
1754G34263077O71615N95475L84521J23673r9945k17362j89819j7395K54135N39627
1764G36307602P33032P45011N39627J55105l03726p02209r24988r15299o89316l23333
1774G34621506P7362M10690N99976O10809M55170J92642p7896k45590k26288p477L30658
1785G36741562O34918P40662N52597J06277m33731q40072r30176o62079j60599L39356
1795G36088715O08902N40618J99357k16294m82940m70963k06604J51520M07028M33273
1805G37052612K35291o2790k98233l61176k47116m8218J13068J55411Q2779l0441q8959
1816G36502228l5629J16500K97165M20075M29001L22799J49308k2889j38015j73798
$$ y = [733948975, 734646149, 735224609, 735457306, 735253906, 734709015, 734059677, 733574677, 733442383, 733704758, 734263077, 734934692, 735530167, 735914688, 736038361, 735938416, 735721054, 735531235, 735513840, 735767975, 736307602, 737040634, 737785645, 738325272, 738480377, 738176651, 737474442, 736549454, 735634155, 734944839, 734621506, 734698868, 735109558, 735709534, 736320343, 736775513, 736968155, 736890259, 736644669, 736418381, 736410904, 736741562, 737376480, 738117142, 738669739, 738776016, 738342285, 737502213, 736572037, 735909958, 735749359, 736088715, 736697617, 737238235, 737437592, 737221298, 736738358, 736267395, 736060791, 736212311, 736619339, 737052612, 737287903, 737225113, 736926880, 736565704, 736318588, 736270370, 736383438, 736538849, 736621628, 736591187, 736502228, 736466599, 736583099, 736880264, 737300339, 737729340, 738052139, 738201447, 738178558, 738040543, 737866745]
1826G37866745j44730q6898l8910k0905k7313k7008K2201J50528L54996N87158P63092
1837G39398956P94602O31790K96783j15814m69589o45599n97382l69568p6294J58386
1847G39006271K61002K36893J55868J00174J10550J62888J88446J26190k8534k11105
1857G40108643l17612k69013o4849K06527M05503M14428K02256j55487n11933p20825
1867G39297638p07779n00641k06451M6768J75934J72958R5520K1362K060L9673R5444
1878G38532486J24664J06049N5008R231k29K9603P1640Q5601M6463l9596j35498j95008
1890G38690414j86309j09330L052J03989J54342J40915Q0796J2664k3193k746O9808
1901G38934402J62659K30484K36893J70746N7678n1422j01090n9509O2714K15377L28751
$$ y = [737866745, 737722015, 737635117, 737596207, 737575302, 737547989, 737520981, 737543182, 737693710, 738048706, 738635864, 739398956, 740193558, 740825348, 741122131, 741006317, 740536728, 739891129, 739293747, 738924179, 738847885, 739006271, 739267273, 739504166, 739660034, 739760208, 739870758, 740033646, 740222092, 740348282, 740319748, 740108643, 739791031, 739522018, 739457169, 739663696, 740069199, 740483627, 740685883, 740530396, 740018463, 739297638, 738589859, 738089218, 737882767, 737929535, 738105469, 738278427, 738373947, 738395309, 738397369, 738437042, 738532486, 738657150, 738763199, 738818207, 738827438, 738827209, 738856812, 738928452, 739014053, 739060516, 739020920, 738885422, 738690414, 738504105, 738394775, 738397827, 738501816, 738656158, 738797073, 738877869, 738890533, 738867340, 738864594, 738934402, 739097061, 739327545, 739564438, 739735184, 739792862, 739741440, 739640350, 739580841, 739643555, 739858932, 740187683]
1912G40187683L49655K64435J07498n6457j64871j86692j33133m6234K5559N4855M4403
1923G40446701J9379R384K8152O7673J06354J21612J05744O8588L2349J8768L7384
1934G41062088Q1787J31455J61132J50528R3155j52j03608j83486k10419j71280p5760
1945G40935440M5776J51825K07825J98517J35956N3024j2283l2425l891N4245J10245
1956G41844254J35955J21384P7362K9831L967J0834M1122O7978O4392J7395n9967j33209
1968G42221298j62735j24511k6246R2850J80130J93634J26496J1749r3994j37024r6436
1979G42185211O638J18408J82114J66092Q1710k5787j01776j13068o5689R16L6010
1990G42470779J0376o7978j54113j92566j48316k9525J12991K10571K11640J10931
$$ y = [740187683, 740537338, 740801773, 740909271, 740852814, 740687943, 740501251, 740368118, 740321884, 740347443, 740402298, 740446701, 740466080, 740475464, 740503616, 740571289, 740677643, 740799255, 740904999, 740973587, 741005936, 741024704, 741062088, 741143875, 741275330, 741436462, 741586990, 741680145, 741679993, 741576385, 741392899, 741182480, 741011200, 740935440, 740981216, 741133041, 741340866, 741539383, 741675339, 741728363, 741716080, 741683655, 741679764, 741734009, 741844254, 741980209, 742101593, 742178955, 742208786, 742212753, 742223587, 742264709, 742332687, 742397079, 742414474, 742354507, 742221298, 742058563, 741934052, 741907806, 742000656, 742180786, 742374420, 742500916, 742512665, 742418671, 742281647, 742185211, 742191849, 742310257, 742492371, 742658463, 742740173, 742714386, 742612610, 742499542, 742433853, 742434769, 742470779, 742481155, 742413177, 742259064, 742066498, 741918182, 741888657, 742001648, 742212219, 742423859, 742534790]
2000G42534790m5471j82114k32010j71814l3493J11389J89438J64109N4397p5760j53274
2011G42160187j36490l7079Q6212J60752J42288L8986r0561j71585j52817l8452J13754
2022G42075195K23160K28500J22681m1962j82418k25983j50986L968J60369K42081
2032G42454605K14996J02997k5406r7580p4920K6321J45569K12555J86996Q1559m6082
2043G43181610j23901j06430L81J41754K43683K52304J63269K3651r4604j31302p1182
2054G43479233N0049J65939K14920J73645O7444m4480j01776p6217J5869J21460J82495
2065G44248581J67389Q6136j4801q0490p6142o714Q6823J52054J54113R3918Q087n3863
2077G44765091n5924M120R3232J63269J76086J24588L5934m5013p8278n0582J9455
$$ y = [742534790, 742489319, 742307205, 742075195, 741903381, 741869888, 741981277, 742170715, 742334824, 742389221, 742313461, 742160187, 742023697, 741986618, 742072830, 742233582, 742375870, 742414856, 742324295, 742152710, 741999893, 741961441, 742075195, 742298355, 742526855, 742649536, 742607574, 742425156, 742199173, 742048187, 742052155, 742212524, 742454605, 742669601, 742772598, 742747192, 742649612, 742574692, 742601013, 742746582, 742959137, 743146133, 743227692, 743181610, 743057709, 742951279, 742951660, 743093414, 743337097, 743589401, 743752670, 743776321, 743681717, 743550415, 743479233, 743529282, 743695221, 743910141, 744083786, 744151230, 744106750, 744004974, 743928757, 743944626, 744066086, 744248581, 744415970, 744502106, 744487305, 744406815, 744330673, 744323959, 744410782, 744562836, 744716949, 744810867, 744818954, 744765091, 744709167, 744713287, 744806519, 744969788, 745145874, 745270462, 745306396, 745261383, 745183105, 745132523, 745151978]
2088G45151978R3994J36108J29318Q3695K8839m807j983L1128P1869R5977R0714O1798
2100G45968628K7466P782J1978L5095O0043P1717O2408L8758J4495K976P477K1515
2112G46330338L2730L2119K0905R308R002K5864N3711P8354Q4991O8970L8147J0300
2124G46794739J831J6250M3488O3934O2256L6087l81k5177k1668R461M9438P1716N6382
2137G47158356O408n3634q9569p6218j4343O8207J29241J35575Q1787n646p9803j00785
2149G47159576n5923L0212J09558J37101R5901Q545p5302j04599n7678M4784J50299
2160G47442474K00653J66779O4240n2720j20010r8953J526J29013K13699K09045J15433
2171G48271179j7853j18408j31454m9591Q2016J90124K13089J35727j678j24741j66626
$$ y = [745151978, 745245972, 745382080, 745511398, 745595093, 745623932, 745619125, 745617142, 745648270, 745720139, 745816116, 745906830, 745968628, 745996094, 746003876, 746015854, 746050949, 746110992, 746182709, 746245117, 746283875, 746298370, 746301346, 746308823, 746330338, 746363068, 746395187, 746416092, 746425400, 746434402, 746460266, 746513977, 746592331, 746677322, 746746292, 746784439, 746794739, 746796570, 746812820, 746856308, 746920242, 746982498, 747018585, 747018204, 746993027, 746971359, 746980820, 747030258, 747101974, 747158356, 747164764, 747111130, 747021561, 746945343, 746931000, 746999207, 747128448, 747264023, 747345810, 747340164, 747260361, 747159576, 747103653, 747133865, 747243423, 747380524, 747476425, 747484970, 747409668, 747305069, 747247391, 747292175, 747442474, 747643127, 747809906, 747874146, 747821426, 747701416, 747602463, 747603989, 747733002, 747946701, 748155746, 748271179, 748253326, 748134918, 748003464, 747953873, 748035889, 748226013, 748439102, 748574829, 748573151, 748448410, 748281784]
2182G48281784j04523K6322J51062J98364J38245J907j35574j97144j44806k899J54266
2193G48367004K44065K18353R2239o5078j68381j61514n0888J00860K07901K09046
2203G48993607J02462n4016j73721j89743r2774O3935J92184K17285J21308m8371k01721
2214G48930435k55585j79443j1368J60294K45666K01111N1804j21765k27509k11487
2224G48582153q6822P5531J85547J83258P1411q7814k07291k22626j28403K1973J43356
2235G48530273J69373Q5754o0119j86157k22016j47171k746J30615J77994J11236l5782
2246G48551254j84784k56424k13775q0872P0114J59455J43127L5172j01319j91116
2256G47930832j86691r5978K6703J09634J05667J5869j10778k07138k22703j51290
$$ y = [748281784, 748177261, 748203583, 748354645, 748553009, 748691254, 748693161, 748557587, 748360443, 748215637, 748212738, 748367004, 748611069, 748829422, 748921661, 748856583, 748688202, 748526688, 748475800, 748576660, 748784561, 748993607, 749096069, 749042053, 748868332, 748678589, 748585815, 748649750, 748841934, 749059219, 749180527, 749132156, 748930435, 748674850, 748495407, 748484039, 748644333, 748889999, 749091110, 749142914, 749021149, 748793640, 748582153, 748495331, 748570862, 748756409, 748939667, 749011078, 748923264, 748715973, 748493347, 748364944, 748386917, 748530273, 748699646, 748785400, 748725281, 748539124, 748317108, 748169937, 748167191, 748297806, 748475800, 748587036, 748551254, 748366470, 748110046, 747896271, 747815399, 747885513, 748044968, 748188095, 748223267, 748121948, 747930832, 747744141, 747648163, 747674866, 747784500, 747890167, 747906036, 747795258, 747588120, 747365417, 747214127]
2266G47214127l2959P0037J05286N9433l8528j33515j74637j42669n7450L6545R3765
2277G46999435R5673N6229J2588l81K8839Q0719J15814R9716K3194q9341j92794k46659
2289G46983032k34909j75552j09406p6599r6054j56479k23388k59858k45056j86004
2299G45219727j11466n8670n4398j05285j95618k97394l85208m44793m75464m84467
2309G42606964m77066m52042m04052l37906k77176k64435l45306n39627q18787j102982
2319G37587585j291580j310806j156845r07593o87942o06079o95725q96072j087037
2328G28947906j156616j063080q53195o27823m78210m41284m95453o04096p62405j005020
2338G21460724j360169j774444k068024j971283j247635J52588J996384L799362M990006
$$ y = [747214127, 747181168, 747251205, 747356491, 747415924, 747377396, 747243881, 747069244, 746926575, 746869125, 746905670, 746999435, 747095108, 747151337, 747163925, 747163544, 747192383, 747273102, 747388916, 747488632, 747511826, 747422485, 747229691, 746983032, 746748123, 746572571, 746463165, 746386566, 746290512, 746134033, 745910645, 745650787, 745405731, 745219727, 745108261, 745049591, 744995193, 744889908, 744694290, 744396896, 744011688, 743566895, 743091431, 742606964, 742129898, 741677856, 741273804, 740935898, 740658722, 740394287, 740048981, 739509354, 738690567, 737587585, 736296005, 734985199, 733828354, 732920761, 732232819, 731626740, 730931015, 730034943, 728947906, 727791290, 726728210, 725875015, 725247192, 724768982, 724327698, 723832245, 723228149, 722465744, 721460724, 720100555, 718326111, 716258087, 714286804, 713039169, 713191757, 715188141, 718987503, 723977509]
2347G23977509N140457M150390K294159J05744j838837l137741l676682l606796l213959
2356G20194244k764282k400741k129517j874390j559982j162262p18002k90528O9352
2365G07363892L48281N68314P66373R72290J194916J422195J631927J803971J930694
2374G18002853K021485K098083K183457K286453K391128K455140K427597K270965J986008
2383G38123169J618423J241532R26819P11364N85404N02548M10461K82593J31073k899
2393G44530487p5531o9427o562O4926R5826O1874k2202j13067j62964j45721p0801
2404G44086838K2278Q6059Q9035L2425m9972j12076j18714o5689J8769Q8424J05133
2415G44182510O0501k0675r2011j13907p4539K594P1030Q8730M2724m4784j25656j55716
$$ y = [723977509, 729117966, 733268356, 735562515, 735668259, 733829422, 730691681, 727014999, 723408203, 720194244, 717429962, 715029221, 712899704, 711025314, 709465332, 708303070, 707585068, 707294540, 707363892, 707712173, 708280487, 709046860, 710019150, 711214066, 712636261, 714268188, 716072159, 718002853, 720024338, 722122421, 724305878, 726592331, 728983459, 731438599, 733866196, 736137161, 738123169, 739741592, 740983124, 741909943, 742621307, 743206711, 743709259, 744119720, 744402313, 744533386, 744530487, 744454956, 744385529, 744378967, 744443893, 744539719, 744601593, 744579391, 744466324, 744303360, 744157639, 744086838, 744109116, 744195175, 744284210, 744316635, 744266663, 744154587, 744035873, 743970184, 743988953, 744077377, 744182510, 744243011, 744222336, 744130325, 744016418, 743941879, 743944473, 744015503, 744104233, 744146957, 744102173, 743976517, 743820801]
2427G43820801j17798l2501N3024R1934O3400j7318j07041j59301j50376q9950j7014
2438G43337860K5101J0376n4856j36413j92413j94779j46179p6065k3956j7930n7754
2449G42472992j17264j57699j51825r7275j9760M2648O0043K7008l3874q7509j03073
2460G41834412p3548j7166L4104N1422K6703k4720p4310r5749q0414m0817j907J2970
2472G41550980n188m6540q9111j12381j08109q4762o0577n3559p0267j02615j32980
2483G40684891j44959j31454j00861p0419n7221o8664r7733j27868j41602j30386r8572
2494G39515152o0577l1662j9455k0371k3727j8387j068K0675L4256K9145N111k6626
2506G39402466m9744n1346l0594k28K1286J9607o561m3717p2174p5836n2795j8006
$$ y = [743820801, 743703003, 743670502, 743723526, 743815460, 743878860, 743861542, 743754501, 743595200, 743444824, 743354874, 743337860, 743362961, 743373337, 743318481, 743182068, 742989655, 742794876, 742648697, 742572632, 742548676, 742530746, 742472992, 742355728, 742198029, 742046204, 741948929, 741929169, 741971817, 742031860, 742058868, 742024994, 741937485, 741834412, 741760864, 741743698, 741777802, 741829224, 741855927, 741831207, 741756897, 741661148, 741580734, 741539917, 741538010, 741550980, 741545792, 741499252, 741410141, 741297760, 741189651, 741104889, 741044312, 740990753, 740920486, 740817871, 740684891, 740539932, 740408478, 740307617, 740237198, 740179977, 740111313, 740013580, 739885712, 739744110, 739613724, 739515152, 739454575, 739422913, 739403458, 739383087, 739359360, 739340973, 739339905, 739360580, 739394836, 739423981, 739429092, 739402466, 739352722, 739301376, 739270782, 739270554, 739291840, 739311447, 739304886, 739261169, 739188995, 739113159, 739060364, 739042358]
2518G39042358O485J984l4714q8577j35269j52588j34506r3308n4321l9673n7602r5978
2530G38164291j31454j39008j10931n8746p782J5564P6m4174r1172j13754r7885n3024
2542G37332001m959J7013l204n7068j17722j51748j39084q4610j6632K8381K4033k9068
2554G36797333j04981j63803j74179j29471n1727K0752N3482L5553j5793o5689q2016
2565G36119461n4092L81M6921N3329R766o5384j33438j59607j31454o6910n265J4725
2577G35628433k2964j03302j86615k31247k14997j47857o6071j1215r918n7755j23672
2588G34452820j66397j58768j01089k1897L8834N0201Q393o2561j24131j44348j14899
2599G33656158n5770k289J4419j5793p4615j28098j45263j15662n5389J144K1439q240
$$ y = [739042358, 739048843, 739050827, 739016113, 738927536, 738792267, 738639679, 738505173, 738411865, 738357544, 738317871, 738260269, 738164291, 738032837, 737893829, 737782898, 737724152, 737716370, 737731934, 737732010, 737687836, 737596664, 737482910, 737385025, 737332001, 737327042, 737344055, 737340851, 737283783, 737166061, 737014313, 736875229, 736790619, 736773987, 736802368, 736826401, 736797333, 736692352, 736528549, 736354370, 736224899, 736173172, 736193924, 736247406, 736282959, 736267166, 736201477, 736119461, 736065369, 736065750, 736112671, 736166000, 736175766, 736110382, 735976944, 735817337, 735685883, 735618973, 735613708, 735628433, 735605469, 735502167, 735315552, 735084305, 734869308, 734721451, 734655380, 734644165, 734634247, 734576492, 734452820, 734286423, 734127655, 734026566, 734004669, 734043503, 734093704, 734102097, 734039536, 733915405, 733771057, 733656158, 733600388, 733598099, 733612518, 733596725, 733522110, 733394012, 733248749, 733133087, 733077698, 733078842, 733100281, 733092041]
2611G33092041p4692j44882j86081j80969j37940q4762n1422n4703q7662j26266j42670
2622G31819992j22909p3395j9455J0681J221m2038r4910j27640j21917q0719k7009
2633G31121902Q774N875l4866r2011j34430j38473j01548m3029O561K1210n417n6687
2645G30557861j04065j20926r8648n0354j068K5025J9149q163l4409m0283j9302J7166
2657G30141983M7607N3025K9831j0529m6615o0349m7073j7701Q011J3504o179m0589
2669G30064926p2250q5526p5531n2261l2272l1052n3330q9950j22986j35879j21155
2680G29192734q6441m8523k6856l0517n6229q8348j08033j04522q0490n0965l4256
2691G28477554m2801p3623j11008j34430j29928r9335n9281l2043l3798o3935j08261
$$ y = [733092041, 733017349, 732872467, 732686386, 732505417, 732367477, 732282715, 732231293, 732176590, 732088928, 731962662, 731819992, 731697083, 731623688, 731604233, 731614914, 731616135, 731574097, 731479187, 731351547, 731229630, 731148911, 731121902, 731130676, 731136551, 731101685, 731009674, 730875244, 730736771, 730635223, 730592194, 730598755, 730619965, 730614548, 730557861, 730453796, 730332870, 730234222, 730183868, 730182800, 730207825, 730226974, 730218811, 730184402, 730144119, 730124817, 730141983, 730189590, 730242615, 730272446, 730261917, 730215302, 730154953, 730107880, 730090179, 730098190, 730111694, 730105515, 730064926, 729992676, 729907150, 729831619, 729779358, 729747086, 729716034, 729662704, 729572754, 729449768, 729313889, 729192734, 729106293, 729057770, 729030914, 729000397, 728944168, 728855820, 728747787, 728643265, 728562775, 728511810, 728477554, 728434753, 728361130, 728250122, 728115692, 727985764, 727886429, 727827148, 727795105, 727761307, 727697372, 727589111]
2702G27589111j43890j54495j38474j08490q4457q0185r5825j18180j29242j18255
2712G26417618q8272n4627l6163m2648o9504r9564j14212j04523p7590n1957m9057
2723G25629501p7819j30158j84936k17515k14920j81732j38473j09253j08948j34964
2733G24130783j68686j85089j68381j19705n7983j0681J983k2659o9809j12305j27945
2744G23089523j11160p4005m1809l6164o4239j13373j57776j73111j51062j03912n8441
2755G22004471m1886o5155j17874j72882k01492j88904j44043r3460o6986q0872j29242
2766G20701675j87149k26287k30790k07214j81732j83945k30408l13873m06952m75998
2776G18057327m99649m77600m30221l84827l57590l46603l32871k95257k23923j30692
$$ y = [727589111, 727445221, 727290726, 727152252, 727043762, 726959305, 726879120, 726783295, 726665115, 726535873, 726417618, 726329346, 726274719, 726238556, 726195908, 726126404, 726026840, 725912628, 725808105, 725730515, 725678558, 725629501, 725551682, 725421524, 725236588, 725019073, 724804153, 724622421, 724483948, 724374695, 724265747, 724130783, 723962097, 723777008, 723608627, 723488922, 723430939, 723420258, 723422241, 723399582, 723329773, 723217468, 723089523, 722978363, 722904358, 722862549, 722826385, 722762146, 722648773, 722490997, 722317886, 722166824, 722062912, 722004471, 721962585, 721897430, 721779556, 721606674, 721405182, 721216278, 721072235, 720978775, 720911789, 720830917, 720701675, 720514526, 720288239, 720057449, 719850235, 719668503, 719484558, 719254150, 718940277, 718533325, 718057327, 717557678, 717080078, 716649857, 716265030, 715907440, 715560837, 715227966, 714932709, 714708786, 714578094]
2786G14578094m3792N798L82n4627j33438k04773k44827k49939k36283k27966k45361
2797G12943268k93884l60947m24194m63257m68903m47845m19617m03366m11072m38843
2807G08811340m72641m95300m98123m88892m85992n11093n73654o65741p63627q41598
2817G03014679q85925r03626r19189r60617j044236j166458j307678j444702j566162
2826F92816086j678086j798248j948700k143783k388382k684021l034592l450546l951493
2835F69738235m562606n322113o282044p507934r054871j0924606j3011513j5066872
2843E98005676j6707039j7483940j7001190j5038605j1641311p128640k026824L055496
2851E14033623P562790J1093902J3449097J4620018J4744453J4046860J2781181J1187439
$$ y = [714578094, 714534302, 714540100, 714540482, 714485855, 714352417, 714147644, 713902817, 713652878, 713416595, 713188629, 712943268, 712649384, 712288437, 711864243, 711400986, 710932083, 710484238, 710064621, 709661255, 709250183, 708811340, 708338699, 707843399, 707345276, 706856384, 706370392, 705859299, 705285645, 704619904, 703856277, 703014679, 702128754, 701225128, 700305939, 699345322, 698301086, 697134628, 695826950, 694382248, 692816086, 691138000, 689339752, 687391052, 685247269, 682858887, 680174866, 677140274, 673689728, 669738235, 665175629, 659853516, 653571472, 646063538, 637008667, 626084061, 613072548, 598005676, 581298637, 563814697, 546813507, 531774902, 520133591, 513004951, 510978127, 514033623, 521596413, 532690315, 546139412, 560759430, 575503883, 589550743, 602331924, 613519363]
2859F13519363R458275P725640O060028M494629L052902J777420P39746K1362l20129
2868F46529236k88620L4256N04227R55963J253814J325455J171722Q44956M17633m6387
2878F52702255n04837r34295j320267j649857j913070k107392k241592k333794k401695
2887F37295456k454834k493401k513656k519303k526893k562142k649688k797585k994003
2896F13783951l214264l437576l665238l925171m265289m736481n377044o209908p247162
2905E71705818q496170r954071j1583633j3281136j4853287j6029091j6508941j6046677
2913D64952812j4528961j2022133q764191n103912j411781K002640M937515P305755
2921D37367744R104042J0375710J1177750J1568756J1608238J1364441J0915565J0340348
$$ y = [613519363, 622977638, 630703278, 636763306, 641257935, 644310837, 646088257, 646828003, 646849365, 646529236, 646240616, 646274872, 646779099, 647735062, 648988876, 650314331, 651486053, 652331009, 652748642, 652702255, 652197418, 651263123, 649942856, 648292999, 646379929, 644272537, 642030945, 639697151, 637295456, 634840622, 632347221, 629833565, 627314262, 624787369, 622225227, 619575539, 616777954, 613783951, 610569687, 607132111, 603466873, 599541702, 595276413, 590539932, 585162888, 578952980, 571705818, 563209648, 553255577, 541671944, 528390808, 513537521, 497508430, 480999489, 464952812, 450423851, 438401718, 429637527, 424533615, 423121834, 425124474, 430061989, 437367744, 446471786, 456847496, 468025246, 479594002, 491202240, 502566681, 513482246, 523822594]
2929E23822594R706764R055061Q389359P679901O875992N933799M846001L666191K512703
2938E82488365J542587R03168O76270Q39653J272354J799621K264862K591515K802849
2947E97181244K989960L244476L588982L949585M182281M144897L776093L140831K416801
2956F28615150J827393J553001J662217K091484K679138L234596L607941L733597L633880
2965F52638397L389435L097534K835617K643738K527847K469025K439880K411652K359009
2974F76812134K262878K113266J913986J683808J451568J247940J091691R84725R11179
2983F90473175Q48160P77817O94732O08597N31387M71573M22364L67736K90146J81580
2993F95667267M7378r6740k37122l71246n11704o77566q81043j114120j345139j527405
$$ y = [523822594, 533529358, 542584419, 550973778, 558653679, 565529671, 571463470, 576309471, 579975662, 582488365, 584030952, 584934120, 585610390, 586450043, 587722397, 589522018, 591786880, 594378395, 597181244, 600171204, 603415680, 607004662, 610954247, 615136528, 619281425, 623057518, 626198349, 628615150, 630442543, 631995544, 633657761, 635749245, 638428383, 641662979, 645270920, 649004517, 652638397, 656027832, 659125366, 661960983, 664604721, 667132568, 669601593, 672041473, 674453125, 676812134, 679075012, 681188278, 683102264, 684786072, 686237640, 687485580, 688577271, 689561996, 690473175, 691321335, 692099152, 692793884, 693402481, 693933868, 694405441, 694827805, 695195541, 695485687, 695667267, 695714645, 695617905, 695380783, 695009537, 694497833, 693820267, 692939224, 691825104, 690479965, 688952560]
3003F88952560j617889j599655j492920j356812j268158j295394j463471j733551k003937
3012F75120773k132110j984177j481323o39420M25492J525421K454605L049545L231964
3021F79570770L021546K516555J856385J183090O13174K26441O2942J24131L71780
3030F89546814P30896J102905J387635J514968J465302J275482J018677P72629N87005
3039F99402313M69895L94821L25699K40249J43891O1493J8920K5788O6376J10015J26725
3050G01386185J04370N2719k899l6927l6544q622K8916N5389N9891M4861K3651J0757
3062G01681747J3352K7008L9215L7079J5411j9378n0736o2561m6844j1063K7847M8905
3074G01699982M0893P553l4561o5079p1563n6534l5400k5940l8681o9199j01624j19018
$$ y = [688952560, 687334671, 685735016, 684242096, 682885284, 681617126, 680321732, 678858261, 677124710, 675120773, 672988663, 671004486, 669523163, 668883743, 669309235, 670834656, 673289261, 676338806, 679570770, 682592316, 685108871, 686965256, 688148346, 688761520, 688987961, 689050903, 689175034, 689546814, 690277710, 691380615, 692768250, 694283218, 695748520, 697024002, 698042679, 698815308, 699402313, 699872208, 700267029, 700592728, 700832977, 700976868, 701038361, 701057281, 701083069, 701149445, 701259460, 701386185, 701490555, 701543274, 701540375, 701503448, 701466904, 701458282, 701487198, 701542587, 701602478, 701647339, 701670990, 701681747, 701695099, 701722107, 701761322, 701798401, 701813812, 701794434, 701743698, 701681137, 701634293, 701623230, 701651077, 701699982, 701740875, 701748428, 701713867, 701648788, 701577225, 701520691, 701485291, 701459351, 701420670, 701351471, 701249847, 701130829]
3086G01130829j12991q9875o6757n8670p2098r8037j19477j19781r5673n8365k8152
3097G00210953k2583m6540q8729j26954j40533j20773p6599k9297j679p248m1656q6594
3109F99421768j18408j20316r1095m5547p401K289k6169q6059j59378k25754k69241
3120F98274689k84806k77481k56271k30408k04620j80969j59607j41983j30310j26038
3130F96282196j27869j30157j27182j14517r4605p5149o7292p9345j13297j60904k07901
3141F94983978k38952k43454k21482j82876j43357j18255j15891j34659j65481j96762
3151F93222809k19574k32773k41394k53220k72293k96249l16925l24783l15934k94647
3161F90455017k72598k61536k68402k88773l09906l18069l06625k79389k51465k39105
$$ y = [701130829, 701017838, 700927963, 700861206, 700802536, 700730438, 700632401, 700512924, 700393143, 700297470, 700239105, 700210953, 700188370, 700141830, 700053101, 699926147, 699785614, 699664841, 699588242, 699558945, 699557266, 699550018, 699508362, 699421768, 699303360, 699183044, 699091949, 699046402, 699039001, 699041290, 699015121, 698929062, 698769684, 698543930, 698274689, 697989883, 697712402, 697456131, 697225723, 697021103, 696840134, 696680527, 696538544, 696408234, 696282196, 696154327, 696024170, 695896988, 695782471, 695687866, 695612717, 695545425, 695466080, 695352783, 695191879, 694983978, 694745026, 694501572, 694280090, 694097214, 693953857, 693835602, 693719711, 693585052, 693419571, 693222809, 693003235, 692770462, 692529068, 692275848, 692003555, 691707306, 691390381, 691065598, 690749664, 690455017, 690182419, 689920883, 689652481, 689363708, 689053802, 688735733, 688429108, 688149719, 687898254, 687659149]
3171F87659149k51388k85492l26462l56979l65983l54461l34397l20739l23639l40882
3181F84398727l60870l69492l58734l31955l01818k85035k91290l19977l60031l96805
3191F81022720m18930m23889m18243m11301m10309m15725m20456m16565l98713l70330
3201F76918259l41111l24554l30276l58887m01383m42810m68750m71573m53491m25033
3211F72900391l99247l86505l89633m04816m23126m37851m44946m45938m44260m43878
3221F68680191m44946m44947m41055m30450m14429l96805l83529l79715l87497m04969
3231F64551849m27169m47998m62342m69284m71191m73252m78820m87595m94690m92783
3241F59846725m76989m48456m15344l90091l82157l93524m17099m39911m51431m48303
$$ y = [687659149, 687407761, 687122269, 686795807, 686438828, 686072845, 685718384, 685383987, 685063248, 684739609, 684398727, 684037857, 683668365, 683309631, 682977676, 682675858, 682390823, 682099533, 681779556, 681419525, 681022720, 680603790, 680179901, 679761658, 679350357, 678940048, 678524323, 678103867, 677687302, 677288589, 676918259, 676577148, 676252594, 675922318, 675563431, 675162048, 674719238, 674250488, 673778915, 673325424, 672900391, 672501144, 672114639, 671725006, 671320190, 670897064, 670459213, 670014267, 669568329, 669124069, 668680191, 668235245, 667790298, 667349243, 666918793, 666504364, 666107559, 665724030, 665344315, 664956818, 664551849, 664124680, 663676682, 663214340, 662745056, 662273865, 661800613, 661321793, 660834198, 660339508, 659846725, 659369736, 658921280, 658505936, 658115845, 657733688, 657340164, 656923065, 656483154, 656031723, 655583420]
3251F55583420m36325m25644m23889m31595m41971m46396m40674m27627m15345m09545
3261F51284409m08936m03442l81928l39279k84119k36816k20947k50473l22876m16336
3271F48019257n01404n51987n56641n22232m68597m18472l88260l82233l93905m11225
3281F43424301m23584m26636m22592m17785m17862m25415m37851m49753m56658m58412
3291F39087753m59976m69475m92592n28450n67398n94024n93872n62935n09529m55246
3301F33854256m25339m38538n00106n97344p06825q01430q62846q84323q73909q46634
3311F26916962q19207q03642q03490q15506q32252q45146q48541q40722q25042q07686
3321F18675728p96776p99217q18558q53271q97294r41619r76868r96399r98726r86824
$$ y = [655583420, 655147095, 654721451, 654297562, 653865967, 653423996, 652977600, 652536926, 652109299, 651693954, 651284409, 650875473, 650472031, 650090103, 649750824, 649466705, 649229889, 649008942, 648758469, 648435593, 648019257, 647517853, 646965866, 646409225, 645886993, 645418396, 644999924, 644611664, 644229431, 643835526, 643424301, 643000717, 642574081, 642151489, 641733704, 641315842, 640890427, 640452576, 640002823, 639546165, 639087753, 638627777, 638158302, 637665710, 637137260, 636569862, 635975838, 635381966, 634819031, 634309502, 633854256, 633428917, 632990379, 632490273, 631892929, 631186104, 630384674, 629521828, 628637505, 627763596, 626916962, 626097755, 625294113, 624490623, 623675117, 622842865, 621997719, 621149178, 620308456, 619483414, 618675728, 617878952, 617079735, 616261177, 615407906, 614510612, 613568993, 612592125, 611595726, 610597000, 609610176]
3331F09610176r68704r52797r46426r53560r73320j002159j034203j064034j087608
3340F00627365j102829j108894j105881j094933j079330j064339j058197j068916j101761
3349E90842285j154480j217651j275292j311493j316795j292000j248855j205216j175804
3358E79644699j166801j172867j181526j179848j164055j140366j123771j129494j165428
3367E69220543j226692j296768j354981j383743j375580j334801j274528j211090j157113
3376E57605247j120071j100311j093559j093026j091232j079597j052361j005669r41124
3385E48028297q67805q00552p56493p49245p80105q37746q97217r31206r20066q61779
3395E39626083p74650o89964o38848o38084o81496p42950p89719p96051p56912o88057
$$ y = [609610176, 608641472, 607688675, 606742249, 605788689, 604815369, 603813210, 602779007, 601714973, 600627365, 599524536, 598415642, 597309761, 596214828, 595135498, 594071159, 593012962, 591944046, 590842285, 589687805, 588470154, 587194862, 585883369, 584566574, 583274574, 582025719, 580820503, 579644699, 578477898, 577305031, 576123505, 574943657, 573779602, 572639236, 571515465, 570385971, 569220543, 567993851, 566697083, 565342102, 563958359, 562582779, 561247978, 559973450, 558762360, 557605247, 556485176, 555384865, 554291306, 553198280, 552107048, 551027451, 549975090, 548969421, 548028297, 547160492, 546359940, 545603447, 544854202, 544074097, 543236351, 542339134, 541407928, 540487862, 539626083, 538851433, 538161469, 537522621, 536884537, 536203041, 535460091, 534670372, 533874321, 533117409, 532429352]
3405E32429352o16951n68276n51986n59960n72586n71708n50919n17731m89349m79736
3415E26950150m92211n15251n28908n13687m61998l80325k87628k06986j55563j38245
3425E23269348j47133j65519j75438j66359j37940j01089p0687n8364o5995q3465r4490
3436E22002869q4534n0049j106M3487O5346N8899L4180J3008J8005O0463J33972K18583
3448E22513123K90718L35006L50647L49312L45345L48320L57513L65029L63731L53279
3458E25972023L42789L44925L69911M16527M73098N19600N37987N17845M62876L89022
3468E30346603L19176K75879K72980L10516L74527M42085M89273N00870M75311M25530
3478E34232750L71628L32947L20091L32794L62701L98903M33235M61350M81148M90875
$$ y = [532429352, 531812401, 531244125, 530692139, 530132179, 529559593, 528987885, 528436966, 527919235, 527429886, 526950150, 526457939, 525942688, 525413780, 524900093, 524438095, 524057770, 523770142, 523563156, 523407593, 523269348, 523122215, 522956696, 522781258, 522614899, 522476959, 522375870, 522305183, 522246819, 522180824, 522097359, 522002869, 521918335, 521868286, 521867180, 521910667, 521976013, 522034912, 522069092, 522082100, 522100105, 522160568, 522294540, 522513123, 522803841, 523138847, 523489494, 523838806, 524184151, 524532471, 524889984, 525255013, 525618744, 525972023, 526314812, 526659737, 527029648, 527446175, 527919273, 528438873, 528976860, 529494705, 529957581, 530346603, 530665779, 530941658, 531214638, 531525154, 531899681, 532341766, 532831039, 533331909, 533807220, 534232750, 534604378, 534937325, 535257416, 535590210, 535952911, 536351814, 536785049, 537246399, 537727547, 538218422]
3488E38218422M90189M81338M71344M71420M89579N25054N63927N84336N66825N06249
3498E43368683M18854L34816K83813K80991L17650L68766M07563M20875M16336M15077
3508E47033424M36554M85154N47142N98869O22406O15730N93872N76744N75905N86243
3518E52672043N88264N60532M92783L93791K88772K09771J82075K16751L06969M29077
3528E56340828N50651O38695O71234O47316N90630N41229N38368N97763O98281P87811
3538E62602806Q06732P21627N45768L37105J70403R9563J31607K28997L34396M05121
3548E66384125M33655M41856M58794M98313N52636O06575O54792P09382P83081Q63227
3558E72386436Q96759Q04635N27153P1182m65698r22776j139145j029739o24962o0730
$$ y = [538218422, 538708611, 539189949, 539661293, 540132713, 540622292, 541147346, 541711273, 542295609, 542862434, 543368683, 543787537, 544122353, 544406166, 544687157, 545004807, 545373573, 545781136, 546202011, 546618347, 547033424, 547469978, 547955132, 548502274, 549101143, 549723549, 550339279, 550933151, 551509895, 552085800, 552672043, 553260307, 553820839, 554313622, 554707413, 554996185, 555205956, 555388031, 555604782, 555911751, 556340828, 556891479, 557530174, 558201408, 558848724, 559439354, 559980583, 560518951, 561116714, 561814995, 562602806, 563409538, 564131165, 564676933, 565014038, 565184441, 565284004, 565415611, 565644608, 565979004, 566384125, 566817780, 567259636, 567718430, 568216743, 568769379, 569375954, 570030746, 570740128, 571523209, 572386436, 573283195, 574087830, 574614983, 574686165, 574220467, 573297691, 572158546, 571128807, 570503845, 570443115]
3568E70443115M79012Q38890R44557Q20274N63164K99072J36834J37367K94990N40543
3578E75497818P55653Q11005O15158J60790m55895j060562j467094j558190j339073
3587E71959610r36546n41230l20434l47862n80445q90541j130066j190605j037674
3596E64984207p07626k83737J31874M41055N60646M35562M9782n64613j327553k127724
3606E61591873k856140l445358l899651m305076m799843n514565o487350p593308q523140
3615E14167442q846016q153114o238632l239823L44658L786774O377602P685165P705536
3624E13589592O834831N675926M775734M416771M554787M908028N134124M998551M454918
3633E59343262L630676K743607K007751J562729J435890J534615J663246J574020J052361
$$ y = [570443115, 570922127, 571761017, 572705574, 573525848, 574089012, 574388084, 574524918, 574662285, 574957275, 575497818, 576253471, 577064476, 577679634, 577840424, 577384529, 576323967, 574856873, 573298683, 571959610, 571023064, 570481834, 570161400, 569813538, 569233093, 568342552, 567212486, 566021881, 564984207, 564276581, 563992844, 564124718, 564565773, 565126419, 565561981, 565611763, 565047150, 563719597, 561591873, 558735733, 555290375, 551390724, 547085648, 542285805, 536771240, 530283890, 522690582, 514167442, 505321426, 497168312, 490929680, 487689857, 488034515, 491821289, 498198891, 505884056, 513589592, 520424423, 526100349, 530876083, 535292854, 539847641, 544755669, 549889793, 554888344, 559343262, 562973938, 565717545, 567725296, 569288025, 570723915, 572258530, 573921776, 575495796, 576548157]
3642E76548157J9073j399688k879525m003219m430046m045067l016396j720085n71518
3651E54501686J51711M05578L57399K69547L58925P05070J236801J786881K170143
3660E61943741K250786J976700J388244O04515k08702q85849j318130j493378j497650
3669E62760277j467095j510391j642914j774025j756324j474991r23767k25869M05846
3678E52390747P46536O30989r422j146660k672081m409408o129952p574730q506851
3687E23319168q779449q390885p494812o343612n194855m214478l430633k748184k008324
3696D74713936j062203J83449J741409L543969N444679P229958Q649292R477691R596558
3705E19518738R061928Q114776P112961O405563O199341O482735P041054P555923P740708
$$ y = [576548157, 576567230, 575167542, 572288017, 568284798, 563854752, 559809685, 556793289, 555073204, 554501686, 554653397, 555058975, 555416374, 555685921, 556044846, 556749916, 557986717, 559773598, 561943741, 564194527, 566171227, 567559471, 568163986, 567955284, 567069435, 565751305, 564257927, 562760277, 561293182, 559782791, 558139877, 556365852, 554609528, 553134537, 552210770, 551984901, 552390747, 553137283, 553768272, 553758850, 552612190, 549940109, 545530701, 539400749, 531826019, 523319168, 514539719, 506148834, 498654022, 492310410, 487115555, 482901077, 479470444, 476722260, 474713936, 473651733, 473835182, 475576591, 479120560, 484565239, 491795197, 500444489, 509922180, 519518738, 528580666, 536695442, 543808403, 550213966, 556413307, 562896042, 569937096, 577493019, 585233727]
3714E85233727P447242O706200N688705M623528L709335L061333K704964K604446K698555
3723F24478035K919769L188248L391571L382530L015442K219620J084289j10702r57108
3732F42611694j075821l09143J151963K793960L974533M209976L407135J914673L50952
3741F59029922p07321j006851p16476k85797j54191m80422j053925j436234j242446
3750F51946259l87040Q49076J969909K535477K393417J737976R77402M98352M68903
3759F62989731P81250J148071J279297J032104M65928k10495p47147r56421p72705
3768F65009613k60544M16794J046906J430511J445618J095352N14221p9040m72641
3777F70146790n57175l67584n3177K13852L33938L23792K85873L25852M81186P02972
$$ y = [585233727, 592680969, 599387169, 605075874, 609699402, 613408737, 616470070, 619175034, 621779480, 624478035, 627397804, 630586052, 633977623, 637360153, 640375595, 642595215, 643679504, 643568802, 642611694, 641535873, 641226730, 642378693, 645172653, 649147186, 653357162, 656764297, 658678970, 659029922, 658322601, 657315750, 656599274, 656313477, 656159286, 655678864, 654624939, 653188705, 651946259, 651559219, 652408295, 654378204, 656913681, 659307098, 661045074, 662022476, 662520828, 662989731, 663770981, 664919052, 666198349, 667230453, 667696381, 667485886, 666738739, 665782318, 665009613, 664749069, 665165863, 666212769, 667643280, 669088898, 670184250, 670698471, 670619431, 670146790, 669589615, 669222031, 669168854, 669382706, 669716644, 670040436, 670326309, 670652161, 671133347, 671836319]
3787F71836319R01108J010132J028595R97009R44824Q43048O16837K05307l68271r76639
3797F77038269j440887j628952j529770j253510r48639o96411m54025r5139M78668
3806F69469604J229630J956711K381973K297440J684646P33261k59170j035233j488037
3815F76970825j666412j688156j626587j454544j084137m63333L37600J125794J674270
3824F72125320J845475J670379J321793J001968Q12683O94809M76380L967p33261j563110
3834F77656403k204667k418594k130279j460190o35147J55563Q63342J568985K358856
3843F73754272L169785L714905L569870K396393J92337k583237n108185o503296o213989
3852F66388855m277191j334305J628189L690262M360809L731003K349396R15756n3329
$$ y = [671836319, 672737427, 673747559, 674776154, 675773163, 676717987, 677561035, 678177872, 678383179, 678014908, 677038269, 675597382, 673968430, 672438660, 671185150, 670236511, 669540100, 669086075, 668990936, 669469604, 670699234, 672655945, 675037918, 677335358, 679020004, 679753265, 679494095, 678458862, 676970825, 675304413, 673616257, 671989670, 670535126, 669450989, 668987656, 669325256, 670451050, 672125320, 673970795, 675641174, 676962967, 677964935, 678777618, 679472427, 679948807, 679952774, 679219513, 677656403, 675451736, 673033142, 670902863, 669442673, 668807526, 668963089, 669826431, 671395416, 673754272, 676924057, 680638962, 684208832, 686605225, 686797562, 684214325, 679106140, 672602844, 666388855, 662111664, 660777359, 662405548, 666095810, 670456619, 674187622, 676537018, 677452774, 677399445]
3861F77399445m10996l58047k48413l56598p28760j186600j458893j344528q23440
3870F70483170n5695P06177J237564J425476J286850R26208M72336L0441l34396n87845
3880F75590286p10678o99768n75333l90777k21939j33820j42593j90582j69602K6932
3890F72382126M29916R51996J401367J557083J269608N43365m52117j442566k152787
3899F74487991k410812k192459j606522q30536l8833O40869J138687J424713J492386
3908F72105484J352158J035156N99289J25046l01056o05393p44400p13577n45578l03040
3918F72004089o2027J11466J85470J72425J18026P0649M6157J6404o7826k30713m34494
3929F71929626n80978n63888l39509L0518L97644O02875N65033L23715J1368k28272
$$ y = [677399445, 676988449, 676630402, 676381989, 676025391, 675296631, 674110031, 672651138, 671306610, 670483170, 670427475, 671133652, 672371216, 673796692, 675083542, 676009750, 676482086, 676512527, 676178131, 675590286, 674879608, 674179840, 673604507, 673213730, 672991791, 672857971, 672715378, 672524796, 672355194, 672382126, 672812042, 673764038, 675165405, 676722488, 677992096, 678535461, 678083344, 676640778, 674487991, 672077179, 669884720, 668278198, 667447662, 667408829, 668049698, 669188385, 670613098, 672105484, 673457642, 674492798, 675092087, 675217133, 674916077, 674310684, 673566284, 672852707, 672307129, 672004089, 671942062, 672053528, 672238998, 672411423, 672529449, 672600098, 672646255, 672662659, 672594833, 672364120, 671929626, 671348648, 670784760, 670445251, 670475769, 670873413, 671476288, 672041321, 672365036, 672376404, 672148132]
3939F72148132l19290k82211j98441j44882j45798j74255j90201j77460j50146j27869
3949F70237579j07956o6833J0910R9945J40305P8659p8583k54593l46298l01209j62582
3960F69249344m3640m1199j57852k95105l31421k25525o1417J3886q8196l12347m89273
3971F67217255m72260k68402n5008m6539l09143o77872q65707o99463k97470k0905
3981F63504486j96762q20007j481476j649323j125183l23410p4844j001969k878341
3990F53953171m535980m582901k642289l16467j068649q746758k5339012m9173546
3998E57547569p4731292r4464226
4000C88352051
$$ y = [672148132, 671828842, 671546631, 671348190, 671203308, 671057510, 670883255, 670693054, 670515594, 670365448, 670237579, 670129623, 670062790, 670073700, 670173645, 670313950, 670392609, 670314026, 670059433, 669713135, 669411926, 669249344, 669205704, 669164505, 669006653, 668711548, 668380127, 668154602, 668093185, 668107071, 668018875, 667706528, 667217255, 666744995, 666476593, 666421585, 666375046, 666065903, 665388031, 664522324, 663822861, 663525391, 663504486, 663307724, 662487717, 661006241, 659356918, 658231735, 657908325, 657833481, 656831512, 653953171, 649417191, 644834290, 642192001, 641875534, 640806885, 632060127, 606721115, 557547569, 482816277, 388352051]
##END=$$ End of the data block
