##TITLE=$$ Begin of the data block
##JCAMP-DX=5.00 $$ ACD/SpecManager v 10.08
##SPECTROMETER/DATA SYSTEM=16PC
##DATE=24 May 2013 13:07:58
##DATA TYPE=INFRARED SPECTRUM
##DATA CLASS=XYDATA
##ORIGIN=
##OWNER=
##NPOINTS=3601
##FIRSTX=400.00000000
##LASTX=4000.00000000
##MAXX=4000.00000000
##MINX=400.00000000
##MAXY=303.10879517
##MINY=18.94819641
##XFACTOR=1.0000000000
##YFACTOR=0.000001000000000
##FIRSTY=66.83585358
##DELTAX=1.00000000
##XUNITS=1/CM
##YUNITS=TRANSMITTANCE
##XYDATA=(X++(Y..Y))
400 66835854 94148445 127490021 144705460 167021271 219201447 268478241 287970398 284782593
408 284782593 249663208 204799988 172745102 143153503 107856133 82876709 90213631 103773567
416 103773567 102237244 93280624 71445747 54814789 68269798 85953163 87088699 81314156
424 81314156 68064262 57171700 56663582 71391060 112777351 169133179 258781708 303108795
432 303108795 178634567 38278912 26583241 45202923 28927683 22895622 57817078 111764694
440 111764694 187734314 241666656 203301239 154237274 180592987 198550705 125255630 43936989
448 43936989 21521709 24061798 40042614 69090889 117178680 153755356 136221191 106695534
456 106695534 97779007 95427872 97516586 100890945 100730057 99908234 99807335 100083733 101099701
465 101099701 102119186 102369263 102322624 102156662 101984383 102156876 102136993 101095123 100259399 101008560
475 101008560 102060867 102475380 102608200 102368210 102155991 102568581 102925346 102497765 102026558 102146240
485 102146240 102446869 102740982 102995255 103035477 103096481 103420853 103810928 104172752 104437492 104511215 104375145
496 104375145 103826881 103323242 103424759 103617905 103464485 103298927 103354187 103496475 103692505 103873535
506 103873535 103917862 103950882 104110077 104237267 104184723 104058334 103885437 103754021 103818253 103906723 103852913
517 103852913 103796097 103842850 103924652 104034546 104094193 103976151 103820564 103725937 103689339 103760956 103879883
528 103879883 104024651 104126762 104072876 103975746 103925156 103876328 103796692 103739426 103773041 103818871 103802536 103779411
540 103779411 103787422 103804352 103825905 103836151 103803375 103770683 103773804 103803085 103880119 103946831 103924202 103896477
552 103896477 103938866 103999329 104055328 104093338 104071808 104051872 104094528 104158302 104223061 104285576 104330132 104374077
564 104374077 104445389 104496147 104461792 104419991 104437973 104482315 104561852 104616783 104562119 104482079 104430649 104413483
576 104413483 104484154 104552528 104518486 104465630 104454971 104454018 104455208 104444458 104382202 104336952 104393410 104463219 104485031
589 104485031 104462219 104344009 104231071 104237724 104272102 104278488 104262466 104198502 104124191 104065681 104031708 104043961
601 104043961 104089661 104174515 104264618 104320427 104364319 104406235 104443886 104478813 104509117 104534294 104551361 104558250
613 104558250 104551651 104509590 104485794 104550194 104631927 104676361 104704453 104727577 104719444 104655548 104541924 104353119
625 104353119 104158905 104025459 103937767 103914619 103920532 103910347 103931664 104026100 104166153 104352760 104541924
636 104541924 104676483 104796501 104930664 105055809 105164841 105237961 105230118 105209686 105242462 105291008 105342148
647 105342148 105388687 105414368 105432869 105472656 105472969 105365677 105201263 105005882 104784317 104567337 104303001
658 104303001 103909683 103507187 103193474 102952194 102807785 102735542 102745796 102757790 102662964 102554749 102497383
669 102497383 102469727 102475883 102504112 102521469 102595375 102795815 103081894 103451988 103857994 104260704 104631447
680 104631447 104907845 105151436 105416443 105662346 105858353 106029221 106190369 106338905 106481789 106604721
690 106604721 106691956 106754662 106795715 106823944 106850006 106871292 106885529 106902077 106938889 106967850 106958076 106935570
702 106935570 106918144 106899498 106860779 106857468 106978485 107104584 107118462 107102890 107109520 107114288 107099319 107097672
714 107097672 107161377 107215477 107180573 107121658 107077858 107047295 107043198 107059166 107100891 107145142 107165833 107177162
726 107177162 107182121 107187988 107211639 107226967 107202072 107171036 107159637 107160522 107182404 107202553 107197525 107178093 107139297
739 107139297 107104797 107103416 107114388 107134842 107139610 107087685 107023598 106975098 106951378 106992912 107033279 107006332
751 107006332 106951477 106880470 106809853 106768082 106730911 106685211 106625870 106527832 106437729 106415154 106396172 106328392
763 106328392 106236771 106126709 106004333 105879852 105746124 105612564 105439613 105182739 104866051 104502724
773 104502724 104080750 103602501 103037857 102344559 101560997 100671837 99795700 99023437 98422745 98112030
783 98112030 98029709 98177765 98483612 98898239 99352859 99757744 100126434 100449440 100705811 100892303
793 100892303 100945999 100815964 100462791 99889183 98917625 97429848 95250725 92190529 88174583 82823227
803 82823227 76861618 70581100 64903160 60821892 58410713 58285568 59812759 62638592 66538857
812 66538857 71308899 76536301 81897141 86921120 90964790 94223640 96590950 98329803 99639389
821 99639389 100604530 101385262 101955009 102301880 102541924 102815224 103037666 103166153 103217407 103171753 103095268
832 103095268 103072212 103028275 102897926 102738976 102603340 102443024 102203033 101956177 101757263 101605179
842 101605179 101531120 101492615 101448250 101425888 101435516 101489380 101622772 101776215 101893761 101999832 102102280
853 102102280 102194901 102269432 102339813 102425049 102501343 102540375 102574730 102640320 102698563 102714539 102712845 102715256
865 102715256 102695061 102618332 102528358 102457787 102404404 102388954 102375198 102330444 102264572 102172974 102066277 101951385
877 101951385 101834869 101733971 101623489 101477859 101315285 101145645 100968071 100794411 100596138 100329422
887 100329422 100051949 99812981 99593971 99398590 99209091 98993011 98797913 98659729 98580742 98586937 98643158
898 98643158 98717476 98826004 98977325 99162148 99378296 99612953 99852158 100096962 100354149 100592377
908 100592377 100766037 100924538 101109596 101298546 101492264 101661636 101760406 101840546 101950905 102054451
918 102054451 102126930 102178528 102208733 102225349 102236008 102240417 102242516 102237129 102215530 102192116 102175926 102174118 102203293
931 102203293 102244019 102282524 102318359 102348495 102366730 102361748 102345749 102341080 102305817 102198578 102040077 101839043
943 101839043 101589989 101295494 100939987 100515076 100001648 99377151 98643181 97806046 96828911 95680283
953 95680283 94350288 92814972 91085121 89134499 87049934 84886909 82713058 80599930 78591133
962 78591133 76739403 75088737 73704193 72574997 71732567 71115112 70688103 70400810 70211502 70058418
972 70058418 69883942 69633530 69257164 68683647 67802048 66681458 65305115 63819431 62311886 60942268
982 60942268 59903145 59183548 58845470 58862495 59257362 59944534 60855461 61961887 63222908 64607689
992 64607689 66086319 67615051 69156334 70661591 72078606 73380615 74520683 75506805 76322533
1001 76322533 76994087 77535553 77966644 78302666 78570602 78785416 78998352 79258133 79587242 80020042
1011 80020042 80569336 81260155 82090042 83088226 84184570 85324692 86490417 87653877 88789703
1020 88789703 89864777 90874481 91816162 92650436 93324402 93875763 94322891 94670723 94933891 95101311
1030 95101311 95173454 95130013 94947693 94635696 94209862 93626808 92844391 91874619 90708397 89366722
1040 89366722 87846497 86210754 84518028 82778503 81034370 79247879 77398277 75476692 73477097
1049 73477097 71370056 69107964 66738983 64253189 61777042 59407375 57223225 55324554 53745293
1058 53745293 52562546 51746391 51303741 51200962 51413605 51920677 52697109 53730583 55007408 56506298
1068 56506298 58194733 60092472 62214256 64542580 67078590 69780731 72648163 75559738 78418304
1077 78418304 81150673 83652016 85920097 87912437 89644714 91101982 92333527 93373940 94252487
1086 94252487 95011589 95646095 96161911 96568130 96866463 97084877 97250893 97367287 97455521 97486946
1096 97486946 97427414 97314667 97179504 97008347 96792839 96547890 96281624 96005722 95739700 95468063
1106 95468063 95171043 94880981 94626518 94398949 94202377 94026779 93855568 93712425 93618988 93564529
1116 93564529 93548843 93561935 93589569 93644234 93727753 93857788 94065186 94312164 94574043 94842049 95099686
1127 95099686 95345375 95579651 95779633 95924950 96008606 96017052 95949265 95801231 95568321 95241638 94829773
1138 94829773 94343040 93766998 93086266 92313667 91458275 90515854 89487907 88366241 87150238 85818481
1148 85818481 84348747 82742569 80995132 79103065 77058937 74869942 72523140 70071480 67558594
1157 67558594 64999268 62410114 59829044 57286549 54821346 52479553 50269436 48216007 46315071
1166 46315071 44576000 42982815 41531227 40195297 38952160 37788269 36676907 35634613 34672283
1175 34672283 33780048 32945942 32186867 31520819 30932211 30402731 29958319 29629969 29384016 29183529
1185 29183529 29069233 29083012 29184101 29341959 29567623 29870390 30224775 30601238 31021214 31502960
1195 31502960 32026146 32571316 33153843 33782909 34457466 35166763 35948872 36840797 37834930 38920353
1205 38920353 40143845 41557098 43134308 44862793 46754623 48826931 51051712 53421497 55891514
1214 55891514 58429146 60990311 63533569 66018196 68399384 70647934 72717407 74614479 76327873
1223 76327873 77864738 79228592 80419037 81434654 82282066 82964012 83490608 83872078 84110687
1232 84110687 84207054 84176277 84039780 83779045 83382652 82850479 82185265 81366989 80384995 79213737
1242 79213737 77817680 76216171 74403717 72419144 70269272 68044662 65821625 63649582 61593388
1251 61593388 59682846 57985283 56452847 55062935 53806828 52678440 51647041 50676105 49776817
1260 49776817 48951672 48189877 47468590 46826290 46294189 45870949 45562767 45378159 45324158 45411369
1270 45411369 45654556 46048164 46595478 47284435 48112465 49054169 50093124 51199627 52333210 53509640
1280 53509640 54739166 55997536 57304932 58538033 59620045 60431576 60854458 60807846 60113762
1289 60113762 58945225 57297062 55525566 53917072 52676247 52117371 52197716 53014252 54462002
1298 54462002 56501556 59033058 62017200 65232803 68497322 71655174 74473022 77001259 79173561
1307 79173561 81106804 82894875 84540154 86077568 87503197 88831474 90042091 91113945 92063690
1316 92063690 92894455 93625450 94275238 94848610 95360252 95798798 96145752 96437027 96698738 96941658
1326 96941658 97187210 97429443 97665787 97907593 98174881 98438812 98675278 98889877 99090645 99246071
1336 99246071 99298737 99334312 99426460 99553726 99745605 99922707 99997711 100023819 100027870 100001572 99938484 99859856
1348 99859856 99787209 99713158 99636292 99559906 99473045 99416779 99446251 99508026 99574043 99623154 99627014 99578880
1360 99578880 99419853 99277733 99310448 99368332 99370499 99268578 98930862 98526428 98207428 97892929 97544693
1371 97544693 97186539 96787025 96473671 96437477 96456505 96364662 96185303 95865105 95467949 95052574 94580795
1382 94580795 94045280 93411896 92596054 91741562 90956566 90263176 89778542 89325333 88771889 88098289
1392 88098289 87185143 86199112 85403534 84388992 82885002 80738136 77672050 73784828 69032860
1401 69032860 63564751 57197021 50882076 45379589 41084167 38809299 38057732 38674019 40446209
1410 40446209 43192577 46666695 50581097 54876968 59474014 64149117 68618103 72983696 77404999
1419 77404999 81428383 84555199 87079475 89072159 90703728 92209625 93465897 94379593 95092896
1428 95092896 95694061 96251724 96935486 97530457 97864601 97978897 97714066 97498581 97852829 98341820
1438 98341820 98721436 98939491 98793365 98490143 98206734 97831032 97278114 96643158 95955635 95327591
1448 95327591 94968369 94615509 94046906 93350769 92637375 91618225 89824890 87907433 86399437
1457 86399437 85181900 84420868 83794785 82999893 82148643 81137558 80310318 80069801 80134628 80403801
1467 80403801 80738998 80955383 81091263 80998398 81051445 81694672 82570885 83431198 84394737 85506149
1477 85506149 86739876 88083412 89542030 91165665 92807648 94369003 95756622 96808266 97632195
1486 97632195 98243713 98759201 99272278 99866150 100782249 101639320 102088692 102273842 102117371 101933266
1496 101933266 102069733 102346512 102733994 103128357 103454300 103596710 103417160 102910301 101716019 100760124
1506 100760124 101148079 101980850 102738235 103389069 103645393 103757095 103946609 104008224 103674126 103352638
1516 103352638 103511688 103704498 103547569 103318932 103108192 103096939 103693100 104307076 104297157 104227325 104567078
1527 104567078 104957794 105202911 105285789 105033585 104718254 104540230 104541107 105054283 105404564 104798599 103924202
1538 103924202 103112717 102640053 103126907 103869888 104272362 104634712 105121735 105543350 105730225 105784698
1548 105784698 105722595 105633904 105667946 105662460 105461906 105195160 105072998 104694176 103316452 102173538
1558 102173538 102562614 103551079 104777145 105825256 105929466 105778908 105929802 106014778 105758812 105440971
1568 105440971 105214188 105181595 105688019 106161041 106015396 105634163 105087402 104728790 105132843 105706932
1578 105706932 106005981 106161690 106106163 105992958 105989029 105986359 105914970 105827522 105765556 105692078 105573463
1589 105573463 105441025 105326553 105194710 105005714 104804375 104623985 104458923 104330185 104191254 104001236
1599 104001236 103764175 103472206 103120163 102708145 102212234 101621483 100896713 99967834 98916504 97835396
1609 97835396 96621132 95182541 93575333 91849823 89930870 87509941 85337280 84156677 83678673
1618 83678673 84030411 84705635 85162613 85634949 86201759 86784454 87412117 87840721 87802910 87397507
1628 87397507 86730431 85512802 83269882 80664894 77973267 75883629 75144669 75851395 78779144
1637 78779144 82635208 86426041 90029427 92969200 95313431 96925354 97943207 98269913 98474358
1646 98474358 99266098 100126076 100883339 101203011 100309372 99353836 99387695 99935341 101070259 102196335
1656 102196335 102607491 102706833 102662613 102473160 102120491 101821663 101871063 102018501 102172829 102151299 101588943
1667 101588943 100940918 100566551 100388405 100586746 100747772 100383400 99896477 99523117 99275162 99404999
1677 99404999 99426910 98785378 97942093 97312019 96479820 94789001 93377777 93588470 94152069 94083023
1687 94083023 93873047 93691658 93519783 93458221 93316605 92920853 92322876 91378708 90501663 90334465
1697 90334465 90044853 88653687 87244102 86868286 86639908 86020752 85018661 83294937 81350609
1706 81350609 79757812 77964424 75535271 72691467 69559647 65987732 61774754 57193756 52453373
1715 52453373 47545647 42330360 37412712 33446762 30145596 27519749 25330709 23247599 21557974
1724 21557974 20547531 19890856 19292782 18948196 19026089 19308853 19508718 20004890 21235966 22735809
1734 22735809 24051044 25581837 27630566 30036949 32737923 35744095 39115570 42640686 46107910
1743 46107910 49576687 53084541 56485390 59590027 62565041 65508629 68436455 71469017 74389793
1752 74389793 77006958 79366852 81399963 83261749 85152557 86867882 88212227 89358688 90388824
1761 90388824 91381714 92533920 93574501 94224335 94704391 95155861 95538971 95861504 96121857 96237228
1771 96237228 96458717 97131035 97890350 98457024 98922852 99283073 99547699 99679634 99815132 100137634
1781 100137634 100468254 100644989 100800491 101030899 101283691 101581879 101794838 101737854 101595993 101446770
1791 101446770 101427933 101801964 102272057 102618813 102872299 102953217 102970146 102992317 103058456 103256226 103507759
1802 103507759 103782196 104025909 104153633 104229279 104291344 104330872 104331375 104353996 104474472 104632378 104804108
1813 104804108 104954956 105020828 105065964 105144859 105222275 105276749 105321266 105384872 105397842 105235382 105091400
1824 105091400 105190559 105315758 105285187 105217361 105133339 105143333 105454895 105797005 105919411 105967041 106003357
1835 106003357 106022545 106036949 106055473 106123474 106143639 106003090 105793831 105497978 105332138 105631157 106022331
1846 106022331 106191177 106297684 106405258 106489082 106542824 106574318 106583931 106587502 106603981 106624245 106645294 106667496
1858 106667496 106690453 106713173 106737923 106754257 106764725 106732391 106601738 106430862 106218956 106087234 106209160
1869 106209160 106426903 106655243 106849815 106908585 106919167 106942154 106956482 106958008 106956551 106965088 106969666 106958481
1881 106958481 106937767 106901672 106874512 106905151 106914162 106801888 106677750 106620689 106622406 106742569 106855865
1892 106855865 106813240 106745598 106753464 106778786 106797310 106807945 106798454 106777664 106746529 106716248 106705780 106692787
1904 106692787 106659531 106611015 106537750 106465408 106417061 106390808 106407211 106421921 106400322 106333420 106178665 106001999
1916 106001999 105839348 105737946 105812576 105896446 105814148 105706192 105669113 105659271 105677917 105686638 105632683 105560280
1928 105560280 105499771 105439972 105376602 105319283 105277992 105247070 105228569 105209251 105176468 105130386 105068848 104986145
1940 104986145 104842972 104737709 104796196 104896667 104946754 104983971 105015541 105039902 105057213 105069443 105079460
1951 105079460 105084442 105074188 105073448 105114288 105164291 105198692 105226227 105241631 105261993 105312325 105363419 105390121
1963 105390121 105405067 105400970 105412292 105481461 105577301 105691216 105797813 105858826 105904099 105952812 105998398 106037903
1975 106037903 106079651 106133034 106191849 106257507 106316467 106349800 106375076 106407310 106435081 106446358 106457947 106491493
1987 106491493 106520103 106516434 106503387 106486389 106490585 106562950 106643219 106676003 106693695 106713745 106725433 106717224
1999 106717224 106708717 106721664 106737732 106745102 106745834 106734558 106721642 106718155 106716248 106711151 106704330 106695007 106685066 106680801
2013 106680801 106667946 106622650 106579895 106572556 106583168 106609962 106638550 106649826 106655952 106661102 106669922 106693222 106716560
2026 106716560 106727196 106730652 106727554 106719681 106706879 106695648 106693146 106697151 106711197 106725021 106727905 106724716 106710960
2039 106710960 106703850 106725357 106756615 106786964 106813690 106828926 106837364 106841370 106839821 106826828 106818726 106836342 106860115
2052 106860115 106875374 106887985 106898880 106908058 106916977 106921982 106919624 106910538 106890556 106870605 106859871 106859184 106877014
2065 106877014 106899353 106915161 106923912 106920242 106907654 106884529 106860855 106846069 106839966 106851936 106862495 106847717
2077 106847717 106830307 106827805 106831718 106842995 106850624 106838631 106822708 106813881 106809853 106814171 106819984 106818199 106819077 106831764
2091 106831764 106850357 106875320 106896660 106899330 106898926 106908630 106920387 106928108 106938789 106958412 106983871 107019897 107048988
2104 107048988 107045723 107038498 107051323 107071777 107097435 107122231 107136726 107148361 107160995 107175919 107199814 107220200
2116 107220200 107220413 107219406 107233002 107253838 107282639 107310959 107328392 107341263 107352425 107361885 107370468 107378288 107386139
2129 107386139 107392647 107395241 107398293 107406830 107416176 107421234 107428337 107447334 107462456 107456039 107443214 107431648 107425926 107437111
2143 107437111 107453300 107464813 107475998 107488937 107500359 107506203 107510826 107518669 107525467 107528946 107527306 107513351 107500671
2156 107500671 107505272 107512428 107509804 107505966 107506485 107507706 107507629 107506683 107501961 107501175 107515862 107531502 107533501 107533432 107539268 107547142
2172 107547142 107555481 107565262 107577034 107590340 107606339 107620453 107628799 107630493 107618355 107607361 107614059 107626266 107635948
2185 107635948 107647110 107662506 107677628 107688210 107695984 107701233 107703949 107702423 107701897 107707619 107717514 107732674 107748627
2198 107748627 107758522 107770515 107794144 107818199 107835075 107843185 107831474 107820511 107833435 107851364 107861519 107868431
2210 107868431 107871437 107873154 107875420 107879761 107888481 107900925 107920120 107936981 107940338 107939148 107939102 107938530 107938004 107936401 107931015
2225 107931015 107927063 107929634 107936050 107946632 107957314 107961632 107966782 107981750 107994438 107991859 107985542 107983421 107983253 107987495
2239 107987495 107989883 107980919 107972404 107976433 107982346 107982849 107979774 107970497 107960892 107956528 107955551 107960342 107963417 107955475 107944130
2254 107944130 107929893 107924721 107947609 107977631 108003975 108014961 107979866 107944702 107956024 107981491 108005234 108024284
2266 108024284 108026268 108023499 108023834 108028122 108043312 108058830 108063408 108065819 108071587 108079193 108090782 108100845 108103371 108101959
2280 108101959 108097382 108092072 108089424 108086967 108082123 108078362 108080460 108081718 108074615 108066345 108062866 108060074 108056519 108050224 108034561
2295 108034561 108021690 108028152 108034035 108021210 108000847 107973717 107952782 107958176 107968971 107968544 107964088 107955933 107947990
2308 107947990 107945465 107944611 107941986 107941605 107947227 107956146 107971146 107979271 107960487 107938553 107930756 107936188 107965111 108001328
2322 108001328 108029724 108057091 108088089 108113983 108120796 108128716 108162521 108194160 108193466 108191391 108217712 108245491 108256958
2335 108256958 108254097 108229324 108193329 108145477 108111855 108137817 108164833 108145042 108091545 107981659 107874771 107829330
2347 107829330 107825180 107869408 107938576 108017181 108088493 108124969 108143234 108143379 108147194 108188011 108231094 108250877 108252838
2360 108252838 108230545 108193947 108150024 108100983 108050201 108000992 107961197 107920334 107864952 107811638 107775017 107747360
2372 107747360 107725716 107710358 107703018 107696274 107676620 107663986 107679031 107705948 107737732 107768440 107786606 107801651
2384 107801651 107818527 107838989 107870651 107900597 107915520 107923843 107927895 107932350 107943817 107958580 107975533 107993103
2396 107993103 108006073 108024139 108061577 108099152 108120728 108131264 108125069 108117676 108125778 108140274 108158348 108177635
2408 108177635 108194588 108209969 108222961 108234711 108247734 108257034 108255554 108251907 108254196 108256653 108255173 108252693 108250282
2421 108250282 108249352 108251617 108257004 108269592 108278633 108270142 108257843 108253403 108248878 108239151 108227249 108213188 108200958 108196831
2435 108196831 108193970 108186081 108177567 108168938 108165314 108176926 108188911 108189102 108179596 108151627 108125542 108123634 108131264 108144165
2449 108144165 108153435 108145020 108129883 108112717 108098007 108095238 108094025 108083984 108074280 108074043 108072899 108061501 108045746
2462 108045746 108027191 108009262 107996727 107986809 107976273 107971069 107979866 107991333 107994766 107996628 108001587 108003952 107997200
2475 107997200 107988235 107982491 107977745 107972359 107969833 107972595 107982132 108003876 108028198 108046700 108061096 108067223 108074257 108093117
2489 108093117 108114243 108132530 108145424 108145905 108142159 108139442 108139320 108144592 108156708 108183311 108208511 108214447 108214569 108217049
2503 108217049 108219650 108225227 108226349 108210373 108195732 108202599 108212921 108215073 108209778 108188293 108167145 108164116 108166458
2516 108166458 108167267 108166481 108159111 108152649 108154060 108159660 108168938 108179375 108188934 108195518 108193657 108191086 108195137 108201195 108205338
2531 108205338 108212540 108228851 108247017 108261490 108273170 108280037 108285263 108290192 108298035 108316635 108333061 108330055 108328247
2544 108328247 108348633 108372833 108389542 108398338 108390930 108379387 108373596 108371689 108376312 108383514 108390091 108396271 108399651 108404663
2558 108404663 108419083 108430405 108425568 108413651 108398560 108382584 108369156 108358665 108354713 108350990 108340309 108328911
2570 108328911 108319855 108315201 108322266 108328316 108317162 108306595 108312202 108324219 108341240 108353493 108342766 108332748 108348747
2583 108348747 108367729 108371803 108370781 108367134 108364792 108369514 108378098 108390572 108402725 108412811 108413383 108387497 108361740
2596 108361740 108366180 108373329 108361221 108343361 108324501 108308983 108306953 108305740 108292603 108277657 108268021 108259819 108252045
2609 108252045 108243057 108229591 108215210 108202812 108191154 108181190 108169220 108149551 108129021 108112381 108100006 108095314
2621 108095314 108093880 108093857 108090782 108075546 108060051 108054733 108054634 108060982 108065559 108055473 108045792 108050156 108059692 108071304 108081245
2636 108081245 108085175 108081696 108062599 108043594 108041573 108044479 108045860 108045769 108039047 108034752 108044502 108055496 108057327 108054276
2650 108054276 108044983 108035896 108035324 108036163 108030655 108028839 108044411 108058640 108053444 108040306 108021141 108006378 108014320 108022995
2664 108022995 108009125 107994797 107997963 108007622 108022758 108031250 108013962 107990646 107973480 107965706 107980560 108000206 108012131
2677 108012131 108013435 107990692 107962799 107944611 107934616 107939552 107949493 107959412 107961037 107941338 107909248 107862976 107821442
2690 107821442 107809975 107807564 107800720 107792046 107777641 107763313 107752228 107748245 107760857 107776260 107779434 107783318 107797165
2703 107797165 107817032 107844666 107871796 107888390 107901306 107913895 107926727 107942078 107957817 107974716 107986214 107981110
2715 107981110 107973816 107979294 107984398 107976868 107968590 107971169 107973244 107964828 107953163 107941864 107931900 107926682 107922150 107916710
2729 107916710 107906364 107881996 107857155 107845398 107837532 107827522 107819267 107814499 107813599 107819557 107825943 107825874 107823441 107821396
2743 107821396 107816864 107806755 107794357 107782578 107769272 107748917 107734276 107739044 107754875 107782341 107808044 107814911
2755 107814911 107814194 107810974 107806442 107800575 107802078 107825592 107853149 107868835 107880875 107895134 107902649 107889297 107876106
2768 107876106 107884903 107899185 107908653 107916214 107920120 107923767 107930801 107938599 107946419 107951950 107951187 107948181 107947823 107943436 107930138
2783 107930138 107907104 107868530 107824516 107779694 107744667 107739258 107740234 107730507 107711174 107672020 107629799 107601669 107575890
2796 107575890 107540794 107513115 107509758 107518410 107533646 107551529 107566833 107577774 107580109 107575676 107559753 107547546 107555916
2809 107555916 107574890 107602142 107631561 107654549 107675934 107700035 107719757 107729599 107728935 107713318 107688377 107654449
2821 107654449 107622887 107615044 107600929 107548355 107484985 107432480 107376503 107308815 107232643 107145882 107056213 106972572
2833 106972572 106889053 106804703 106713577 106600334 106491974 106414818 106355453 106317993 106275864 106198647 106101845
2844 106101845 105988693 105865356 105738045 105609703 105491920 105364777 105208328 105033943 104847641 104645607
2854 104645607 104423782 104188728 103946350 103694221 103434586 103159233 102857018 102538895 102209999 101876617
2864 101876617 101547287 101220245 100896164 100575974 100253822 99950714 99689270 99458839 99258209 99081467
2874 99081467 98939606 98780365 98555298 98263885 97886749 97431847 96874619 96293159 95733238 95266983
2884 95266983 94987610 94877693 94975945 95207092 95532227 95880913 96175934 96398590 96491287 96493195 96417664
2895 96417664 96284485 96109245 95917816 95737053 95579552 95467300 95398994 95378258 95412186 95518639 95668983
2906 95668983 95845650 96033165 96214745 96376419 96489143 96580978 96677376 96756836 96808167 96825645 96796394
2917 96796394 96730515 96635391 96506042 96341179 96137115 95880386 95598885 95321175 95031570 94717690
2927 94717690 94397858 94081093 93782516 93528648 93294334 93061661 92835236 92605896 92396904 92233322
2937 92233322 92100426 92000771 91907524 91785500 91662003 91554329 91457054 91374634 91294479 91209671 91107513
2948 91107513 90979385 90805794 90559097 90255096 89905640 89494774 89004707 88452675 87843391 87196327
2958 87196327 86534622 85851669 85135887 84425308 83749176 83122177 82560562 82088593 81736443 81502556
2968 81502556 81396057 81414940 81562347 81831665 82222008 82719276 83316086 83991333 84729507 85506363
2978 85506363 86289337 87087723 87907219 88726089 89523743 90302422 91056366 91788696 92496727 93191696
2988 93191696 93883087 94573357 95270493 95967125 96659180 97344612 98026199 98685120 99302719 99880936
2998 99880936 100416374 100906372 101340103 101738449 102123878 102480789 102797127 103084610 103354027 103596069
3008 103596069 103800392 103980705 104143669 104299995 104469559 104631279 104768463 104887627 104989548 105074669
3018 105074669 105142090 105196472 105245445 105278824 105284454 105275703 105265900 105242844 105204750 105133606 105000877 104836273
3030 104836273 104662277 104471992 104259087 104044083 103833389 103662941 103565834 103556969 103677010 103881737
3040 103881737 104150818 104453232 104751015 105044456 105326744 105580925 105782295 105947090 106084702 106190918
3050 106190918 106259872 106305786 106341240 106365250 106376984 106388542 106422897 106446548 106427643 106383965 106316521 106243492
3062 106243492 106187126 106136200 106087349 106038879 105982445 105934525 105916405 105905174 105876823 105855682 105864975 105883766
3074 105883766 105896904 105910011 105921936 105937645 105957390 105994057 106073853 106156967 106202339 106239822 106290123 106339386
3086 106339386 106382820 106413841 106418869 106413841 106415794 106407639 106379387 106326630 106237366 106124161 105997276 105851433
3098 105851433 105671234 105497147 105370209 105273201 105204437 105158188 105117821 105114319 105185555 105293823 105414154
3109 105414154 105545998 105679367 105817268 105963394 106105377 106229210 106343414 106451103 106554245 106656166
3119 106656166 106755829 106855820 106948448 107024452 107090828 107151962 107206085 107253334 107292297 107317589 107341171 107377289
3131 107377289 107413628 107439850 107464027 107494019 107519981 107529373 107537987 107559349 107587555 107623672 107660248 107686615
3143 107686615 107713173 107751465 107787086 107808258 107818558 107813950 107805489 107799103 107805969 107848694 107898712 107931946 107957291
3156 107957291 107975288 107986641 107989738 107991982 108001755 108014153 108027550 108040115 108048035 108055542 108065437 108077957 108094330
3169 108094330 108114243 108140709 108164833 108178665 108182358 108168770 108151695 108140686 108141182 108170364 108202507 108209892 108215523
3182 108215523 108239365 108262558 108268379 108270386 108276894 108286667 108304214 108320641 108322044 108327766 108362457 108396172 108399269
3195 108399269 108395477 108401131 108408424 108412766 108420845 108443237 108463409 108462334 108457733 108461357 108471748 108496262 108520004
3208 108520004 108524300 108527588 108546402 108567810 108582428 108596207 108615204 108629753 108627083 108622192 108627174 108637878 108657738
3221 108657738 108676071 108678963 108679245 108685349 108696388 108718636 108738922 108748337 108740112 108688858 108641289 108639099 108672073
3234 108672073 108765244 108854294 108860443 108852028 108888268 108917473 108891319 108858681 108863258 108872009 108858727 108846542 108853485
3247 108853485 108868408 108888626 108906769 108914543 108912018 108886742 108867950 108892128 108924911 108936905 108949448 108977654
3259 108977654 109010765 109043243 109074425 109103821 109125420 109134193 109126450 109092018 109044907 108985283 108944199 108966660
3271 108966660 109011002 109050606 109085106 109099884 109110901 109136391 109154655 109145187 109122444 109093834 109059784 109017708
3283 109017708 108984039 108980705 108988548 108995056 109001968 109009125 109009674 108992455 108970215 108949471 108937355 108946297 108966751
3296 108966751 109000320 109025879 109011147 108991196 109004333 109008453 108959816 108901497 108862755 108841110 108849762 108870766
3308 108870766 108886810 108908867 108946800 108986588 109019157 109039497 109031387 109019348 109030388 109040665 109030678 109014153
3320 109014153 109002495 108983185 108938622 108895470 108877205 108875725 108901878 108922287 108893272 108856247 108844498 108838676
3332 108838676 108832451 108820053 108787491 108752945 108727600 108718391 108745911 108780144 108796455 108799194 108774017 108752342
3344 108752342 108771416 108799362 108817528 108823181 108795044 108770058 108788254 108818718 108841705 108863808 108887955 108905266
3356 108905266 108906151 108895302 108866501 108842728 108853745 108872726 108882782 108883591 108863731 108839439 108820648 108814667 108832932
3369 108832932 108872887 108946014 109021683 109067108 109100220 109128738 109150551 109164856 109175369 109183929 109195015 109218239
3381 109218239 109240082 109246613 109248329 109253311 109254837 109254028 109235336 109168816 109098694 109059357 109050270 109098267 109155418
3394 109155418 109179230 109179970 109150238 109100464 109022354 108964348 108988281 109045265 109118340 109173439 109153107 109110184
3406 109110184 109084343 109057739 109023834 108988235 108953018 108922096 108905388 108886719 108852127 108804657 108739563 108666061
3418 108666061 108589890 108516647 108457016 108401466 108348969 108284302 108187820 108071777 107935165 107798027 107680008
3429 107680008 107580948 107520866 107458641 107342072 107224152 107129311 107090927 107175369 107307816 107434654 107558395
3440 107558395 107662483 107750275 107819107 107870171 107884239 107919815 108051468 108211517 108355904 108487984 108592911
3451 108592911 108681198 108755562 108824463 108904335 108973740 109010460 109033081 109046555 109069344 109137917 109203171 109232185
3463 109232185 109212753 109089020 108958794 108905174 108916351 109022476 109180573 109382202 109553810 109591866 109577560
3474 109577560 109565353 109531616 109459778 109383102 109321877 109298225 109369255 109450340 109465645 109445717 109378220 109315895
3486 109315895 109324165 109352562 109377548 109383415 109333755 109266853 109211349 109159752 109110764 109074448 109072876 109068634 109028603
3499 109028603 108961868 108841301 108742264 108755112 108807610 108863731 108905174 108889130 108852814 108818649 108788200 108771492
3511 108771492 108765411 108774567 108785530 108787300 108777069 108745766 108701248 108648369 108586807 108510826 108441284 108396812
3523 108396812 108378174 108407715 108439087 108417252 108390594 108396004 108412697 108435181 108454155 108461403 108448051 108384605
3535 108384605 108324501 108326767 108345100 108356018 108349892 108303879 108233925 108135391 108047226 108004715 108014175 108122780
3547 108122780 108243248 108291222 108304955 108278702 108259773 108313515 108379913 108419991 108435745 108406952 108361244 108321281
3559 108321281 108281853 108256554 108211472 108106949 107973602 107789017 107672501 107773926 107979156 108250237
3569 108250237 108508392 108641716 108711433 108732582 108731766 108746788 108758850 108759430 108755470 108755730 108746239 108719276 108664604
3582 108664604 108563950 108433533 108251595 108113647 108126900 108234383 108456375 108668282 108720016 108708115
3592 108708115 108668137 108632729 108662888 108709000 108739685 108761024 108759048 108762314 108811111 108856201 108870743 108827423
3604 108827423 108659836 108458305 108278397 108157944 108195854 108264397 108236954 108208824 108261391 108309456 108284546
3615 108284546 108217499 108076096 107980873 108072472 108258362 108541389 108776016 108785439 108666275 108446098 108155251
3626 108155251 107751701 107479904 107669518 108022690 108369041 108655762 108716484 108721466 108817459 108908585 108934143
3637 108934143 108935310 108940430 108927322 108888649 108807991 108676956 108463860 108086899 107687782 107352470 107166168
3648 107166168 107287407 107582016 108025169 108447289 108633041 108694862 108623764 108568359 108733894 108941147
3658 108941147 109064293 109148361 109195419 109208534 109199692 109143951 109024521 108828712 108490585 108152939 107934334
3669 107934334 107841370 108019447 108170769 107910057 107644913 107702560 107938744 108387680 108841034 109049988
3679 109049988 109169815 109295822 109358856 109311172 109183784 108985443 108735016 108388161 108143188 108250854
3689 108250854 108509277 108819748 109123421 109314919 109435013 109478500 109477898 109476517 109436562 109301086 109170555
3700 109170555 109136154 109168457 109314133 109435799 109386948 109241531 109000038 108736420 108502075 108365150
3710 108365150 108440231 108639168 108954575 109258720 109400032 109442375 109378883 109269859 109175636 109089134 109020355
3721 109020355 108978317 108984161 109011436 109037994 109071854 109148331 109163094 108989212 108729431 108415100 108133293
3732 108133293 107999969 107959747 107981445 108108398 108451340 108776688 108853554 108784607 108579041 108286026 107875656
3743 107875656 107594254 107818436 108127167 108175423 108111641 107894707 107748268 107956650 108296539 108666847
3753 108666847 108985092 109104012 109116669 109028603 108955048 109049294 109202789 109388420 109515068 109429214 109290718
3764 109290718 109221268 109181808 109184074 109197380 109161880 109176704 109375336 109594849 109703827 109741112 109688828
3775 109688828 109585548 109445595 109323502 109283707 109310600 109447693 109581924 109568741 109546135 109638741 109742020
3786 109742020 109778740 109791466 109804131 109795120 109746529 109670921 109579727 109458115 109266541 109090515 109045914
3797 109045914 109001900 108812355 108638786 108605530 108677650 108927109 109157463 109108376 109043503 109190292 109397049
3808 109397049 109614685 109762665 109720444 109558846 109272095 108969261 108759735 108636497 108688019 108737183
3818 108737183 108542374 108385277 108528992 108787392 109098625 109352798 109357498 109298279 109330177 109352135 109302376
3829 109302376 109217834 109110474 108993103 108892532 108778526 108594513 108446022 108441376 108515617 108646988 108814026
3840 108814026 108998657 109168793 109270477 109351204 109472992 109538147 109457993 109267517 108959412 108571861
3850 108571861 108049225 107665657 107750626 108082413 108623047 109150383 109379478 109460640 109444382 109344887 109167786
3861 109167786 108988998 108890579 108859444 108950928 109041473 108995529 108904358 108781555 108724304 108898735 109111572
3872 109111572 109184311 109238739 109376907 109479286 109438942 109319878 109103699 108930489 109005638 109114502 109066460
3883 109066460 108994720 108958099 108988907 109212852 109408310 109312317 109174271 109181381 109257172 109431000 109572601
3894 109572601 109536003 109397530 109150841 108897705 108753609 108670853 108632996 108661507 108781601 108965683 109220932
3905 109220932 109468079 109613846 109707069 109765930 109788872 109780502 109740425 109662964 109568306 109467598 109382034
3916 109382034 109332939 109331032 109422394 109522034 109547928 109536865 109479309 109431961 109470490 109528160 109567184 109576157
3928 109576157 109508156 109431480 109400841 109409973 109487984 109583183 109653709 109699104 109700317 109671021 109611534 109542465
3940 109542465 109479065 109437485 109453079 109483383 109496452 109496017 109461357 109433723 109464310 109502502 109500336 109500931 109548111
3953 109548111 109591507 109581184 109559296 109559036 109557152 109536697 109511871 109485817 109474709 109506462 109548782 109578537
3965 109578537 109595871 109587242 109570358 109561607 109551140 109525581 109511612 109543465 109585091 109610916 109623764 109609749
3977 109609749 109593224 109600349 109611748 109616516 109615303 109599495 109585716 109593369 109605385 109613060 109610558 109575554 109548569
3990 109548569 109577629 109617569 109631393 109642220 109668777 109687111 109671974 109645912 109623169 109603378
4000 109603378
##END=$$ End of the data block
