##TITLE=teste $$ Begin of the data block
##JCAMP-DX=5.00 $$ ACD/SpecManager v 10.08
##DATE=10 Oct 2013 12:29:44
##DATA TYPE=INFRARED SPECTRUM
##DATA CLASS=XYDATA
##ORIGIN=Marcelo Quint
##OWNER=
##NPOINTS=1765
##FIRSTX=399.75695801
##LASTX=3997.56933594
##MAXX=3997.56933594
##MINX=399.75695801
##MAXY=1.02947688
##MINY=0.55503744
##XFACTOR=1.0000000000
##YFACTOR=0.000000010000000
##FIRSTY=1.00000000
##DELTAX=2.03957629
##XUNITS=1/CM
##YUNITS=ARBITRARY UNITS
##XYDATA=(X++(Y..Y))
399.8A00000000k82454j03003P4279L4010j27118j19132R7430K26211J99777J64425
420.2A00164425J59920L70800M59159K38084O0702J48236L56377L81064J01721q0478
440.5A02360010R6655K93553J97470q7953k44915r6846N6625r9635l90590m26721k39384
463A01418269j39106k59566m43101m13179j63317J65558L9387j31727p7694J44380
483.4A00139904K14267L6704j30355o0403J29938J33919q9299k51866j69175o348j4830
505.8I9932456k06101l36164k09052O259L8189r5570j23638Q7100L27259L61854K17408
528.3A00000000K14648L09336L81315K47276N591r1362J3530R7239l516j60289j76382
550.7A00837386m9937J1885j08349k32137j95503p7915l9005j46425j83845j66803
$$ plain form
399.8 100000000 99717546 99614543 99688822 99722832 99595714 99476582 99574012 99800223 100000000 100164425
420.2 100164425 100324345 100695145 101154304 101392388 101453090 101601326 101957703 102338767 102440488 102360010
440.5 102360010 102456665 102750218 102947688 102859735 102614820 102517974 102574599 102474964 102084374 101657653 101418269
463 101418269 101279163 101019597 100576496 100163317 100000000 100165558 100204945 100073218 99995524 100139904
483.4 100139904 100354171 100390875 100260520 100200117 100330055 100463974 100374675 100122809 99953634 99947286 99932456
505.8 99932456 99726355 99390191 99181139 99187398 99225587 99130017 99006379 99093479 99420738 99782592 100000000
528.3 100000000 100214648 100523984 100905299 101152575 101158166 101066804 101080334 101177573 101174057 101013768 100837386
550.7 100837386 100787449 100799334 100690985 100458848 100263345 100185430 100146425 100000000 99816155 99649352
571.1I9649352p2849p7242k14016l59255l92747m04608n54002q41128j170385j516998
591.5I4046122j935297k429957k825993k831751k266055j287920k32148P01410J486867
609.8H2425278K074993K303249K074259J496220P85529J34570l98493p42650p56705
628.2H9396250m44722p379L04842L97694L58611L32451L51721L00855J36995j1945
648.6I1115373O277J37746K21527K23040K57612M26316O21342N89848N00697O66666
669I4766444O87230N86909M85634K77299J18941J41806K42471K18577O2102m3941K2155
691.4I7565627J53416J38516m7589j84291j38337m5102j33396m22132o44874n01776
711.8I5740062r1159N4896k72423o93000q97431j005638j097458p60216L45874J680028
$$ plain form
571.1 99649352 99576503 99499261 99285245 98925990 98533243 98128635 97574633 96733505 95563120 94046122
591.5 94046122 92110825 89680868 86854875 84023124 81757069 80469149 80237001 80938411 82425278
609.8 82425278 84500271 86803520 88877779 90373999 91159528 91294098 90895605 90152955 89396250
628.2 89396250 88951528 88944149 89248991 89646685 90005296 90337747 90689468 90990323 91127318 91115373
648.6 91115373 91121650 91259396 91480923 91703963 91961575 92387891 93009233 93599081 94099778 94766444
669 94766444 95453674 96040583 96526217 96803516 96922457 97064263 97306734 97525311 97587413 97543472 97565627
691.4 97565627 97719043 97857559 97809970 97625679 97487342 97442240 97308844 96886712 96241838 95740062
711.8 95740062 95648903 95703799 95431376 94738376 93840945 92835307 91737849 90977633 91323507 93003535
732.2I3003535K337629K069694J287859N83941K90996K63059J63287J9491j38057o2048
752.6I9819386Q9991P6974r9963k19864j26982L3075J2803j81437l19057k59501j46359
775I8679066k23828n00273p66957r26823j127082j487815j806235j728040j166612
793.4H8945401m13972J49661L88080M56196N46807O38825N74147L53188J77937J68598
813.8I1984868K28161J85847J2159j24675j00839m893j0378j59561k95520k64138j41275
836.2I1309756j26445k62201l91561l88861k95549k62600l05349k01333k9617o1757
856.6H8984483j73771k45935l21936l62683m08649o01476r59385j279729j356763j199991
877H2074165r17649m64725K74795J061582J408607J208699P60114L58343J31774L7891
$$ plain form
732.2 93003535 95341164 97410858 98698717 99282658 99573654 99836713 100000000 100019491 99881434 99819386
752.6 99819386 99909377 99986351 99886388 99666524 99539542 99572617 99585420 99403983 99084926 98825425 98679066
775 98679066 98455238 97954965 97188008 96261185 95134103 93646288 91840053 90112013 88945401
793.4 88945401 88531429 88681090 89069170 89525366 90072173 90710998 91285145 91638333 91816270 91984868
813.8 91984868 92213029 92398876 92411035 92286360 92185521 92180628 92170250 92010689 91715169 91451031 91309756
836.2 91309756 91183311 90921110 90529549 90140688 89845139 89582539 89277190 89075857 89046240 88984483
856.6 88984483 88810712 88564777 88242841 87880158 87471509 86870033 85910648 84630919 83274156 82074165
877 82074165 81156516 80691791 80966586 82028168 83436775 84645474 85405588 85763931 85895705 85933596
897.4H5933596m3833j81657l32052m10008m10110m15290m92036o03908o60795o42210
917.8H1741697o23453o85078q23516r47618r88603r72587r58126r49681q90964p56938
938.2G3145133n98484m63235l10463k8563M21363R04501J208490J222378J032978Q18378
958.6G7352476O68937N67794M67789L67516K95878K36589J39850j8454k01553l39854
979G9536968m17256m86052n84495o86413p42447p54577p83593q76641j006907j111788
999.4G2086799j164001j186949j213247j216751j132017r42570p03645m84359k99830
1017.7F3743430j22022O2161K21843L09724L25292L21913L30537L19660K49386J36268
1038.1F5898192L7146j0109J239N1642J17940J96296K80010L39031L32112K55054J62750
$$ plain form
897.4 85933596 85889763 85708106 85376054 84966046 84555936 84140646 83648610 83044702 82383907 81741697
917.8 81741697 81118244 80433166 79609650 78662032 77673429 76700842 75742716 74793035 73902071 73145133
938.2 73145133 72546649 72083414 71772951 71744388 72165751 73070252 74278742 75501120 76534098 77352476
958.6 77352476 78021413 78589207 79056996 79424512 79720390 79956979 80096829 80078375 79876822 79536968
979 79536968 79119712 78633660 78049165 77362752 76620305 75865728 75082135 74205494 73198587 72086799
999.4 72086799 70922798 69735849 68522602 67305851 66173834 65231264 64527619 64043260 63743430
1017.7 63743430 63621408 63683569 63905412 64215136 64540428 64862341 65192878 65512538 65761924 65898192
1038.1 65898192 65935338 65925229 65926468 65978110 66096050 66292346 66572356 66911387 67243499 67498553 67661303
1060.6F7661303R8020M7076j0771p0405j14196j38432j51765j60069j71923j86384
1081F6802454j89179j78516j67620j61118j59233j61988j65802j65463j39481q7684
1101.4F5226370m9752m2355m9913n2959m7117m3732l9303k1983J0127N0986R1124J27333
1125.8F5158826J78963K77895M06283N08767N74458O32834P08366Q16089R60248J119620
1146.2G1342349J263946J362616J350719J168328Q44396M84925J93662k671j47474
1164.6G7860796k80559m01175m85259n38820o05023p00337p91710q37082q31789q21578
1185G1567464q42661q74889q83579q62300q32969q21609q22824p94869p18248o30790
1205.4F3482726n71096n30798m71156l72863k70123k11888j96779j77681j24204o4159
$$ plain form
1060.6 67661303 67759323 67806399 67795628 67725223 67611027 67472595 67320830 67160761 66988838 66802454
1081 66802454 66613275 66434759 66267139 66106021 65946788 65784800 65618998 65453535 65314054 65226370
1101.4 65226370 65176618 65134263 65084350 65031391 64984274 64940542 64901239 64879256 64889383 64940369 65031493 65158826
1125.8 65158826 65337789 65615684 66021967 66530734 67105192 67738026 68446392 69262481 70222729 71342349
1146.2 71342349 72606295 73968911 75319630 76487958 77332354 77817279 78010941 78008270 77860796
1164.6 77860796 77580237 77179062 76693803 76154983 75549960 74849623 74057913 73220831 72389042 71567464
1185 71567464 70724803 69849914 68966335 68104035 67271066 66449457 65626633 64831764 64113516 63482726
1205.4 63482726 62911630 62380832 61909676 61536813 61266690 61054802 60858023 60680342 60556138 60491979
1225.8F0491979m3779o0410o6024k8461K2608L8320J5825J138L1698Q3381J01584P3433
1250.3F0661292M4781N7334R5314J05702P1037L9882O5517J28782J63042J45740J22237
1272.7F1700660J42920J99491K36869K24054K00432K20192K76231L09724K87801K47419
1293.1F4045793K49457K94256L17753K88319K50924K64102L16912L45498L16555K69133
1313.5F6958702K67243L21424L65168L50422L23408L40391L96734M35966M21435L75873
1333.9G0556766L39633L13425K59423J34898m1980k23905m15772o48457r17637j148915
1354.3F8207479j239646j150787r86123q68624p89166p04276o17642n16098m22478
1372.6F0912639l42846k34157j08468j1766M8798J21373K29108K89268K60192K19887
$$ plain form
1225.8 60491979 60448200 60387790 60321766 60293305 60315913 60354233 60370058 60371196 60402894 60486275 60587859 60661292
1250.3 60661292 60706073 60763407 60858721 60964423 61035460 61075342 61140859 61269641 61432683 61578423 61700660
1272.7 61700660 61843580 62043071 62279940 62503994 62704426 62924618 63200849 63510573 63798374 64045793
1293.1 64045793 64295250 64589506 64907259 65195578 65446502 65710604 66027516 66373014 66689569 66958702
1313.5 66958702 67225945 67547369 67912537 68262959 68586367 68926758 69323492 69759458 70180893 70556766
1333.9 70556766 70896399 71209824 71469247 71604145 71562165 71338260 70922488 70274031 69356394 68207479
1354.3 68207479 66967833 65817046 64830923 63962299 63173133 62468857 61851215 61335117 60912639
1372.6 60912639 60569793 60335636 60227168 60215402 60264200 60385573 60614681 60903949 61164141 61384028
1393F1384028J82033J33908J14876J04671P1025L1376n400l5328r2238j99729l17842
1415.5F1371380m33487n52719n95803o29180o83481o76810o41627n63490m44454l44443
1435.9E5805886k22743p9399L0088J04124J72823K64442L50863M03142M43345N73534
1456.2E7846105O69474N28401M65864N53178N96488N43821N66375O89745O93417N83905
1476.6F3736773N23531N12987N10311M74543M56041M84341M91876M23127M07809M80712
1497F8502051M91279M35996L89183M59492O20061N33777M18216M13734M19444M14419
1517.4G3097652L99721M23431L84796L13157L10045K92886K96795L14468K46847K21491
1537.8G6301289L42822L68040K58095K06553J97602K25413K35998K12497J84268K62516
$$ plain form
1393 61384028 61566061 61699969 61814845 61919516 61990541 62021917 62016517 61981189 61888951 61689222 61371380
1415.5 61371380 60937893 60385174 59789371 59160191 58476710 57799900 57158273 56594783 56150329 55805886
1435.9 55805886 55583143 55503744 55533832 55637956 55810779 56075221 56426084 56829226 57272571 57846105
1456.2 57846105 58515579 59043980 59509844 60063022 60659510 61203331 61769706 62459451 63152868 63736773
1476.6 63736773 64260304 64773291 65283602 65758145 66214186 66698527 67190403 67613530 68021339 68502051
1497 68502051 68993330 69429326 69818509 70278001 70898062 71431839 71850055 72263789 72683233 73097652
1517.4 73097652 73497373 73920804 74305600 74618757 74928802 75221688 75518483 75832951 76079798 76301289
1537.8 76301289 76644111 77012151 77270246 77476799 77674401 77899814 78135812 78348309 78532577 78795093
1558.2G8795093L12513J74237J44589J83880K44832L13312K80934K72066L40509L05152
1578.6H1367117K69443K93255K79325K42889K29508K28810K08938J61576J03218P7080
1599H3461159Q0663P1711K8372j6511k6518j2815o473r66n191m0543l1901j0335m8334
1625.5H3442318q6426q5366p4703l9309P111k7674n2500j4794L5316J01900J04511
1648H3310384M3451J91629M12494K42257J53393K41399L63147L65567K52783K39665
1668.4H5816169K52014J48261O6823l3933k13427l42631m50486o70493q74352r53478
1688.8H2744467r93460r04370q24838p88534p66248q65703r33010j070088j289517
1707.1G4308699j341098j280731j163578j033795r29594p62016n56159m02230k99364
$$ plain form
1558.2 78795093 79107606 79281843 79426432 79610312 79855144 80168456 80449390 80721456 81061965 81367117
1578.6 81367117 81636560 81929815 82209140 82452029 82681537 82910347 83119285 83280861 83384079 83461159
1599 83461159 83541822 83613533 83641905 83625394 83598876 83586061 83579588 83578622 83573431 83532888 83500987 83490652 83442318
1625.5 83442318 83355892 83270526 83195823 83156514 83163625 83135951 83083451 83068657 83103973 83205873 83310384
1648 83310384 83353835 83545464 83957958 84200215 84353608 84595007 84958154 85323721 85576504 85816169
1668.4 85816169 86068183 86216444 86283267 86249334 86035907 85693276 85242790 84572297 83697945 82744467
1688.8 82744467 81751007 80846637 80021799 79233265 78467017 77601314 76668304 75598216 74308699
1707.1 74308699 72967601 71686870 70523292 69489497 68559903 67797887 67241728 66839498 66540134
1725.5F6540134k38508k04790j42479o902N9658j299K2918R0945J31529J75774K11317
1747.9F6638297K77561L39776L49748M14819M97192N32466O17415O14446N62871N66148
1768.3G1410739N52375N91296N66673M64284M35204M37736M16803M16142M03315L30532
1788.7G6025099K97170L23970K98225K60658K71356K76500K53838K24936K09755J88028
1809.1G8629535J44631J01483J03813J44005J59800J40393J45954K03586K56365L12793
1829.5H0342358L28827K88141K94822L24858L02732K64603K90048K99793K58827K45756
1849.9H3240765K29919J99002J88911K04343K16240J96623J58877J56515K12741K44111
1870.3H5248047J97882J64228J75828K07508K29477K19805J93005J75292J98418K26002
$$ plain form
1725.5 66540134 66301626 66096836 65954357 65947455 66007113 66005814 66028732 66119677 66251206 66426980 66638297
1747.9 66638297 66915858 67255634 67605382 68020201 68517393 69049859 69667274 70281720 70844591 71410739
1768.3 71410739 71963114 72554410 73121083 73585367 74020571 74458307 74875110 75291252 75694567 76025099
1788.7 76025099 76322269 76646239 76944464 77205122 77476478 77752978 78006816 78231752 78441507 78629535
1809.1 78629535 78774166 78875649 78979462 79123467 79283267 79423660 79569614 79773200 80029565 80342358
1829.5 80342358 80671185 80959326 81254148 81579006 81881738 82146341 82436389 82736182 82995009 83240765
1849.9 83240765 83470684 83669686 83858597 84062940 84279180 84475803 84634680 84791195 85003936 85248047
1870.3 85248047 85445929 85610157 85785985 85993493 86222970 86442775 86635780 86811072 87009490 87235492
1890.7H7235492K05577J74570J62488J69712J89156J85811J56194J38444J51259J69933
1911.1H8938636J57213J29014J29002J43272J46639J48493J23519R4879J02782J23388
1931.5I0236837J27947J07336Q3447Q7273J23816J36954J02049P7456R0784J20455
1951.9I1294354J31405J14989J00320J08052J21879J25158J16044J00768R4253J03176
1972.3I2410398J06787R1571P7927Q1807R5851R6309P5376N3137N2709O3461N5605
1994.7I3260938L4618J9223J6254K6172L3456K2001Q952J0789J5950J9687K2763K0600
2019.2I3511403K4843L9106M5473M4566M8673O1465P5894P8982P3243P5864Q7929R3138
2043.6I4260579Q9038Q5824R0802R8795R7293Q8441Q5235R2226J00922J04011R8228
$$ plain form
1890.7 87235492 87441069 87615639 87778127 87947839 88136995 88322806 88479000 88617444 88768703 88938636
1911.1 88938636 89095849 89224863 89353865 89497137 89643776 89792269 89915788 90010667 90113449 90236837
1931.5 90236837 90364784 90472120 90555567 90642840 90766656 90903610 91005659 91083115 91173899 91294354
1951.9 91294354 91425759 91540748 91641068 91749120 91870999 91996157 92112201 92212969 92307222 92410398
1972.3 92410398 92517185 92608756 92686683 92768490 92864341 92960650 93036026 93089163 93141872 93205333 93260938
1994.7 93260938 93295556 93314779 93331033 93357205 93390661 93412662 93421614 93432403 93448353 93468040 93490803 93511403
2019.2 93511403 93536246 93575352 93620825 93665391 93714064 93775529 93851423 93930405 94003648 94079512 94167441 94260579
2043.6 94260579 94349617 94435441 94526243 94625038 94722331 94810772 94896007 94988233 95089155 95193166 95291394
2066.1I5291394R0379R4491J01584R3418P8267P6807Q9502R8252Q8990O8772N9223
2088.5I6231079O7121P4369O5469M6522L5494M1402M9388M1223K3168J4859K1291K7079
2113I6738464J5467l970r244L379J7244J1784p600j7202n924O020l505k3341k9475
2139.5I6692097j4120M911M572j1414j5319J937K0564K2572J2702J2767L1978N2828
2164I6816075N7340N2273N2732O7800R1189R8438Q3845P4608Q5669J02425J03712Q9258
2188.4I7775364Q0007Q2922Q8030Q7482Q0645P4482P5162Q0245Q1885P2819N8305N3549
2212.9I8690897N5510N2094M4394L7652L1692K7520K5129K0826J0955j383o109k045
2237.4I8987132r00j0872k1398j5705J209J1570J1962P892O294J5581L2282L9035L0982
$$ plain form
2066.1 95291394 95381773 95476264 95577848 95671266 95749533 95826340 95915842 96014094 96103084 96171856 96231079
2088.5 96231079 96298200 96372569 96438038 96484560 96520054 96561456 96610844 96652067 96675235 96690094 96711385 96738464
2113 96738464 96753931 96749961 96740717 96744096 96761340 96773124 96765524 96748322 96742398 96748418 96744913 96721572 96692097
2139.5 96692097 96677977 96682888 96687460 96676046 96660727 96662664 96683228 96705800 96718502 96731269 96763247 96816075
2164 96816075 96873415 96925688 96978420 97046220 97137409 97235847 97319692 97394300 97479969 97582394 97686106 97775364
2188.4 97775364 97855371 97938293 98026323 98113805 98194450 98268932 98344094 98424339 98506224 98579043 98637348 98690897
2212.9 98690897 98746407 98798501 98842895 98880547 98912239 98939759 98964888 98985714 98996669 98995286 98989177 98987132
2237.4 98987132 98986232 98975360 98953962 98938257 98939466 98951036 98962998 98970890 98977184 98992765 99025047 99064082 99095064
2263.9I9095064K7782L8654M8768M4531K9713J7345K0534L5393L0404k652k6036k0897
2288.4I9338603q279j0794k9213m5877m7017l7163m0156o5094q2064o5887k5820M303
2312.9I8885542j0341n2011o2257k0874K6286J7941j9580q661M4757N4765J1128j4752
2337.3I8851943P129P0458J79488K27845K2703k18904k60693j55979o2406j4711K3556
2359.8I8670429P7349J41531J73605J70093J62662J65760J56128J14537P1436N3382
2380.2I9956912M3088K8694k277k3902k7835j9312r036j1212k0915j8120m667K969
2404.6I9894387J764j937K26J4037L0130L2091J9575J3685K3508K7323J4269l600j6356
2431.2A00049102j8394j4364k1285m1914n6577n4300m6021m3505m6980m9770m5252
$$ plain form
2263.9 99095064 99122846 99161500 99210268 99254799 99284512 99301857 99322391 99357784 99388188 99385536 99359500 99338603
2288.4 99338603 99330324 99319530 99290317 99244440 99197423 99160260 99120104 99055010 98972946 98907059 98881239 98885542
2312.9 98885542 98875201 98823190 98760933 98740059 98766345 98784286 98764706 98756045 98800802 98855567 98866695 98851943
2337.3 98851943 98859072 98929530 99109018 99336863 99359566 99140662 98879969 98723990 98661584 98646873 98670429
2359.8 98670429 98747778 98889309 99062914 99233007 99395669 99561429 99717557 99832094 99903530 99956912
2380.2 99956912 100000000 100028694 100026417 100002515 99974680 99955368 99946332 99935120 99914205 99896085 99891418 99894387
2404.6 99894387 99896151 99894214 99894440 99908477 99938607 99970698 99990273 100003958 100027466 100054789 100069058 100065458 100049102
2431.2 100049102 100030708 100016344 99995059 99953145 99896568 99842268 99796247 99752742 99705762 99655992 99610740
2453.6I9610740l7253l3802l2085k6417j7005j2720j6957j7160r251l171m417o872
2478.1I9393630l499K492J883m643j3804k5720l5679m7535o4725p8743q2517q2481
2502.5I8958659r4974j18768j41895j64521j89709k09147k04259j60366q6290r316
2522.9I7579414M6169O8653P0393P6366Q9401R4992R0229Q3149Q0347P9768P7111O7598
2547.4I8503590N4419O2054R4462J25092J39987J41734J35607J23131R8562N9784J8519
2569.8I9556941o777o253R835J7703J0365N281J5616L2473M4471N4103O4999P9197
2594.3I9877954R1069Q4585N3716J5688l195m828j6200m2808o2168o4731o0778o5005
2618.8I9803299q3918r6810p7295k7764K1243M5896N3573O0242P1800P5072N9354L9613
$$ plain form
2453.6 99610740 99573487 99539685 99507600 99481183 99464178 99451458 99434501 99417341 99408090 99404919 99400502 99393630
2478.1 99393630 99390131 99392623 99394506 99389863 99376059 99350339 99314660 99267125 99202400 99123657 99041140 98958659
2502.5 98958659 98863685 98744917 98603022 98438501 98248792 98039645 97835386 97675020 97588730 97579414
2522.9 97579414 97625583 97694236 97764629 97840995 97930396 98025388 98115617 98198766 98279113 98358881 98435992 98503590
2547.4 98503590 98558009 98620063 98714525 98839617 98979604 99121338 99256945 99380076 99478638 99538422 99556941
2569.8 99556941 99550164 99543911 99553746 99571449 99581814 99587095 99602711 99635184 99679655 99733758 99798757 99877954
2594.3 99877954 99969023 100053608 100107324 100123012 100119817 100114989 100098789 100055981 99993813 99929082 99868304 99803299
2618.8 99803299 99719381 99622571 99545276 99517512 99538755 99584651 99638224 99698466 99770266 99845338 99904692 99944305
2643.3I9944305K8044K5797K4945J2743r978k6917k6786k3067l4440n0425m9866l6072
2667.7I9778283k3443j9586k3675k2662n209J7571K6125J8507J3310K4515L9083L8004
2692.2I9860823K2632J0622J4901K4163J6916m619j7661j5050r638j0944j9383k4939
2716.7I9847823j7649j0234j6105k7871l2699l0011k7013k5606k8682l4410l3825k6834
2741.2I9536884k4486l0428l5363k7639j0866j913k760o783r108k932Q345J0752K504
2767.7I9406207j26N514R090R822O402j210l994j919k748o610j1062j4454j7208k3264
2796.2I9354440l1936m0835m6778n0247o1935q3876j08963j26171j27506j27930j40488
2818.7I8407775j60020j76537j83845j92302k12956k40725k70325k99543l30294l76981
$$ plain form
2643.3 99944305 99972349 99998146 100023091 100035834 100025856 99998939 99972153 99949086 99914646 99864221 99814355 99778283
2667.7 99778283 99754840 99735254 99711579 99688917 99683708 99701279 99727404 99745911 99759221 99783736 99822819 99860823
2692.2 99860823 99883455 99894077 99908978 99933141 99950057 99945438 99927777 99912727 99903089 99892145 99872762 99847823
2716.7 99847823 99830174 99819940 99803835 99775964 99743265 99713254 99686241 99660635 99631953 99597543 99563718 99536884
2741.2 99536884 99512398 99481970 99446607 99418968 99408102 99406189 99403429 99396646 99387538 99384606 99392951 99403703 99406207
2767.7 99406207 99406081 99411595 99420685 99430507 99436909 99435699 99431705 99429786 99427038 99420428 99409366 99394912 99377704 99354440
2796.2 99354440 99322504 99281669 99234891 99184644 99122709 99038833 98929870 98803699 98676193 98548263 98407775
2818.7 98407775 98247755 98071218 97887373 97695071 97482115 97241390 96971065 96671522 96341228 95964247
2839.1I5964247m38583m88830n08260m93306m52244l96038l36641k83283k32756j92737
2859.5I2141569j66399j28519p0417j1689L3945O2871Q4800J14494J41162J37621R6154
2881.9I2435592L6210k5642r0587j65081k58571l55780m21715m57948m98182n62870
2902.3H9635426o38622p01243p47895p90447q28660q31192p63005o30445m78458l45403
2922.7H2880056k34401j39660p2724m7463n4449n9461l5757J5879P6663J23841J49500
2945.1H2602024J67734J92874K09099J92082J57529J39344J34653J15168P4917L8976
2965.5H4024400L1465N0390Q0502J04910J21987J59853K23762K77084L14415L64637
2985.9H5753405M32932N07111N70345N98240N89299N63329N25630M68594L81124K66874
$$ plain form
2839.1 95964247 95525664 95036834 94528574 94035268 93583024 93186986 92850345 92567062 92334306 92141569
2859.5 92141569 91975170 91846651 91776234 91764545 91798490 91861361 91946161 92060655 92201817 92339438 92435592
2881.9 92435592 92471802 92446160 92355573 92190492 91931921 91576141 91154426 90696478 90198296 89635426
2902.3 89635426 88996804 88295561 87547666 86757219 85928559 85097367 84334362 83703917 83225459 82880056
2922.7 82880056 82645655 82505995 82433271 82385808 82331359 82271898 82236141 82252020 82328683 82452524 82602024
2945.1 82602024 82769758 82962632 83171731 83363813 83521342 83660686 83795339 83910507 83985424 84024400
2965.5 84024400 84055865 84106255 84186757 84291667 84413654 84573507 84797269 85074353 85388768 85753405
2985.9 85753405 86186337 86693448 87263793 87862033 88451332 89014661 89540291 90008885 90390009 90656883
3006.3I0656883J65176J02061N4538N704j8894O187P4833J54341K12031K47812K90180
3028.7I1950852L43990L66557L31896K70117K27010K07925J82384J41537J06758R3758
3049.1I4222784R1678Q5133O9368M5681K8134L0189M1193L9733J5348r930m673J3440
3073.6I4668078J4276J633q971j0067r280j6171k6292l1423l1054k2447j2851j7840
3098.1I4497591k4116k2137k2674k3537k8140l7652k7913o264j2577m4608p2640p9793
3122.6I4095540o6280n5337o4278p4190o7848o0671o1703p3981r3562r6124q8203q8549
3147I3204814q4120p8088r1684j15055j26099j23447j17869j10727j02937j07032j21647
3169.5I2026109j28586j23024j14548j09166j13111j26589j31744j23012j19150j25777
$$ plain form
3006.3 90656883 90822059 90924120 90978658 90984362 90965468 90971655 91046488 91200829 91412860 91660672 91950852
3028.7 91950852 92294842 92661399 92993295 93263412 93490422 93698347 93880731 94022268 94129026 94222784
3049.1 94222784 94314462 94399595 94468963 94514644 94542778 94572967 94614160 94653893 94669241 94659311 94654638 94668078
3073.6 94668078 94682354 94683987 94675016 94664949 94655669 94639498 94613206 94581783 94550729 94528282 94515431 94497591
3098.1 94497591 94473475 94451338 94428664 94405127 94376987 94339335 94311422 94305158 94292581 94247973 94175333 94095540
3122.6 94095540 94029260 93973923 93909645 93835455 93767607 93706936 93645233 93571252 93477690 93381566 93293363 93204814
3147 93204814 93120694 93042606 92950922 92835867 92709768 92586321 92468452 92357725 92254788 92147756 92026109
3169.5 92026109 91897523 91774499 91659951 91550785 91437674 91311085 91179341 91056329 90937179 90811402
3189.9I0811402j29271j25599j24758j29891j33252j32006j31291j33050j29789j26100
3210.3H9516395j30570j34492j31630j24979j26279j37281j37812j27113j22964j15359
3230.7H8227916j08141j25641j43885j42354j36417j21129r8282j00446j19417j20503
3251.1H7011701j10275j05226j06829j12754j18298j13916r5570p1555o4469r2995
3271.4H6019814j21570j18553j11175j11103j06710j02264r9665r2607p9203p7885
3291.8H4999079r8628j11860j10919j10125r6011p3219p4774r8592j21677j31237j19752
3314.3H3852285j10513j15532j15466j07997j02902j10882j24556j29199j29074j11723
3334.7H2694441q5032r8681j31697j36888j32108j20163j00922j12623j42795j41120
$$ plain form
3189.9 90811402 90682131 90556532 90431774 90301883 90168631 90036625 89905334 89772284 89642495 89516395
3210.3 89516395 89385825 89251333 89119703 88994724 88868445 88731164 88593352 88466239 88343275 88227916
3230.7 88227916 88119775 87994134 87850249 87707895 87571478 87450349 87352067 87251621 87132204 87011701
3251.1 87011701 86901426 86796200 86689371 86576617 86458319 86344403 86248833 86177278 86112809 86019814
3271.4 86019814 85898244 85779691 85668516 85557413 85450703 85348439 85248774 85156167 85076964 84999079
3291.8 84999079 84900451 84788591 84677672 84567547 84471536 84398317 84323543 84224951 84103274 83972037 83852285
3314.3 83852285 83741772 83626240 83510774 83402777 83299875 83188993 83064437 82935238 82806164 82694441
3334.7 82694441 82609409 82510728 82379031 82242143 82110035 81989872 81888950 81776327 81633532 81492412
3355.1H1492412j18107j04641j06007j08606q7374o6138q9532j32620j38623j10542
3375.5H0430222r1976r8378j06293q8173o0898n1564m6653m8208p2503p8493m4507
3397.9G9642576k5010n1403q0353o6972l5304k4026l3248m8739n5563l7909j3196j9038
3422.4G9151815l7426l2818k5391l8785n0754m6217m9979p0989p7569o9940n4300j9038
3446.8G8578609j1432k1040J1170N0175P8058J15162J47683J66398J85776K10458K10869
3469.3G9721886J93709J99068K12782K06465K06458K16437J98018J83046J95289J86884
3489.7H1720042J57607J49870J63072J62709J56462J83225J80745J19430J23727J73706
3510.1H3290595J57398J20324J18088J22595J29605J61874J72490J50925J57535J54716
$$ plain form
3355.1 81492412 81374305 81269664 81163657 81055051 80967677 80901539 80812007 80679387 80540764 80430222
3375.5 80430222 80338246 80239868 80133575 80045402 79984504 79932940 79886287 79838079 79765576 79687083 79642576
3397.9 79642576 79617566 79566163 79485810 79418838 79383534 79359508 79326260 79277521 79221958 79184049 79170853 79151815
3422.4 79151815 79114389 79081571 79056180 79017395 78966641 78920424 78870445 78799456 78721887 78651947 78597647 78578609
3446.8 78578609 78567177 78546137 78557307 78607482 78685540 78800702 78948385 79114783 79300559 79511017 79721886
3469.3 79721886 79915595 80114663 80327445 80533910 80740368 80956805 81154823 81337869 81533158 81720042
3489.7 81720042 81877649 82027519 82190591 82353300 82509762 82692987 82873732 82993162 83116889 83290595
3510.1 83290595 83447993 83568317 83686405 83809000 83938605 84100479 84272969 84423894 84581429 84736145
3530.5H4736145J21337J30397J68812J61088J27250J42109K23827K54101J66708J53852
3550.9H6385626K28178K05094J57118J83314J81085J22958K38454M92883L97480J20288
3571.3H8712478J10858K03395K17325K00283J31524L9458J49954L88985K44636l1287
3591.7I0367609M8876J74576J15883R2262P5257n1462m3887J61737J97887Q6701J4252
3614.1I1239691n1785J48016L15309o50l19308j55055N45323O44213K9045n9831Q1736
3636.5I2416704J15061J25336K5177r3174J67501Q02261P46447M631j1456M16165L00140
3659I5014793R3633J10548J5539L1746M50492M49395J01554N69481O42723K2667j07973
3681.4I7394598j32996j50609K74658P03698L51960q4389j18309m8655Q9061K81859
$$ plain form
3530.5 84736145 84857482 84987879 85156691 85317779 85445029 85587138 85810965 86065066 86231774 86385626
3550.9 86385626 86613804 86818898 86976016 87159330 87340415 87463373 87701827 88194710 88592190 88712478
3571.3 88712478 88823336 89026731 89244056 89444339 89575863 89615321 89765275 90154260 90398896 90367609
3591.7 90367609 90416485 90591061 90706944 90799206 90874463 90823001 90779114 90940851 91138738 91225439 91239691
3614.1 91239691 91187906 91335922 91651231 91650581 91331273 91176218 91721541 92365754 92394799 92334968 92416704
3636.5 92416704 92531765 92657101 92682278 92589104 92756605 93558866 94305313 94309944 94298488 94714653 95014793
3659 95014793 95108426 95218974 95234513 95266259 95716751 96166146 96267700 96837181 97479904 97502571 97394598
3681.4 97394598 97261602 97110993 97385651 98089349 98441309 98356920 98238611 98189956 98279017 98560876
3701.8I8560876J24132k04062j58888K54798N39148J14190l20536k61992o6400K6811
3722.2I8608077N7339L7241j95527k94095J5563M05663M50748q4686o05452j82837
3742.6I8212034O36583J67680j93381M84329M28069k60264k94846Q8131R0516j61600
3763I9197251r9963L5131J71798J96248q1247k25818m7284J86622R2405o5279L314
3785.4I9363178J0562m8775j03902j18631j0950p1215L1232L97373N7977q2022K20770
3807.8I9645597j22637m82291j89662K75314R4372J19454L82966o9714k74104j64008
3828.2I9215287j23745o5732q5825J26362L95405J44357q0484r2960l01945n81908
3848.6I8548812l94446P28017J117617j26398o11561k82812R1248J34850r3347J10513
$$ plain form
3701.8 98560876 98685008 98480946 98322058 98576856 99116004 99230194 98909658 98647666 98581266 98608077
3722.2 98608077 98665416 98702657 98507130 98213035 98228598 98634261 99085009 99000323 98394871 98212034
3742.6 98212034 98848617 99016297 98822916 99307245 99735314 99475050 99180204 99268335 99358851 99197251
3763 99197251 99097288 99132419 99304217 99500465 99419218 99193400 99146116 99332738 99425143 99359864 99363178
3785.4 99363178 99373740 99324965 99221063 99102432 99091482 99020267 99051499 99448872 99506849 99424827 99645597
3807.8 99645597 99522960 99040669 98851007 99126321 99220693 99340147 99723113 99653399 99379295 99215287
3828.2 99215287 99091542 99025810 98939985 99066347 99461752 99606109 99525625 99432665 99130720 98548812
3848.6 98548812 98154366 98882383 100000000 99873602 99262041 98979229 99070477 99205327 99111980 99222493
3869I9222493L24392O4576j13672k27117l7760J42103J2833J74904O7079j39379J57070
3891.5I9647522Q5241l05969k13295J30188L00956L39550J52993j49488j86205j06114
3911.9I9695379q5229M9025J80089P2169m7612K5422M5615o2811m572J42658O9749
3934.3A00079882p3099q5217j6570O7669K7335l9679K3413L9953k0301l6699k6435
3956.7I9940252j2618J9515K7763n978j5634q82l899k9K8217M3427L8040M5276N8234
3983.2A00161684M7016L9625N8162O2525M6778L9160K7979
3997.5A00482929
$$ plain form
3869 99222493 99546885 99611461 99497789 99270672 99232912 99375015 99387848 99562752 99629831 99490452 99647522
3891.5 99647522 99732763 99426794 99213499 99343687 99644643 99984193 100137186 99987698 99801493 99695379
3911.9 99695379 99610150 99659175 99839264 99911433 99863821 99889243 99934858 99872047 99867475 100010133 100079882
3934.3 100079882 100006783 99921566 99904996 99972665 100000000 99960321 99983734 100023687 100003386 99966687 99940252
3956.7 99940252 99927634 99947149 99974912 99968934 99953300 99952418 99948519 99948490 99976707 100020134 100058174 100103450 100161684
3983.2 100161684 100208700 100248325 100306487 100369012 100415790 100454950 100482929
3997.5 100482929
##END=$$ End of the data block
