##TITLE=$$ Begin of the data block
##JCAMP-DX=5.00 $$ ACD/SpecManager v 10.08
##SPECTROMETER/DATA SYSTEM=16PC
##DATE=18 Jul 2013 11:10:20
##DATA TYPE=INFRARED SPECTRUM
##DATA CLASS=XYDATA
##ORIGIN=
##OWNER=
##NPOINTS=3601
##FIRSTX=400.00000000
##LASTX=4000.00000000
##MAXX=4000.00000000
##MINX=400.00000000
##MAXY=45.35531998
##MINY=11.14966774
##XFACTOR=1.0000000000
##YFACTOR=0.000000100000000
##FIRSTY=41.71187592
##DELTAX=1.00000000
##XUNITS=1/CM
##YUNITS=TRANSMITTANCE
##XYDATA=(X++(Y..Y))
400D17118759j5772095j5298347O018410P469864q476944j0982781o075134m85878
408C73515854J1233559J4019470J1215935M508247j1369438j7040024j6743202j2899857
416C56440544n62668K898445l040542J083145J8028259J7293930j193084o638985l848076
425C80460968m398575o924171n314331P11670L916969O378899P023353N461426M322052
434C91638260L564148P22160o902695o052017L817559P271499P727890O947022M176407
443D12910233O63490o488075o940384k12899J433373N52902q12759n273819m431496
452C91400566J994362M483948N712967M497528p75070k471924j759796j607399j276246
461D00198936p55577j60675R58939L480644L443718N60074n7488K76833J704903P178077
$$ y = [417118759, 401346664, 386048317, 392066727, 399536591, 391059647, 380076866, 374001732, 373515854, 384749413, 398768883, 409984818, 414493065, 403123627, 386083603, 369340401, 356440544, 355877876, 358776321, 355735779, 356818924, 374847183, 392141113, 390948029, 384309044, 380460968, 376062393, 369138222, 363823891, 364535561, 368452530, 374831429, 381854782, 387316208, 391638260, 395202408, 395924568, 389021873, 382969856, 386787415, 394058914, 401786804, 408733826, 412910233, 413573723, 407085648, 400145264, 399932365, 401365738, 401918640, 401105881, 395832062, 391400566, 393394928, 397878876, 403591843, 408089371, 407314301, 404842377, 403082581, 401475182, 400198936, 399443359, 399282684, 400241623, 403722267, 407165985, 407726059, 407668571, 407945404, 409650307, 416828384]
471D16828384M747391p845650r620666k863388N85556N212517M909515k143364k559166
480D07251129K899399L896217K244225J024971j833687j126976L835182N086212L921242
489D27197914L122597K677421j46865p820130p730980L37143K903710K490272K489319
498D25520401J890678J340371o87N77431L717193M138947L249168O99043n984802o562919
508D28584824j185685N08805N40466M67072n51453p14302J64986m60854l207703l066520
518D21079636l23792J153717L166428K377281k099266l386040l423195j326828N880127
527D23098068N403519l113747n449524m410514k994309O88324K075691K282601J410484
536D18990593j564980k649307k941360k040634N80062K409707N433578M219055k666740
$$ y = [416828384, 421575775, 413730125, 404109459, 401246071, 401831627, 407044144, 411953659, 409810295, 407251129, 410150528, 414046745, 416290970, 417315941, 415482254, 414355278, 418190460, 423276672, 427197914, 430320511, 432997932, 432851067, 425030937, 417299957, 417637100, 420540810, 423031082, 425520401, 427411079, 428751450, 428750763, 429328194, 433045387, 437184334, 440433502, 441132545, 435147743, 428584824, 427399139, 427907944, 428448410, 428915482, 428364029, 427649727, 427814713, 427353859, 424146156, 421079636, 420755844, 421909561, 425075989, 427453270, 425354004, 421967964, 418544769, 417217941, 423098068, 428501587, 425387840, 419938316, 415527802, 412533493, 413221817, 415297508, 417580109, 418990593, 417425613, 414776306, 411834946, 409794312, 410374374, 412784081, 418217659, 422436714, 419769974]
545D19769974m062653j114578m01268r25789r8228K831688K272872k192993l303032
554D12775993k496719j282692K043228K171059j057167j702767n27877m23661r74655
563D08524742r53674q36144N0316K548218K613068N86280q56895l077736l308525j754036
573D03535614l64799K268791K459030L27377r24606k944222k343902J517792K685546
582D06216621K413521J639328l74527j618156l012200k887001j312255L19976L786545
591D05171852L369560j788101k541809O5346J059532J745453J875152J468430O90689
600D11116104r00040j704444k269478k008438o56128J38015R47266J127243N31654
609D06321754L87688J72119P47452K509575L009338K975693J939774q31833j937142
$$ y = [419769974, 415707321, 414592743, 414191475, 413265686, 413167458, 415999146, 418272018, 416079025, 412775993, 410279274, 408996582, 411039810, 413210869, 412153702, 410450935, 409923058, 409499397, 408524742, 407571068, 406734924, 406785240, 409333458, 411946526, 412532806, 411675911, 408598175, 405289650, 403535614, 403170815, 405439606, 407898636, 408226013, 407301407, 404357185, 402013283, 403531075, 406216621, 408630142, 410269470, 409894943, 408276787, 405264587, 402377586, 401065331, 401385307, 405171852, 408541412, 406753311, 404211502, 404276848, 405336380, 407081833, 408956985, 410425415, 411116104, 410216064, 408511620, 406242142, 404233704, 403577576, 403715591, 404662857, 405790100, 406321754, 406709442, 406881561, 407629013, 410138588, 413147926, 416123619, 418063393, 417231560, 415294418]
618D15294418j973877j954803j232147j384507k821197k327423J3809J319656K343178
627D07277107K952309L281364K922058J679421P40547k52266j056442k216568j796723
636D13530807M39644J607666L062477K267151j745948k570382j325149N8403L326912
645D18651581L423195J74522o73523J64032k00500j864205j552086Q05359J654625
654D20583000J909027J468659q7509r75151j794091j932869j748314m26750J429787
663D18425789N415687J8225670J1486054k1392365k5681953o608963K003670J0635833
671D12509422J1189690J464386j639137j389962j614112j287461o81648R13391R28192
680D20392761o59256j194687j479644r65577J105042J152038p46002j323929q39004
$$ y = [415294418, 413320541, 411365738, 410133591, 408749084, 405927887, 403600464, 403614273, 404933929, 407277107, 410229416, 413510780, 416432838, 418112259, 418852806, 418600540, 417544098, 415327530, 413530807, 413970451, 415578117, 418640594, 420907745, 419161797, 416591415, 415266266, 415324669, 418651581, 422074776, 422249298, 421575775, 421739807, 421539307, 419675102, 418123016, 418928375, 420583000, 422492027, 423960686, 423873177, 422898026, 421103935, 419171066, 417422752, 416996002, 418425789, 423841476, 442067146, 453553200, 432160835, 406478882, 399869919, 401873589, 412509422, 423699112, 425163498, 423524361, 422134399, 420520287, 419232826, 418551178, 419464569, 420392761, 419733505, 418538818, 417059174, 416093597, 417198639, 418350677, 417604675, 416280746, 415441742]
689D15441742j528244m274368l310929J824837L512154L169784K741547J513977L95050
698D19485550j423340j618385j53084N02129Q38050J361351K758255J777192k616425
707D20911293l034096r5138J285553K723236K670517J080246l14942k871971k897987
716D19456711o1035O15348j19667k42233r537m17022j624794j998673k089958j330414
726D12178726J267700J183510j476288k617607l725052k954254K91138J781197K508659
735D08437729K730369K317887J524696l00407q06580n29747L23029K665558L048858
744D19411392K019196Q37784j425972k311478k808800j419525L373375M000168J295090
753D22971230n09987l194313l875008l155975j505356K459526L674507L073463J985054
$$ y = [415441742, 413913498, 409639130, 406328201, 408153038, 411665192, 414834976, 417576523, 419090500, 419485550, 418062210, 416443825, 416290741, 416792870, 417630920, 418992271, 421750526, 423527718, 420911293, 417877197, 417782059, 419067612, 421790848, 424461365, 425541611, 425226669, 422354698, 419456711, 419395676, 420011024, 419891357, 419649124, 419639587, 419222565, 417597771, 415599098, 413509140, 412178726, 413446426, 414629936, 413153648, 410536041, 406810989, 403856735, 404147873, 405929070, 408437729, 411168098, 413485985, 415010681, 414710274, 413903694, 413373947, 413696976, 416362534, 419411392, 421430588, 422268372, 420842400, 418530922, 415722122, 414302597, 417675972, 421676140, 422971230, 422461243, 419266930, 415391922, 412235947, 410730591, 413190117, 416864624, 419938087, 421923141]
762D21923141r87281j586190k59399N25703J722565J982918J459846Q85964j04180
771D25563087p82737j841774j243363J680374K217522J125107Q3694j979599k456169
780D22366142j690864r15528M05770J360893K938538K093048j988411l008843j912842
789D19647903j220436L02315K38419q99811k747040o356964p881165q490562p351646
798C85241013m036408j093407K944489M755020M991531M359704J389770J253586M279137
807D04084435L979682R00040o52313k235909j926880M40102K279511N341072N208740
816D17418480K068748m09851m261970n019188k902985j497726P13806J245270M46090
825D07800674n96313k962112l421059k369156j454582L13492O17294m8409j347999
$$ y = [421923141, 420935860, 419349670, 419090271, 419615974, 421338539, 423321457, 424781303, 425667267, 425563087, 424780350, 422938576, 421695213, 423375587, 425593109, 426718216, 426801910, 424822311, 422366142, 420675278, 419759750, 420165520, 421526413, 424464951, 426557999, 424569588, 421560745, 419647903, 418427467, 418729782, 418968201, 418068390, 415321350, 408964386, 401083221, 392592659, 385241013, 381204605, 380111198, 383055687, 387810707, 392802238, 397161942, 398551712, 399805298, 404084435, 408064117, 408964157, 408311844, 406075935, 404149055, 404589157, 406868668, 412209740, 417418480, 419487228, 419077377, 414815407, 409796219, 406893234, 405395508, 406109314, 407354584, 407800674, 407204361, 404242249, 400821190, 398452034, 396997452, 397310944, 397928238, 397879829, 396531830]
834C96531830m202881n266418n819092m088631J056213L315201M165421L997307J801490
843C91490440J223336J566391J968155K749443L488082N028000M415017J546859k13127
852D13262596k319107k318382P1525J265755K428780K487182J501084L01857k436409
861D14244881k241860J065254K292176K877464K257843k75879j326294j804848j464843
870D15623894M7683J069069K669564K230186l14255k085685m677773m597168j644363
879D08321152j13983J396179J569290P7476m54444q80967m08859J192780K206344L659745
889D16564713L155670K16026q50182j101532o13174J257629K013474K467384J861305
898D24971313j74751j405716k641678k879600j997948j488914n53398q95730k767791
$$ y = [396531830, 392328949, 387062531, 381243439, 377154808, 378211021, 381526222, 385691643, 389688950, 391490440, 392713776, 394280167, 396248322, 398997765, 402485847, 407513847, 411928864, 413475723, 413262596, 410943489, 408625107, 408696632, 409962387, 412391167, 414878349, 416379433, 416681290, 414244881, 412003021, 413068275, 415360451, 418237915, 420495758, 420219879, 418893585, 417088737, 415623894, 415671577, 416740646, 419410210, 421640396, 421326141, 419240456, 414562683, 409965515, 408321152, 408207169, 409603348, 411172638, 411250114, 410795670, 409914703, 409505844, 410698624, 412904968, 416564713, 419720383, 419936409, 419086227, 417984695, 417371521, 418629150, 420642624, 423110008, 424971313, 424796562, 423390846, 420749168, 417869568, 415871620, 414382706, 413829308, 412933578, 410165787]
907D10165787l461151m009476k988319P5340J863937M084358L226281j130104l796120
916D04030533o853333p166595n181084k254028L563652N832214O006470M705658n2948
925D02630539r60808R02901K544632N977859O141892L403206J353263j500358k780686
934D17712440k877960k608299r82742j141091l270836l482360k648125j169205J745949
943D01277771L330002M516601M336358K747039Q84285k423744l626823l111840k881508
952D05048141k020607k188911l247528m095535n638123n357742l644486j458625K074241
961C79470825M416199O859817O771775L704300K079734N75562N8632R29603P18842
970D05585289j25427r27201k149353k619247k521057k294274j463928j491279k108345
$$ y = [410165787, 406704636, 402695160, 399706841, 399782181, 401646118, 405730476, 408956757, 407826653, 404030533, 397177200, 390010605, 384829521, 382575493, 386139145, 391971359, 397977829, 402683487, 402630539, 401669731, 402572632, 405117264, 411095123, 417237015, 420640221, 421993484, 420493126, 417712440, 414834480, 412226181, 411243439, 410102348, 406831512, 403349152, 400701027, 399531822, 401277771, 404607773, 409124374, 413460732, 416207771, 417092056, 414668312, 411041489, 407929649, 405048141, 403027534, 400838623, 397591095, 393495560, 387857437, 382499695, 378855209, 377396584, 379470825, 383887024, 390746841, 397518616, 401222916, 403302650, 403878212, 403936844, 404866447, 405585289, 405459862, 404532661, 402383308, 399764061, 397243004, 394948730, 393484802, 391993523, 389885178]
979C89885178k926598m619102m884491m221917k938270k38648J002045J501083J261979
988C73821259r5864j055488k144089k770424k819290l344536m246483m872322n374412
997C47098351n797158o459961o042938m249573l589172l457298l762722n294094m989129
1006C03456306l205070j577377M64668K272854M232883N446911N892506O557235P084389
1015C30625305P910233R773025R280434O781120M272919J052132k065392o191750p697105
1024C53740921o852646o205520n524407l189812J253586M362831O862412R294281J2500992
1033C66242638J2568016R489288P203331M220963K557029J995812J385689R77020R17434
1042D07557220J653672J249580k74658j064072j761665j650353n21659P3432O17981
$$ y = [389885178, 386958580, 382339478, 377454987, 373233070, 370294800, 370056152, 371058197, 372559280, 373821259, 373725395, 372669907, 370525818, 367755394, 364936104, 361591568, 357345085, 352472763, 347098351, 341301193, 334841232, 328798294, 324548721, 320959549, 317502251, 313739529, 308445435, 303456306, 300251236, 298673859, 299138527, 301411381, 305644264, 311091175, 316983681, 323540916, 330625305, 338535538, 348308563, 357588997, 364370117, 368643036, 369695168, 367629776, 361438026, 353740921, 346888275, 340682755, 335158348, 331968536, 333222122, 337584953, 344447365, 353741646, 366242638, 378810654, 388299942, 395503273, 399724236, 402281265, 404277077, 405662766, 406639786, 407557220, 409210892, 410460472, 410185814, 409121742, 407360077, 405709724, 405188065, 405261497, 405879478]
1051D05879478P29790N02854n6992j464615j667023q87146k89192Q60214P88689n35965
1061D03860092j213569j826973j947175j599082j114121k174J06811o51321j189957
1070C94422531j991997k214431k027016j595535k10495n45502k532959l772507m890671
1079C74641418n785217o848373o614685m908295l898392k939453k446899k580872k288360
1088C36330872j512528j536827k240410k823601l641128m076271l934841m612217o280651
1097C05672398o858826o618023o555080p197380n440464j425992K307644P402668R826184
1106B91113129J0309448R958267Q047104O370544M325409K530098O21796n69572j521149
1115C31185074j156540R83467J981735K637635K667884J667252J537819K190590K076378
$$ y = [405879478, 406609268, 407112122, 407055130, 405590515, 403923492, 403036346, 402747154, 403607368, 404396057, 403860092, 402646523, 400819550, 398872375, 397273293, 396159172, 396156998, 396263809, 395612488, 394422531, 392430534, 390216103, 388189087, 386593552, 386383057, 385837555, 383304596, 379532089, 374641418, 368856201, 362007828, 355393143, 350484848, 346586456, 343647003, 341200104, 338619232, 336330872, 334818344, 333281517, 331041107, 328217506, 324576378, 320500107, 316565266, 311953049, 305672398, 298813572, 292195549, 285640469, 278443089, 273002625, 271576633, 273884277, 281286945, 291113129, 301422577, 311380844, 319427948, 325798492, 330123901, 332653999, 333275795, 332706223, 331185074, 330028534, 331012001, 332993736, 335631371, 338299255, 339966507, 341504326, 343694916, 345771294]
1124C45771294J593361O95228r02672k017250l381004l249893j456719m16527O70929
1133C37306747J017800L36647N63850J478691K026520K342949K939949M114609M164963
1142C56292725L135452K546997J932373J637230J564522J754989K611389K479783J598358
1151C75553818O65664r89189j382332p26699j56403J135559J054535l42102j192093
1160C73620758k211609k397766j539001j487465j961937k236862l009339k216797J4801
1169C56574783K125244N029908O625671P511597P392196O080628M616470K183914J003991
1178C99144402M56085P98454K927551K998581J475373L44009j372566j754265r23157
1187D04094467l14483R61990P80105o99729j993447m083633m523239l638306k573700
$$ y = [345771294, 347364655, 348059883, 347157211, 345139961, 341758957, 338509064, 337052345, 336635818, 337306747, 338324547, 338661194, 339225044, 340703735, 342730255, 345073204, 348013153, 352127762, 356292725, 359428177, 361975174, 363907547, 365544777, 367109299, 368864288, 371475677, 373955460, 375553818, 376219482, 375230293, 373847961, 373121262, 372964859, 374100418, 375154953, 374812851, 373620758, 371409149, 369011383, 367472382, 365984917, 364022980, 361786118, 358776779, 356559982, 356574783, 358700027, 363729935, 370355606, 377867203, 385259399, 391340027, 395956497, 398140411, 399144402, 399600487, 400398941, 403326492, 406325073, 407800446, 408144455, 406771889, 405017624, 404094467, 403779984, 404741974, 405522079, 404822350, 402828903, 398745270, 394222031, 390583725, 388010025]
1196C88010025o29921N36461J421432J694222R97047J088143J758575K084732K493859
1205C99454575K200622J147499L46184p22160r93996n32837j47819P16667O45179j52130
1215D01961784j101722k888680l348350k783776k148857q82873k76795J80474k65618
1224C88445587k057762k671967k549629k449035j794587k132911l429413m278641n275268
1233C61806374n449524m860878m243393l025971k761612l327865l662339m031906m435043
1242C26007843m922180n294533n459785n989075o846924p605057q513221r001255r440423
1251B62935390q919010p109642o235351n858898n506764n456428n073796m240036m066715
1260B10468750m243126m902840o625175o961098o446380n389920l389835j747608k31037
$$ y = [388010025, 387380104, 387916565, 389337997, 391032219, 392029266, 393117409, 394875984, 396960716, 399454575, 401655197, 402802696, 403148880, 402426720, 401432724, 400899887, 400752068, 401468735, 402113914, 401961784, 400860062, 397971382, 394623032, 391839256, 389690399, 388807526, 388530731, 388711205, 388445587, 386387825, 383715858, 381166229, 378717194, 376922607, 374789696, 371360283, 367081642, 361806374, 356356850, 351495972, 347252579, 344226608, 341464996, 338137131, 334474792, 330442886, 326007843, 321085663, 315791130, 310331345, 304342270, 297495346, 289890289, 281377068, 272375813, 262935390, 254016380, 246906738, 240671387, 234812489, 229305725, 223849297, 218775501, 214535465, 210468750, 206225624, 201322784, 194697609, 187736511, 181290131, 175900211, 172510376, 170762768, 170531731]
1269A70531731J532325L690720N277634O577968P415524P615089Q054028Q722782Q778801
1278B28196602Q251438P864475P477532O925087N998859N695095N806465O164780P048130
1287B89428463P511139P956753P716884O600380O039143N655060N528450N839348N786170
1296C48061790N715142N041122L536682K695313K051124J972924K706070K897262K910614
1305C77588043K640228J799355J640053K177963K098579J688233J113167L34739o62078
1314C90418282k069245l104439m598159m012337j443138R53445M736176N825271M693299
1323C91399155L529281J272927k3117p37191j409759j954804k177009k271881j655846
1332C85971756l49731J142959L680496M331818L500214K501487L92914l73840P6523
$$ y = [170531731, 172064056, 175754776, 181032410, 187610378, 195025902, 202640991, 210695019, 219417801, 228196602, 236448040, 244312515, 251790047, 258715134, 264713993, 270409088, 276215553, 282380333, 289428463, 296939602, 304896355, 312613239, 319213619, 325252762, 330907822, 336436272, 342275620, 348061790, 353776932, 358818054, 362354736, 365050049, 367101173, 369074097, 371780167, 374677429, 377588043, 380228271, 382027626, 383667679, 385845642, 387944221, 389632454, 390745621, 391080360, 390418282, 388349037, 385244598, 380646439, 376634102, 375190964, 376144409, 380880585, 386705856, 391399155, 394928436, 396201363, 396178246, 395441055, 394031296, 392076492, 389899483, 387627602, 385971756, 385622025, 386764984, 390445480, 394777298, 398277512, 400778999, 401171913, 400798073, 400874596]
1341D00874596k08855j100311j164170j90048m54864k174645k210350p85370j45912
1350C92440071L73116L57170k69661p90367j581192j856575j570435j693726j451263
1359C83957138k973556o785164q661003j0119706r313583n673409l326644j468430
1367C35635643Q08983M527321M691581J653901j001816n966912o061782o93093N85785
1376C34179611m44145j353989l457794l929863l889084j685600L631096O605415Q657456
1385C38313103R560814Q816223Q645553Q728752Q120995P950058M649200m201202n359878
1394C85223618J544952J782913l378906m281273l005981q85239M688263M616279j558303
1403C84746323k909928j283149k25335J862069K131004L22571L18031J986504J968155
$$ y = [400874596, 400665741, 399565430, 398401260, 398211212, 397756348, 395581703, 393371353, 392585983, 392440071, 392813187, 393170357, 392900696, 392110329, 390529137, 388672562, 387102127, 385408401, 383957138, 380983582, 374198418, 365537415, 355417709, 346104126, 340430717, 337104073, 335635643, 336444626, 340971947, 345663528, 347317429, 346315613, 340348701, 334286919, 333593826, 334179611, 333735466, 332381477, 328923683, 324993820, 321104736, 319419136, 323050232, 329655647, 338313103, 347873917, 356690140, 365335693, 374064445, 382185440, 390135498, 394784698, 390583496, 385223618, 386768570, 388551483, 385172577, 380891304, 377885323, 377000084, 381688347, 386304626, 384746323, 381836395, 380553246, 380327911, 382189980, 384320984, 384643555, 384961586, 386948090, 388916245]
1412C88916245R7045L93143M012108K309074n238990p895966q495064o439934J700173
1421C69357834J604996q100968p596741K735634M600258N81055j363983m431763l792267
1430C53594055J307984L022422M869919O19660j4125328j5548974n374908n25246L958741
1439C31798325N162925J878014J854668M592437M341584J951484k26288m346847m142761
1448C42863541J537094J818886l609162k625961P574348L645859j7667503j9995232
1456C13541870o530514q73088L317108M278431K121219j835594j1746406j2313843
1464B89959183m453430J96456N002518Q132935J1122703R662133O96411P52487R356727
1473C30428123J1874428J1054268J0533333R179611P883301O353607M860420K454033
$$ y = [388916245, 389013290, 389406433, 393418541, 395727615, 390488625, 382592659, 374097595, 367657661, 369357834, 370962830, 362861862, 355265121, 358000755, 362601013, 363182068, 361818085, 357386322, 353594055, 354902039, 357924461, 362794380, 363414040, 349288712, 333739738, 328364830, 327839584, 331798325, 336961250, 338839264, 340693932, 345286369, 349627953, 351579437, 351353149, 347006302, 342863541, 344400635, 346219521, 342610359, 339984398, 347558746, 351204605, 333537102, 313541870, 307011356, 306138268, 309455376, 313733807, 315855026, 314019432, 302273026, 289959183, 285505753, 285702209, 290704727, 298837662, 309960365, 319622498, 320318909, 321071396, 330428123, 342302551, 353356819, 363890152, 373069763, 380953064, 387306671, 392167091, 394621124]
1481C94621124K662430O570320O309281K575416M51775j179695k930642o791343m189263
1490C98099403O943474R760857P993469L562203q556138j0191917k293587P60346J470299
1499D07548409M209518R701271J0678520J1229286K265931k5089760k6238442k214889
1507C92089844O517410R759178Q769989j583328k029419Q253098O706695q051376p934838
1516D12497253P641106Q250923l414840p693787j1338234p002831J1561661J2012215
1524D22513466o320686q418580J870881M919052N458831M186631j75972l214607r924851
1533D10894165m740486J8795471J9289017n79338j0137558k0524521j7859459K907524
1541C98044815P692795m273r9182M605789N232773L051071J859665O1989K42691L335724
$$ y = [394621124, 397283554, 403853874, 410163155, 412738571, 413190346, 412010651, 409080009, 402288666, 398099403, 405042877, 414803734, 422797203, 426359406, 417803268, 407611351, 405317764, 406078110, 407548409, 411757927, 421459198, 432137718, 443367004, 445632935, 420543175, 394304733, 392089844, 398607254, 408366432, 417136421, 415553093, 413523674, 421776772, 428483467, 420432091, 412497253, 420138359, 428389282, 424974442, 417280655, 405942421, 398939590, 410501251, 422513466, 416192780, 407774200, 409645081, 414564133, 420022964, 424209595, 424033623, 420819016, 410894165, 406153679, 424949150, 444238167, 443658829, 433521271, 412996750, 395137291, 398044815, 405737610, 405733337, 405634155, 410239944, 415472717, 418523788, 420383453, 420445442, 420688133, 424023857]
1551D24023857L020744k435913K19574J7401734J0196418k7441749l2416802j2143859
1559C80424004n9128J7861137J8955231k38648l212471O750832O275177j640091n616417
1568D19499626j1538505p248879J2050133J5007286O653557j784096k1018524j9424896
1576C92195702N915870J1701813M076500J765251j39236p33376N61218N26429m61808
1585D15408363o89735l98636l38097m14848k53677M47540J03912j616935j801720o85463
1595D09760704k41737O7215O0806m18930n62401n71747m51545k9831P400k33154m92592
1606D06894188r18388j181832j983871q49953K492409M478226R218444L830910j7616730
1615D04363403j8513946m99954O369819J0727654Q096924o158333r019623l500710
$$ y = [424023857, 427044601, 424608688, 424828262, 442229996, 452426414, 424984665, 392567863, 380424004, 380364876, 398226013, 417181244, 416942596, 413730125, 420480957, 426756134, 425116043, 419499626, 407961121, 400712242, 412762375, 427769661, 434423218, 432639122, 411620598, 392195702, 398111572, 409813385, 413889885, 415655136, 415515900, 414782524, 415343742, 415870171, 415408363, 414718628, 414319992, 413981895, 413567047, 413313370, 413760910, 413864822, 412247887, 410446167, 409760704, 409518967, 409586182, 409646988, 409228058, 408665657, 408093910, 407642365, 407612534, 407619934, 407386780, 406894188, 405975800, 404793968, 402810097, 401960144, 404452553, 408930779, 418149223, 421980133, 404363403, 385849457, 385349503, 391719322, 402446976, 410543900, 404385567, 395365944, 391865234]
1623C91865234n64804M614106L691940n841751n602112L344040O879120J0005455O828537
1632D15219765m611702j0582695j7817726j3115921R124755J3293763J831779N84831
1640C93926849O198159O241569M055252j291733j5903472j4435769K628556J1876831
1648C93296242K6716957J6928634k8265914l5536538j3410110j111488J6021003J8563729
1656C93202515M889984R28650K899170n036q865356q552056Q32329M566422P659187
1665C97555809M796028o967048j0539551j0809670n316467J3396263J3039360p568855
1673C87585869j1414299m391403O0539P822990Q806458K139358J394272R496193J171112
1682D02671089l2511482l0555725Q879928J7432175M705200O42548l423233k768974
$$ y = [391865234, 391300430, 395914536, 399606476, 393764725, 388162613, 391506653, 398385773, 408391228, 415219765, 410608063, 400025368, 382207642, 369091721, 378216476, 391510239, 393342018, 393926849, 400125008, 406366577, 410421829, 409130096, 393226624, 378790855, 381419411, 393296242, 420013199, 436941833, 408675919, 373139381, 359729271, 358617783, 374638786, 393202515, 398092499, 399021149, 401920319, 401915283, 393049927, 384497871, 385330200, 389896622, 397555809, 402351837, 395384789, 384845238, 374035568, 368719101, 382115364, 395154724, 387585869, 376171570, 371780167, 371840706, 379663696, 388470154, 390609512, 392003784, 401499977, 402671089, 370159607, 339603882, 348483810, 365915985, 370621185, 371263733, 367840500, 365071526]
1690C65071526N751838M828720m663009q918038j3427734j0033836R246101M320602
1698C52176170l1046638l1819573J023789O357651p209530j2988796j9957791j8896103
1706B37639179q580208l126850J199951L572236M056682L213635Q51631k826443r645939
1715B26353874j2511482j3456841j1443843l584156k470017p870674q117905n952358
1723A60946598k081633N494128R482135J0958195J2910614J5373230J5221825J3858070
1731B42163162Q798371o201744l683320J9816151K2986889R925365N552998L624916
1739C02982788M198799R727707J0341416O467819O265144R668617Q777848M193306
1747C62623444J411666j951217j857262J701088M654198J0815124Q998413l417739
$$ y = [365071526, 370823364, 375652084, 370989075, 362071037, 348643303, 338609467, 347855568, 352176170, 321129532, 289309959, 290333748, 296691399, 289481869, 276493073, 256535282, 237639179, 229058971, 225932121, 227132072, 230704308, 234760990, 237974625, 238826256, 235999813, 226353874, 213842392, 200385551, 188941708, 185357552, 182887535, 175016861, 166898956, 160946598, 158864965, 164359093, 173841228, 184799423, 197710037, 213083267, 228305092, 242163162, 250961533, 244759789, 241076469, 260892620, 283879509, 293804874, 299357872, 302982788, 307181587, 316909294, 327250710, 333718529, 339983673, 349652290, 358430138, 362623444, 364035110, 362083893, 360226631, 361927719, 366581917, 377397041, 386395454, 382977715]
1755C82977715m762421L931312N122147J755981m10308n072365l206520P673530Q596154
1764C96605225L54538j252633J441002J969796L290672M1466j1672249j0913620K743492
1773C82607689O657600M606972M118919L819924J675834m352569m075279L685951M027367
1782D02772408k623787l072510J178512K942582M574737L839035Q23517k589722j0167122
1791C97677650q727302L357620O394653L354302K046585L17802j029243k781868k595673
1800C98014526j76429R54170J802902J861801Q34732M11759M08859j28746j480827
1809D02502747j573792n97687J32065J416931J366349k83471n87692J4076L33786O18439
1819D03341751J065025K676011J243591n188484m589997L887635M817962R7733k436867
$$ y = [382977715, 378215294, 382146606, 387268753, 389024734, 388614426, 383542061, 380335541, 388009071, 396605225, 396959763, 395707130, 397148132, 399117928, 402408600, 402450066, 390777817, 379864197, 382607689, 389265289, 393872261, 397991180, 401811104, 403486938, 399134369, 395059090, 398745041, 402772408, 400148621, 397076111, 398254623, 401197205, 405771942, 409610977, 410434494, 407844772, 397677650, 388950348, 392307968, 398702621, 402056923, 404103508, 404421310, 403392067, 400610199, 398014526, 397838097, 398792267, 400595169, 402456970, 403291702, 403703461, 404112320, 403983574, 402502747, 400928955, 400331268, 400463333, 401880264, 403246613, 402963142, 402375450, 402389526, 402723312, 403341751, 404406776, 407082787, 408326378, 403137894, 398547897, 402435532, 407253494, 407351227, 404914360]
1828D04914360o515007n057831L836899N481224J412621J69754q5831n41687j783600
1837D01830902k82059N697022N686989Q82873l031006j0820388r108086M586487O960373
1846D02403107K5749r66072J754303J854858J36872k73934K22206J00594n16625n95092
1856D04145966k23885q3923l3150M0054q5602L60260J797181J773834R57985q73337
1866D07775383n558472n524177q82874J240044K941360K957802N89142j01776K39334
1875D03675766J31149j30424k50092l24478k63481N8212M7417n91736q3466K392083
1885D04660950J778106k426605l160972j574517j30424L096580K866288j363068k186051
1894D01560287n26886r6321j24931J8349K58217K64396L815o2447l9138K8877L07808
$$ y = [404914360, 398399353, 393341522, 397178421, 402659645, 404072266, 404242020, 404156189, 403614502, 401830902, 401548843, 407245865, 412932854, 413815727, 410784721, 399964333, 390856247, 395442734, 402403107, 402428856, 401462784, 403217087, 405071945, 405208817, 404934883, 405157089, 405257683, 404741058, 404145966, 403922081, 403838158, 403805008, 403845062, 403759460, 404119720, 405916901, 407690735, 408648720, 407775383, 402216911, 396692734, 395809860, 397049904, 399991264, 402949066, 403538208, 403436432, 403675766, 403806915, 403676491, 403426399, 403101921, 402838440, 402896652, 402944069, 402352333, 402268867, 404660950, 406439056, 404012451, 400851479, 399276962, 399146538, 402243118, 405109406, 403746338, 401560287, 401033401, 400937080, 400812149, 400830498, 401088715, 401353111, 401356926, 401294479, 401255341, 401284218, 401592026]
1905D01592026J74255m36554o42776p54090m17022N04531J111260K130012J552353
1914D04813995r33876k074470l232269k213479K463570K677918j587143k144318l586
1923C97766342O84967R78966P96318k55585n24292k33421j42097j06316N4817M84696
1933C99504395M28466k83966k21023P28836O85730j3123q37555k796173k387314Q62618
1943C95670891J554718K93007N7716L05901K26249j22337j65672Q6059R8458j42098
1953C97862892m7188M95186M47998j27563m39644q20885p35512j45912K59171R60579
1963C97709122P21931p29790j066932o55899l61672K16713L40004j3351j8120L04451
1973C96446457K10991l02315m76837n18570l63579J50681L09486K19574J67618Q3427
$$ y = [401592026, 401766281, 401329727, 400686951, 399932861, 399515839, 400020370, 401131630, 403261642, 404813995, 403880119, 401805649, 398573380, 396359901, 398823471, 401501389, 399914246, 397769928, 397766342, 398451309, 399430275, 400226593, 399971008, 399446716, 399213295, 399071198, 398964882, 399019699, 399504395, 399932861, 399648895, 399427872, 400156708, 400842438, 400829315, 399991760, 397195587, 394808273, 395670891, 397225609, 397518616, 397576332, 397882233, 398108482, 397986145, 397820473, 397906532, 398004990, 397862892, 397815704, 398310890, 398758888, 398631325, 398191681, 397370796, 396635284, 396489372, 396748543, 397709122, 398431053, 397701263, 396634331, 395978432, 395616760, 395833473, 396173477, 396160126, 396142006, 396446457, 396657448, 396355133, 395878296, 395359726, 394996147, 395146828, 395456314, 395675888, 395843506, 395926933]
1983C95926933l9558l64075k35061O07948M66804n61218j167068k137642j634369Q57124
1993C91719818J440735N67932L28293K29607J50451K50588J1444p42684p90825k18162
2003C92947197R4643N69114L98369o56128q36334l63388j14441J92184L03994L58314
2013C92893524N8670r21974r80606j63803J11580J18980J81694K47956J98822K6245
2023C91771088j19477l96728l21617J87149L20434K66571Q1063m24385n54085m14849
2033C90395164k78739r766J17798J51367J75476J79062J19705k2888j28746l09944
2043C90388489k41280J46370K50588K14805O6071l91274m02679N6267J30882m9820
2053C90168419j48773k83699l23563l00865k18620q1330J30921O56128N20439l96462
$$ y = [395926933, 395887375, 395523300, 395288239, 395896187, 396362991, 395801773, 394634705, 392497063, 390862694, 391719818, 393160553, 393728485, 394056778, 394286385, 394436836, 394687424, 394698868, 393956184, 393165359, 392947197, 393041840, 393610954, 394009323, 393353195, 392516861, 392153473, 392039032, 392231216, 392535210, 392893524, 392952194, 392030220, 391049614, 390885811, 390997391, 391116371, 391298065, 391546021, 391744843, 391771088, 391651611, 391254883, 390933266, 391120415, 391440849, 391707420, 391788483, 391364098, 390810013, 390395164, 390116425, 390106659, 390224457, 390375824, 390551300, 390730362, 390850067, 390827179, 390698433, 390388489, 390147209, 390293579, 390544167, 390758972, 390825043, 390433769, 390031090, 390087357, 390218239, 390168419, 390019646, 389735947, 389412384, 389111519, 388892899, 388811569, 388942490, 389598618, 390119057, 389722595]
2063C89722595o39229m28199l38784k32467r0103J44462K24838K60582N7488o03447
2073C88077736o53038j33286N2224O5078J60218L64570L14217j1215j67847k51274
2083C87817383l26157m13208l66669j23977q3924k77023j82876J90963L53318M43229
2093C87031059L94593J33514J9073K137q3428k32010l01094l87191k48909K28881L40691
2104C86897316J55907R9907J07994J3122k53677k50321M7455R9640N722r5367l34015
2115C86493683l27606j32561R3956O08215N40962j37100m42505p02629n92460M0283
2125C85442238K60582K74200J91689j03493k58408l60031m13894m51813l41873k3613
2135C84215584J28517K29111J93100n0774j34239j52321r4185R1095J86920L37334
$$ y = [389722595, 389083366, 388655167, 388316383, 388083916, 387993813, 388138275, 388363113, 388623695, 388681183, 388077736, 387424698, 387291412, 387343636, 387408714, 387568932, 387933502, 388247719, 388236504, 388068657, 387817383, 387491226, 387078018, 386711349, 386587372, 386503448, 386226425, 386043549, 386234512, 386587830, 387031059, 387425652, 387559166, 387578239, 387580376, 387496948, 387264938, 386963844, 386576653, 386327744, 386556625, 386897316, 387053223, 387153130, 387261124, 387274246, 387020569, 386770248, 386817703, 386917343, 386923065, 386827698, 386493683, 386166077, 386033516, 386127472, 386735687, 387276649, 387139549, 386697044, 385994415, 385401955, 385442238, 385702820, 385977020, 386168709, 386065216, 385806808, 385446777, 385032883, 384581070, 384239197, 384215584, 384344101, 384573212, 384766312, 384715538, 384581299, 384428978, 384334793, 384425888, 384612808, 384950142]
2145C84950142J79558m16069n72205m09355l24707k41318p1030L70751K54402n35278
2155C83184891p10488n35469k42004N06630N95093J00364j71890n40466n36690j09901
2165C81540070O7215K34375J02272n05219n96046k83966j09406J23253J71165l090
2175C80740623r269R7275J47781K54402J35689l55988l50952J43051K85645K81563
2185C81369820J51405k04315m11530o70433n56946M1237K48184K46048J82190j04675
2195C80290985j20659J13030J85470K22931J29929j42555l06130n08575m49143q2283
2205C79333000J05629K16484L26157N02815L96042q9645k22474j17530m8180J26381
2215C80528679J14670n8403k01722m27246m78248l83377k87285j13487k5521J6938
$$ y = [384950142, 385129700, 384713631, 384141426, 383732071, 383407364, 383166046, 383095016, 383465767, 383720169, 383184891, 382474403, 381938934, 381696930, 382203560, 382798653, 382899017, 382727127, 382186661, 381649971, 381540070, 381607285, 381841660, 381943932, 381438713, 380842667, 380558701, 380449295, 380572548, 380743713, 380740623, 380731354, 380828629, 380976410, 381230812, 381366501, 381010513, 380659561, 380802612, 381088257, 381369820, 381521225, 381316910, 380905380, 380234947, 379678001, 379719238, 379967422, 380213470, 380395660, 380290985, 380170326, 380283356, 380468826, 380691757, 380821686, 380679131, 380373001, 379864426, 379415283, 379333000, 379438629, 379655113, 379981270, 380484085, 380880127, 380790482, 380568008, 380450478, 380402298, 380528679, 380643349, 380584946, 380383224, 379955978, 379477730, 379094353, 378807068, 378693581, 378668060, 378684998]
2225C78684998J5258m6997j08947k55089k10305Q6556J15623j19438j14212J37329
2235C78184776J04676k23885k72751j23024k8839J06087J48086Q2474J01090K32238
2245C78310928J69754j04904k13890k51045k19116r5597L1243K77290K65579k1705
2255C78148537j38054k22435j66168J34468J53045l5972k04354n51223n08767j5258
2265C76593819J13258L7651p0572l71208l96957j48545r3231j70936j54992j20163
2275C75218124M540K98042L72620K13165K67029N81512N16892N7907r5825q2474n1765
2286C77299767Q6555J19209J08719J7891k94952k25983L07083L70712O6300p9155k76337
2297C77499809k09579J19934L99132Q16803R30328P43370O82602P35741N24063R6321
$$ y = [378684998, 378700256, 378653259, 378544312, 378289223, 378078918, 378165474, 378281097, 378161659, 378047447, 378184776, 378289452, 378065567, 377792816, 377669792, 377640953, 377747040, 377895126, 377977600, 378078690, 378310928, 378480682, 378375778, 378161888, 377910843, 377691727, 377596130, 377627373, 377904663, 378170242, 378148537, 378010483, 377788048, 377621880, 377756348, 377909393, 377873421, 377669067, 377117844, 376609077, 376593819, 376707077, 376744728, 376674156, 376302948, 375905991, 375757446, 375664215, 375493279, 375338287, 375218124, 375222664, 375520706, 375893326, 376106491, 376373520, 376955032, 377471924, 377529831, 377434006, 377351532, 377299767, 377386322, 377505531, 377614250, 377632141, 377337189, 377111206, 377418289, 377789001, 377855301, 377776146, 377499809, 377290230, 377410164, 377809296, 378626099, 379556427, 380299797, 380982399, 381718140, 382242203, 382338524]
2307C82338524l67394j205215j246948o27518K0752J082649J647949K187729J726876
2316C85557404R5825j052857k481460k796631k170334j311531M87785J100807J087418
2325C78516426L31650j679421k781143m087944l308525K79427J494865J470795Q54263
2334C71090393j311302j848450q39462j134415k105446l415146n339584p111816j1759033
2343C36225739p941018M709244J3381004K5156022K4514694J0464401K491493n737076
2351D03264503q378486m365235l811798m833946m857063m267693m096756m201889m123192
2360C60328445m075317l661613k609978k406616l263474k848129j317520l79563N73883
2369C40340118Q17070J36834J10168N05447O69022O15082R39636J575241K192230L118515
$$ y = [382338524, 381971130, 380765915, 379518967, 378891449, 378912201, 379994850, 381642799, 383830528, 385557404, 385653229, 384600372, 382118912, 379322281, 377151947, 375840416, 376328201, 377429008, 378516426, 378848076, 377168655, 374387512, 370299568, 366991043, 367270470, 368765335, 370236130, 371090393, 369779091, 367930641, 367091179, 365956764, 363851318, 360436172, 355096588, 347984772, 336225739, 328284721, 332993965, 346374969, 371530991, 396045685, 406510086, 409001579, 403264503, 394886017, 390520782, 386708984, 381875038, 377017975, 372750282, 368653526, 364451637, 360328445, 356253128, 352591515, 349981537, 347574921, 344311447, 341463318, 340145798, 339766235, 340340118, 341157188, 341294022, 341404190, 341909637, 342578659, 343193741, 344133377, 345708618, 347900848, 351019363]
2379C51019363L369828L072242K705117K012939J536865J099816Q66661R61532P21703
2388C67366066J63536j15852k90146k63481P0839J90239J82151K18888L01094K52990
2398C68076324P0343n5313k58484j93557K43873K87056Q583j17530k22702k56501k43683
2409C67338409j38778J55220K04086M6959m1695k04086j48544K43911K03133l19748
2419C67338867l59268N7449P0801k56767l16391k69661q1749M52499M76113P7972k42462
2430C66947403q64258p71789J42822M30107L66478K95868J21116j15165o10352o20613
2440C65321617j35879N8403J98135J22757k90375l89824k55584k18850k70156j18943
2450C64021301L57628L74565m8675k07405l03269k37922J15356J48315j04904j74751
$$ y = [351019363, 354389191, 357461433, 360166550, 362179489, 363716354, 364816170, 365682831, 366644363, 367366066, 367529602, 367413750, 367123604, 366860123, 366930962, 367121201, 367303352, 367522240, 367823334, 368076324, 368146667, 368091354, 367832870, 367639313, 367883186, 368170242, 368178825, 368061295, 367838593, 367582092, 367338409, 367199631, 367354851, 367558937, 367605896, 367564201, 367360115, 367211571, 367455482, 367658615, 367338867, 366979599, 367037048, 367107849, 366851082, 366534691, 366265030, 366183281, 366635780, 367111893, 367189865, 366947403, 366083145, 365311356, 365454178, 365884285, 366250763, 366546631, 366667747, 366552582, 365942230, 365321617, 365185738, 365244141, 365442276, 365565033, 365274658, 364884834, 364629250, 364410400, 364140244, 364021301, 364378929, 364753494, 364704819, 364497414, 364194145, 363956223, 364071579, 364219894, 364114990, 363940239]
2460C63940239j25656j71166k93502l53089m94003k81601M61349N90096J93367N8861
2470C63524895M9858p7286l80020l84331k0027m2419m41590n02815l35693k17896m3144
2481C61129532L8147Q6517Q583l15437l13988l5744J41373M57306L27072l81698n55993
2492C60585670l75251k37961Q6059P2480l94097l30200K68440L99857K82745M2191
2502C60399933o03638o53534j40419O6262J87416K08129J21613l2425l66211m72793
2512C58714333m83971k79198L66211M32701k2392k10533l54271l52631j44462p6561
2522C57589226q7013p6294p1755o5575q4648l1471J11580J76201K43912J54724j01548
2533C57757339l27377p38144o71158q9378J95274M69208L95737j59722l22113k46772
$$ y = [363940239, 363814583, 363643417, 363349915, 362996826, 362502823, 362221222, 362682571, 363272667, 363466034, 363524895, 363574753, 363497467, 363117447, 362733116, 362713089, 362670670, 362229080, 361726265, 361390572, 361172676, 361129532, 361167679, 361254196, 361262779, 360947342, 360633354, 360597610, 360738983, 361196289, 361523361, 361141663, 360585670, 360210419, 359972458, 360058517, 360130997, 359736900, 359406700, 359675140, 360074997, 360357742, 360399933, 359796295, 359142761, 359002342, 359068604, 359256020, 359464149, 359585762, 359553337, 359187126, 358714333, 358230362, 357951164, 358317375, 358750076, 358727684, 358517151, 358162880, 357810249, 357665787, 357589226, 357502213, 357425919, 357354164, 357288589, 357203941, 357172470, 357284050, 357460251, 357704163, 357858887, 357757339, 357429962, 356691818, 356020660, 355931282, 356126556, 356595764, 356991501, 356831779, 356509666, 356262894]
2543C56262894j90010q1292N0545L43323K74162j97372l86276m89922m05312j1215
2553C55169525J02997M0054k2163j44005k63710n06401m34380J0949J54037J48277
2563C54255180N3673k51541l42369l48091j78604L24516M34608K51770J02997j58539
2573C54143600k73437k68936k98538l62854l07084o7710n4131k60086l02353k20032
2583C51728439k41279m28429l06854K14577K94685l0289o5307J38244Q8730k29149
2593C51163368k65121k8839l4829k37693l05634l81012k29111K92550L75747J58539
2603C50507965j02997o66618p60803m30107k68441k08397P3433P96547P58438q8462
2613C49610558l52860l18756k44408N3177R7504n1727j57090l38821l57132j94321
$$ y = [356262894, 356072884, 355991592, 356042137, 356385460, 356659622, 356462250, 356075974, 355586052, 355180740, 355169525, 355272522, 355312576, 355290413, 355146408, 354882698, 354376297, 353941917, 353952866, 354106903, 354255180, 354308853, 354057312, 353714943, 353366852, 353188248, 353512764, 353947372, 354199142, 354302139, 354143600, 353870163, 353601227, 353302689, 352939835, 352632751, 352565041, 352510910, 352250824, 351948471, 351728439, 351487160, 351058731, 350751877, 350966454, 351261139, 351230850, 351165543, 351303787, 351392517, 351163368, 350898247, 350869408, 350834579, 350596886, 350291252, 349910240, 349681129, 349973679, 350349426, 350507965, 350404968, 349738350, 348977547, 348547440, 348278999, 348070602, 348144035, 348940582, 349699020, 349610558, 349257698, 348938942, 348694534, 348747711, 348845215, 348793488, 348636398, 348297577, 347940445, 347746124]
2623C47746124j62124k21482k16980j63078j59264j67350k41509m93774m24652k1439
2633C45474472J63803L64304J97868n13534o76880m58260k89192J1940J49956K21252
2643C44645729J34010k07214l30429l42140k88735q9645k0485m1504l8147n6953k9335
2654C43335152O6032P2250n1040J1444L11127L26652J08223k5711k07443k30065r9449
2665C43617172R92J77841J85967J0032m5776q0109k632L02773K78473n4818k24342
2676C44165573l66707m09355l94134k29111K56538K87056m6463l35235q78830q90236
2686C41159096m16031n7488N02625N96733K87552j0033o11038o73065j86234l5019
2696C40557098n2223k2888J0033M57k1438j29967m75387l81966K97317K95639l77883
$$ y = [347746124, 347584000, 347362518, 347145538, 346982460, 346823196, 346655846, 346414337, 345920563, 345495911, 345474472, 345638275, 346002579, 346200447, 345686913, 345010033, 344551773, 344262581, 344274521, 344424477, 344645729, 344779739, 344572525, 344242096, 343899956, 343611221, 343521576, 343501091, 343459587, 343421440, 343364487, 343335152, 343401184, 343473434, 343422394, 343433838, 343744965, 344071617, 344179840, 344154129, 343946686, 343716621, 343617172, 343618164, 343796005, 343981972, 343992004, 343946228, 343866119, 343863487, 344166260, 344444733, 344389915, 344165573, 343798866, 343389511, 342995377, 342766266, 343022804, 343309860, 343263397, 342928162, 342049332, 341159096, 340743065, 340685577, 341188202, 341784935, 342072487, 342062454, 341451416, 340778351, 340592117, 340557098, 340504875, 340481987, 340492020, 340492477, 340471039, 340341072, 339865685, 339483719, 339781036, 340076675, 339698792]
2707C39698792m95453j92147j57585k68020l30887m53949m02718j05362q3694l43323
2717C36865654l40462j63574l319K68441L27377J85966J17760M5319J907m8409L586
2728C37260246K56043K03361j62811l03497l46451l21617k46773k2888N58853N63393
2738C37437859J6212k51999n05218n20935k22931j40686k32926j37329K05040J93367
2748C35840454j54724l11852m24881m37240l07579k58904k61573k14081r7046r2240
2758C33280334k05764k33918k70576j46408K66571K86827j3123k42233o22024o60210
2768C31439476l18260k43454l30658l54767l96271l61213j92871k15760m27246n16434
2778C28082542n29747n92498p64351o84014l08303j74027r2277k83700r25064j091957
$$ y = [339698792, 339203339, 339011192, 338853607, 338585587, 338254700, 337800751, 337398033, 337292671, 337208977, 336865654, 336525192, 336361618, 336358299, 336626740, 336954117, 337140083, 337257843, 337303162, 337305069, 337256660, 337260246, 337516289, 337719650, 337556839, 337253342, 336906891, 336585274, 336338501, 336315613, 336874466, 337437859, 337454071, 337202072, 336696854, 336175919, 335952988, 335812302, 335579376, 335442047, 335647087, 335840454, 335685730, 335373878, 334948997, 334511757, 334204178, 333945274, 333683701, 333469620, 333372574, 333280334, 333074570, 332840652, 332570076, 332423668, 332690239, 332977066, 332963943, 332721710, 332099686, 331439476, 331121216, 330877762, 330547104, 330192337, 329796066, 329434853, 329241982, 329026222, 328598976, 328082542, 327552795, 326960297, 326195946, 325511932, 325203629, 325029602, 324937325, 324653625, 323728561, 322636604]
2788C22636604r00764q11806o29425o77109j027336j068115q54988p78198p47910p35054
2798C14405899p22885q07266r72290j187325j507511j743565k021541k029171j647949
2807C01766396j667748j853218k357483l442535l907929l905525m031181m137516m217854
2816B72245407m474640m105110k980938k421379k225399j878014j383323j240731j533012
2825B50002861j433144j077175p51018k05994j51405m85420r09081j570702k179145
2834B41239777k816677l445626m140854m643440n114555n170117m802704m428863l887882
2843B02789059l408184k966652k430916j773110j239318q37555k92778N23567Q19931
2852A91184044P47185M90684m0550o69231j490593k304554l413926l809681l697395
$$ y = [322636604, 321735840, 320924034, 320294609, 319617500, 318590164, 317522049, 316667061, 315888863, 315140953, 314405899, 313683014, 312875748, 311903458, 310716133, 309208622, 307465057, 305443516, 303414345, 301766396, 300098648, 298245430, 295887947, 292445412, 288537483, 284631958, 280600777, 276463261, 272245407, 267770767, 263665657, 260684719, 258263340, 256037941, 254159927, 252776604, 251535873, 250002861, 248569717, 247492542, 246741524, 246535530, 246384125, 245898705, 244989624, 243418922, 241239777, 238423100, 234977474, 230836620, 226193180, 221078625, 215908508, 211105804, 206676941, 202789059, 199380875, 196414223, 193983307, 192210197, 190970879, 190133324, 189840546, 190364113, 191184044, 191931229, 192421913, 192381363, 191712132, 190221539, 187916985, 184503059, 180693378, 176995983]
2861A76995983l265629k169113j600761j563072q53997M65622J435280K418518K918472
2870A74781303L048191K850056K142906J605988J152763M49639o58989j219025j411209
2879A82741623j467457j221905j106262j003723r52492j081943q37803j55926J49479
2888A75063591L60489J63326n85079j000176j286964j509914j637211j733780j823196
2897A66011086j749764j530399j253376q01544n57671m86851l46660j72854o7711n0068
2907A58994188N6267K53201L54766M67310L49274k0504l15914o09865r40323j262903
2917A57325497j717806k399683k790690k847433l264189m144430m380464m150868l849983
2926A27779951l204107k915859l050089k645254j801968j082420j08004J68324k73705
$$ y = [176995983, 173730354, 171561241, 169960480, 168397408, 167543411, 168009033, 169444313, 171862831, 174781303, 177829494, 180679550, 182822456, 184428444, 185581207, 186030846, 185371857, 184152832, 182741623, 181274166, 180052261, 178945999, 177942276, 176989784, 175907841, 175070038, 174914112, 175063591, 175424080, 175587406, 175002327, 174002151, 172715187, 171205273, 169568062, 167834282, 166011086, 164261322, 162730923, 161477547, 160676003, 160118332, 159631481, 159284821, 159111967, 159044256, 158994188, 159050455, 159303656, 159658422, 160125732, 160475006, 160454502, 160138588, 159528723, 158588400, 157325497, 155607691, 153208008, 150417318, 147569885, 144305696, 140161266, 135780802, 131629934, 127779951, 124575844, 121659985, 118609896, 115964642, 114162674, 113080254, 112972250, 113140574, 112866869]
2935A12866869m01974n63383m04835J80960M09842M19855M42028L40462M27722P15971
2945A14433517Q42572R15765Q64745N89847N59569O84261Q50916J120806J361131J698256
2955A23921385J757860J490593J466274J595736J663208J659631J836300K010107K658606
2964A40059700M040241M640818M817724M654169L802538L569603L639221L966809M847049
2973A78037872N143643M935264N042553N341759N504608N676041N601654N193710N055886
2982B25532990N031833N141964N623818N506763M802227M433155M251728L923645L430844
2991B67678967L176689L145466K994041K846012K547741J930466J821766K193203K327690
3000B90662041K493629K331963J777172J449585J129856J072884J362342J408081J374970
$$ y = [112866869, 112464895, 111901512, 111496677, 111677637, 112087479, 112507334, 112949362, 113289824, 113717546, 114433517, 115276089, 116191854, 117056599, 117646446, 118206015, 118890276, 119741192, 120861998, 122223129, 123921385, 125679245, 127169838, 128636112, 130231848, 131895056, 133554687, 135390987, 137401094, 140059700, 144099941, 148740759, 153558483, 158212652, 162015190, 165584793, 169224014, 173190823, 178037872, 183181515, 188116779, 193159332, 198501091, 204005699, 209681740, 215283394, 220477104, 225532990, 230564823, 235706787, 241330605, 246837368, 251639595, 256072750, 260324478, 264248123, 267678967, 270855656, 274001122, 276995163, 279841175, 282388916, 284319382, 286141148, 288334351, 290662041, 293155670, 295487633, 297264805, 298714390, 299844246, 300917130, 302279472, 303687553, 305062523]
3009C05062523J193046P07856O06308Q73089Q82625P22160O67572O28243O90231R72023
3019C13005676R10530M37489L88145P48158P39822M63238K92301J34697j7872k93979
3029C16808205j73321N08556N71251K29L3150N86738P55310P20978O60668M68025L88832
3040C21328621L12080M34189Q99315R31969O12716L93639L3379M2457N17616N58129
3050C26064110K80380J18980j09710j07041J51635K67982K99683M14161O53267O80428
3060C28713875N45769L81927N1498k9068J13450J69296K19574K47001K90871K10533
3070C30914726j18026o1036M55857N01403J47362L7880M1008L9368O1722J09214K45781
3081C32375259K11716J9341j22071l58352l17574O2714J59263M2916N2452J65214J30654
$$ y = [305062523, 306255569, 306963425, 307569733, 308442822, 309325447, 310047607, 310715179, 311343422, 312033653, 313005676, 313916206, 314353695, 314741840, 315489998, 316229820, 316693058, 316985359, 317120056, 317102184, 316808205, 316634884, 317143440, 317714691, 317714920, 317748070, 318334808, 319090118, 319811096, 320471764, 320939789, 321328621, 321640701, 322074890, 322974205, 323906174, 324518890, 324912529, 324945908, 324988365, 325505981, 326064110, 326344490, 326463470, 326353760, 326246719, 326398354, 326666336, 326966019, 327380180, 328033447, 328713875, 329259644, 329641571, 329693069, 329664001, 329777451, 329946747, 330166321, 330413322, 330704193, 330914726, 330796700, 330735664, 331191521, 331692924, 331840286, 331878166, 331919174, 331958542, 332020264, 332129478, 332375259, 332586975, 332606316, 332484245, 332125893, 331808319, 331871033, 332030296, 332073212, 332125664, 332290878, 332421532]
3092C32421532o0540j21154r7504r1057j4305j17569n60265m55360K52953M54406K94228
3103C31905365L00865M11530L49273J09444j4801q3694j49231k23389k07672r9411
3113C32298279p630J36834J63307Q1558K0027n5542j36871k70119k78931j37100j27105
3124C31686707k91825j78566L04718L36876m6501j66893j94778j27793J41144J80969
3134C31644058L6469m1962j49498j58768o6299j4076M2228O4583J10893j1711m38690
3145C31017227m36287L4828Q2703k28882k65808j27106n4359M539Q0834K26478K00272
3156C30534439M768j30157l62663k92511K09083K24572k01188l30696l50723k53181
3166C29051743Q9645J57585J4992p8201k64130k37732L5782J12305J24206j4305n05219
$$ y = [332421532, 332360992, 332239838, 332142334, 332051277, 332036972, 331919403, 331359138, 330903778, 331156731, 331611137, 331905365, 332206230, 332617760, 332967033, 333076477, 333061676, 332977982, 332828751, 332605362, 332397690, 332298279, 332290649, 332427483, 332590790, 332672348, 332692375, 332636833, 332499962, 332229843, 331950912, 331813812, 331686707, 331394882, 331216316, 331521034, 331857910, 331811409, 331644516, 331449738, 331321945, 331463089, 331644058, 331680527, 331638565, 331489067, 331330299, 331264000, 331249924, 331292152, 331356735, 331467628, 331455917, 331017227, 330580940, 330615768, 330698471, 330469589, 330203781, 330076675, 330022316, 330026855, 330107689, 330334167, 330534439, 330539207, 330409050, 330046387, 329753876, 329962959, 330187531, 329986343, 329655647, 329304924, 329051743, 329141388, 329298973, 329313965, 329235764, 328971634, 328733902, 328769684, 328881989, 329006195, 328991890, 328486671]
3177C28486671m57038J56860L38097L48320J37558n62897o29883j31607P8659K69394
3187C28034134K17934j68076k98729l02582k57950m4822o5346l37105l89595l13988
3197C26073875k19116k3346N4817Q0605R766l35923k00538N74837N99174n3902k88505
3208C26271744m05770k97775K25792K93961j9799j40648k28652k19346n8174l0517
3218C25390816j04447j22070j20621j11808j16616m0512J97411J76887r3193k30789
3228C24825058l85551l40691o676M1237j33972k11258l00407k85149j21346j03225
3238C22978020k05994k34604k44636k09580j30157l0289J60713J81923N7221m9363
3248C22273254k89688k21481K93503K58178k81066n15709p28875n96275R7046J64528
$$ y = [328486671, 328029633, 328186493, 328524590, 328872910, 329010468, 328447571, 327817688, 327686081, 327764740, 328034134, 328252068, 328083992, 327785263, 327482681, 327224731, 327179909, 327114563, 326777458, 326387863, 326073875, 325854759, 325831413, 325886230, 325966835, 325976601, 325640678, 325440140, 326014977, 326614151, 326560249, 326271744, 325865974, 325568199, 325793991, 326087952, 326068153, 325927505, 325698853, 325479507, 325421333, 325390816, 325286369, 325164299, 325043678, 324931870, 324815254, 324774742, 324972153, 325149040, 325055847, 324825058, 324439507, 324098816, 324092140, 324133377, 323999405, 323788147, 323487740, 323202591, 323081245, 322978020, 322772026, 322537422, 322292786, 322083206, 321953049, 321922760, 322083473, 322265396, 322322617, 322273254, 321983566, 321762085, 322055588, 322313766, 322032700, 321516991, 320788116, 320191841, 320288887, 320453415]
3258C20453415l42636m45595l71208j94321K38190L85513L23525K86598K72522N2414
3268C20658417m93279o59218n71251m31537r7275O1741J69525R6798k40803l80039
3278C18113079m76837l70503J8120K10037L97454K89688k13394m21047n12372m62760
3288C16571465k12670k6932K42691K64893M8637j12056l89576l88623r7751L8624J85718
3299C16124420J25427k29377l12081j61400j91230m00544l81221j29223p0572j03951
3309C14270248k08625n52636m87327N7449J50910r1057k02675l33290l53813k11010
3319C12038174k47708n04493m79470j94320o7215L8376p401k30541l99342p05967o17027
3330C08623066n474Q3675k71549l40462k76813j98841j4534K6207l0747j21116l17803
$$ y = [320453415, 320110779, 319665184, 319293976, 319099655, 319337845, 319723358, 320046883, 320333481, 320606003, 320658417, 320165138, 319505920, 318934669, 318503132, 318405857, 318467598, 318637123, 318733921, 318493118, 318113079, 317636242, 317265739, 317283859, 317493896, 317891350, 318181038, 317967644, 317546597, 317034225, 316571465, 316358795, 316331863, 316574554, 316839447, 316888084, 316776028, 316386452, 315997829, 315900078, 315938702, 316124420, 316249847, 316020470, 315708389, 315546989, 315355759, 314955215, 314573994, 314444771, 314374199, 314270248, 314061623, 313508987, 313021660, 313079109, 313230019, 313138962, 312936287, 312602997, 312249184, 312038174, 311790466, 311285973, 310806503, 310612183, 310544968, 310583344, 310575943, 310345402, 309946060, 309240093, 308623066, 308617592, 308701267, 308429718, 308089256, 307812443, 307613602, 307599068, 307625275, 307594528, 307473412, 307155609]
3341C07155609l94115l94116l69529l04719k13623L6488p1278o28013p54585o09627
3351C03452492m40369K5272n4359q32806q56857j73340n1498l42598l73840l10669
3361C00041428j67370K73227J54973o13690q11806o32286n27382l51448k34832q4649
3371B97046165j44958m97570n72453m90894l38077M4345J08471p7476k40803n23567
3381B94313183o31809o31562n53379l17325k14825k10514j56403k8381p1297l46889
3391B91150799l65734j82381o9618J18255O8417k53429l97683m57534n13077o35872
3401B88462143m62284J66416K51045j53999k68478k82288k18620N4130L1700l18050
3411B87261715l63102k32468m4593M29153L92914j62125m06723o12030n24292M7226
$$ y = [307155609, 306761494, 306367378, 305997849, 305693130, 305479507, 305515995, 305444717, 304816704, 304062119, 303452492, 303012123, 303037395, 302983036, 302150230, 301293373, 301120033, 301068535, 300725937, 300352097, 300041428, 299874058, 300147285, 300302258, 299688568, 298876762, 298244476, 297717094, 297365646, 297130814, 297046165, 296901207, 296403637, 295831184, 295340290, 295002213, 295046558, 295155029, 295077553, 294836750, 294313183, 293681374, 293049812, 292496433, 292179108, 291964283, 291753769, 291597366, 291568985, 291497688, 291150799, 290785065, 290602684, 290533066, 290651321, 290719738, 290466309, 290068626, 289611092, 289098015, 288462143, 287999859, 288166275, 288417320, 288263321, 287994843, 287712555, 287493935, 287548065, 287579765, 287261715, 286898613, 286666145, 286621552, 287050705, 287443619, 287281494, 286874771, 286262741, 285738449, 285785675]
3421B85785675Q2245m18663m39167r1801N5313J76678J39713j52111j81675r308Q7738
3432B85034637K14825K26727J42593K9068k35558k33650K5044J58310L41415K52247
3442B85955658j47820l85284p79629n26676N97725Q93116O05106M50859K00024N3406
3452B86916485m4117p6523m4098L6945K71550K54402j907j43528l39985k70367J36623
3463B86695480K72503K25773K50359L29723K73457J21841r6092o19164n22384K61306
3473B87192802N35508N98182M50611q9893k95868l57399k42233K09579L22571J68572
3483B88492432J35898J43757J26610N2929J11332L12576M22001O29425M08878m26044
3493B90409794o04878l64761k7199Q60710Q08945k21023n85557q18481m30584J048088
$$ y = [285785675, 285867920, 285449257, 285010090, 284918289, 284973602, 285150280, 285289993, 285137882, 284956207, 284946899, 285034637, 285249462, 285476189, 285618782, 285647850, 285412292, 285178642, 285203686, 285361996, 285703411, 285955658, 285807838, 285422554, 284642925, 284116249, 284713974, 285607090, 286212196, 286663055, 286863079, 286916485, 286872368, 286795845, 286751747, 286788692, 287060242, 287314644, 287312737, 287169209, 286829224, 286558857, 286695480, 286967983, 287193756, 287444115, 287773838, 288047295, 288169136, 288073044, 287453880, 286931496, 287192802, 287728310, 288326492, 288777103, 288687210, 288391342, 288033943, 287791710, 288001289, 288323860, 288492432, 288628330, 288772087, 288898697, 288951626, 289062958, 289375534, 289797535, 290426960, 290835838, 290409794, 289804916, 289440155, 289412956, 290273666, 291082611, 290861588, 290276031, 289457550, 289026966, 290075054]
3503B90075054J247406M07925o3896p62692p18117J74771N23796O50177O58741M27723
3513B92620888L37124L14960K65827J97659J73073K58941J22528l19938m02451r8476
3523B93470135j79997p71065o06994L21846P10487Q70247Q57811O01540L29494j51157
3533B95452347k98977k68459J6689P78446J050453J158009P65552l44734r66568j693001
3543B95649757j361122L34015J008759J350403R92050n92461r33189l98865J2398Q05626
3553B96867371R56535M18663M01001O33240R85145J801987J832008J678696J76430
3562C05751076l511200m874687n416642l639946J952172L873367L471375K838840Q18005
3571C01262360n4589l58104l13282M18434P01408N41458J049519K454052K729416K641182
$$ y = [290075054, 291322460, 291730385, 291666489, 290903797, 290185680, 290360451, 290884247, 291534424, 292193165, 292620888, 292958012, 293272972, 293538799, 293736458, 293909531, 294168472, 294291000, 293971062, 293568611, 293470135, 293290138, 292519073, 291912079, 292233925, 292944412, 293814659, 294672470, 295274010, 295603504, 295452347, 295153370, 294884911, 294901600, 295680046, 296730499, 297888508, 298654060, 298309326, 297342758, 295649757, 294288635, 294622650, 295631409, 296981812, 297973862, 297381401, 296448212, 296049347, 296061745, 296867371, 297823906, 298242569, 298643570, 299276810, 300261955, 302063942, 303895950, 305574646, 305751076, 302239876, 297365189, 291948547, 288308601, 290260773, 294134140, 297605515, 300444355, 301262360, 301207771, 300849667, 300536385, 300954819, 301656227, 302197685, 303247204, 305701256, 308430672, 311071854]
3581C11071854J151332k445926m290352o165028m800548R10034L269196M374980L532162
3590C06607704p17392j848450q64028k79923J055260J048546n75772o24904K83966
3599C04085007J426925L988991L952503J801968l85513m505654n053272k328625o37779
3608C02344551J656532K309075J026649J224518L340225K206097k427807m397392o113053
3617C01169395m099845K838363O440640R644508Q958798M642028q48770j1111736j4213562
3626C03419819j3278484p743359P906666J1045704L059387J027355J474133J220703
3634C08131924J110782R46045M14143R62734K646446L796807N626220M952431K708664
3643C31296196j658440j1019477j3340703j1036872o485234M076004P973671Q339424
$$ y = [311071854, 312223186, 309777260, 305486908, 299321880, 294521332, 295431366, 298700562, 303075542, 306607704, 305890312, 304041862, 303177834, 302897911, 303953171, 305001717, 304425945, 303801041, 304085007, 305511932, 309500923, 313453426, 315255394, 314869881, 310364227, 305310955, 302982330, 302344551, 304001083, 306310158, 307336807, 308561325, 311901550, 314107647, 311679840, 307282448, 301169395, 297069550, 299907913, 306348553, 315993061, 324951859, 329593887, 328745117, 317633381, 303419819, 290141335, 282397976, 290304642, 301350346, 304409733, 305437088, 306911221, 308131924, 309242706, 310188751, 310602894, 311565628, 314212074, 318008881, 323635101, 328587532, 331296196, 329637756, 318618279, 305277576, 294240704, 287755470, 291831474, 299805145, 308144569]
3651C08144569N318394n097141p021904k283344N42163M963646N519619J547108J159172
3660C12792282L281136M097213N442849L791122j316338m519462r100914p290344L384590
3669C10562134N263557J813660l174782j6525516j4734269L995648Q969803M437198
3677C00607433M094830M944572N279770N923043N289573M712067M43497j0097275j2842427
3686C08355083j0328998o476650K368679N507011M168511M129161M178524L379345
3694C15280666J657486K46754j166096k565136n327720l963471K263565M918556O473313
3703C17817917N472412J354218k179375p330418q994808q520851n620003J610279N271206
3712B98880577P791023P352600K662182P11193K10534o75927j655330k062550k090950
$$ y = [308144569, 313462963, 308365822, 301343918, 299060574, 299602737, 304566383, 310086002, 311633110, 312792282, 316073418, 320170631, 325613480, 329404602, 328088264, 323568802, 314467888, 307177544, 310562134, 315825691, 317639351, 314464569, 297939053, 283204784, 287200432, 296170235, 300607433, 304702263, 309646835, 314926605, 320849648, 326139221, 330851288, 331294785, 321197510, 308355083, 298026085, 291549435, 293918114, 299425125, 303593636, 307722797, 311901321, 315280666, 316938152, 317184906, 316018810, 313453674, 308125954, 304162483, 306426048, 311344604, 317817917, 323290329, 324644547, 322465172, 315134754, 306139946, 297619095, 291999092, 293609371, 298880577, 306671600, 314024200, 316686382, 317397575, 317608109, 316932182, 315276852, 313214302, 311123352]
3721C11123352j633148o95725O36826K808800M124183O332169M129410l882180o809482
3730C16134205o281605o677170q475055n381833L328095Q456230J4131546J3036003
3738C28270416M988442j968384j3749352j4739761n744934Q40912J3666859J0527629
3746C22091827j2943992j7077694p140865j734734N123844Q102169Q681297O267090
3754C11368942j895199m194736k512207r37958K675057L828544L491860K282867j053810
3763C13053360k118111r77745j763115n085716m369011K35558K755165N388489N312213
3772C12431087K239476J40896k472630l615150m143238k619496K657642L442517K55127
3781C08316231p39823j019706q41637R3956Q42800J886845K241859K063256J711387
$$ y = [311123352, 309490204, 308794479, 309431305, 312240105, 316364288, 322696457, 326825867, 322943687, 316134205, 309852600, 303175430, 294700375, 289318542, 292646637, 301102867, 315234413, 328270416, 333258858, 331290474, 317541122, 302801361, 297056427, 297897339, 311564198, 322091827, 309147835, 292070141, 284929276, 283194542, 288318386, 296420555, 305101852, 311368942, 309473743, 305279007, 302766800, 301828842, 304503899, 308332443, 311824303, 314107170, 313053360, 310935249, 309957504, 308194389, 303108673, 298739662, 298975220, 301730385, 307118874, 312431087, 314670563, 314811459, 312338829, 308723679, 304580441, 301960945, 304618587, 308061104, 308316231, 307576408, 306556702, 305715065, 305809021, 306651821, 308538666, 310780525, 312843781, 314555168]
3790C14555168Q91438M18911j34240J25657K190589J195660k579441n391846j0925293
3799C00346603q190879N960464P940292l2425l247966p335415m491100Q181095J1292457
3808C10423126P973194N089283q4152l513584p701168o674042J846314K769699k171746
3817C07956924m816780r682884o863823O362667R200802L879795K275715J544952J184922
3826C11042290J853485J419773l82176l57875K196312J268139k882462n283127q391857
3835C00482502p350674j202831J365185K263546K537021P24297J624603M848233P153759
3844C12445641J0693321J0096283P015953K06947j3729553j9955177k4531136j8050423
3852B64191856M842282J3315201J3372898J1825332M689446J085758j235714k398739
$$ y = [314555168, 315446606, 315865517, 315731277, 315856934, 318047523, 319243183, 316663742, 311271896, 300346603, 292155724, 298116188, 306056480, 306024055, 302776089, 295440674, 290949574, 299130669, 310423126, 318396320, 323485603, 323401451, 319887867, 312186699, 305512657, 307358971, 310128670, 307956924, 303140144, 293457260, 286593437, 292956104, 302156906, 306036701, 308312416, 309857368, 311042290, 312895775, 314315548, 313933372, 313575497, 315771809, 317039948, 314157486, 308874359, 300482502, 293131828, 291928997, 293294182, 295557728, 298094749, 298819046, 300443649, 305291882, 312445641, 323138962, 333235245, 340251198, 340458145, 326728592, 306773415, 282242279, 264191856, 269034138, 282349339, 295722237, 307547569, 312237015, 313322773, 312087059, 309688320]
3860C09688320k201328j327267J403103J953831J598835p23610p598381p625580r47495
3869B94220428J601944K258301K912750K900124K988586L771058K105713l383637m054069
3878C05321198j94550P05490M97093p37190n370598l992805M898796N882721N35011
3887C07545166k028923n672455m059563M481316O925583N710602M111519N18093j905442
3896C15625896m361629n205879m291287l852844l641128k420426j78337J796722M801045
3905B98272133M935722J753807R38912J704445J510849J031417J12038j632442k507458
3914C06119423l356934k502899Q17299J871338J552353J017074n68618j027832q83332
3923C03037872k21729J873722J820812k13375j317024k691994k443313m01726Q57353
$$ y = [309688320, 307486992, 306159725, 307562828, 309516659, 311115494, 310391884, 302793503, 295167923, 294220428, 295822372, 298080673, 300993423, 303893547, 306882133, 310653191, 312758904, 309375267, 305321198, 305126648, 305832138, 306329231, 305592041, 300221443, 296228638, 301127434, 307010155, 307545166, 305516243, 299843788, 295784225, 300265541, 307191124, 312901726, 317013245, 317531338, 315625896, 311264267, 306058388, 301767101, 297914257, 294273129, 291852703, 291674366, 293471088, 298272133, 303207855, 304961662, 305900574, 307605019, 309115868, 310147285, 310259323, 308626881, 306119423, 302762489, 300259590, 301076889, 302948227, 304500580, 305517654, 304949036, 303921204, 303037872, 302816143, 304689865, 306510677, 306297302, 304980278, 302288284, 299844971, 299443245, 300300598]
3932C00300598K361050K574444J397132P63417K86102m20322j684914j807690r23156
3941C02846661j94073J192570J144886n31674r67026p57217l89805N78881Q60214O72798
3951C04456215M27971j74046l46184j65691j10626k2888o0082l15914k60830L7193
3961C03465118L20435R17664P69386k57721n71747m90894l35446J45913K66780J00136
3971C04329624L7441n2948l8852J89533O0577m86145o39686n92690l87916J77383L32832
3982C02929153J05381J57357M94957M30813m5777k06947k25296j38283J54724K85645
3992C03941727L61442L18527O9619K7160J41640J96686K95162K41280
4000C05593243
$$ y = [300300598, 302661648, 305236092, 306633224, 307396641, 307682743, 307262421, 305577507, 303769817, 302846661, 302652588, 303845158, 304990044, 304458370, 303491344, 302734127, 302344322, 302923203, 303783417, 304456215, 304884186, 304710140, 304363956, 304198265, 304087639, 304064751, 304004669, 303688755, 303427925, 303465118, 303785553, 304703217, 305472603, 305214882, 304643135, 304152241, 303816795, 303962708, 304229488, 304329624, 304367065, 304314117, 304275265, 304464798, 304525375, 304039230, 303399544, 302806854, 302418938, 302596321, 302929153, 303034534, 303191891, 303686848, 304117661, 304071884, 303864937, 303639641, 303501358, 303656082, 303941727, 304303169, 304621696, 304691315, 304718475, 304860115, 305056801, 305351963, 305593243]
##END=$$ End of the data block
