##TITLE=$$ Begin of the data block
##JCAMP-DX=5.00 $$ ACD/SpecManager v 10.08
##SPECTROMETER/DATA SYSTEM=16PC
##DATE=17 Jul 2013 16:28:02
##DATA TYPE=INFRARED SPECTRUM
##DATA CLASS=XYDATA
##ORIGIN=
##OWNER=
##NPOINTS=3601
##FIRSTX=400.00000000
##LASTX=4000.00000000
##MAXX=4000.00000000
##MINX=400.00000000
##MAXY=298.75000000
##MINY=21.62301445
##XFACTOR=1.0000000000
##YFACTOR=0.000001000000000
##FIRSTY=53.87451553
##DELTAX=1.00000000
##XUNITS=1/CM
##YUNITS=TRANSMITTANCE
##XYDATA=(X++(Y..Y))
400E3874516k5940632j091791L9008882N9863304Q4030930N5772033n3161651p4037842
$$ 53874516 27933884 26842093 65850975 125714279 209745209 265517242 212355591 138317749
408A38317749k1727707n478950J380821J409416r519463j7458816l8475777k2249197
$$ 138317749 116590042 111111092 112491913 113901329 104381866 86923050 48447273 26198076
416B6198076L7014414O5819767J01308319O8409424o2290405r8066742p2311424m4181706
$$ 26198076 63212490 129032257 230340576 298750000 236459595 138392853 66081429 21899723
424B1899723K7129032L7551331j7407395j5707351M3376594L4904068n2670883m8224091
$$ 21899723 49028755 86580086 69172691 53465340 96841934 131746002 79075119 30851028
432C0851028N4888108N8966736k6617173m1648910q876946K477623J3254189R316177
$$ 30851028 85739136 144705872 118088699 76439789 67562843 70040466 83294655 92610832
440I2610832k2625107j5278366M2601059L8743065k8450226m0317321j3506218q6449
$$ 92610832 69985725 54707359 97308418 136051483 107601257 67283936 53777718 53691269
448E3691269J6689323K1901276J1943314J6159416L7986587L4332657O499863p628632
$$ 53691269 70380592 92281868 104225182 120384598 158371185 192703842 199203705 191575073
456A91575073j6804291k3904663l1734794k6197029j827881N420852P29798o71982
$$ 191575073 174770782 150866119 119131325 92934296 91106415 96527267 97257065 96585083
464I6585083m558159l063438N239341O776116L258491J414086q52631j887253j134582
$$ 96585083 92026924 88963486 94202827 100978943 104237434 105651520 104798889 102911636 101777054
473A01777054k470116p447311n976990K535439N622123O774597M494500m142189n941056
$$ 101777054 99306938 91859627 85882637 88418076 94040199 100814796 105309296 101167107 95226051
482I5226051k054123j067756j093697j098945j485993j678154j643753k086517l360420
$$ 95226051 93171928 92104172 91010475 89911530 88425537 86747383 85103630 83017113 79656693
491G9656693l345871k214264j399750o40587M50180K444534K667427J094056M98436
$$ 79656693 76310822 74096558 72696808 72056221 72506401 74950935 77618362 78712418 79210854
500G9210854J26548K20421O56250J686836M085015M506347L229096K484367J694466
$$ 79210854 79337402 79557823 80214073 81900909 85985924 90492271 93721367 96205734 97900200
509I7900200R38911j9951l10966l7910L43109J257156J460075J158356P70165N6312
$$ 97900200 98839111 98819160 98508194 98470284 98813393 100070549 101530624 102688980 103459145 103515457
519A03515457m44771j139640r40850L92273Q09601O98685N59425J68587q1139l60130
$$ 103515457 103070686 101931046 100990196 101382469 102192070 102890755 103450180 103618767 103537628 103177498
529A03177498l79776k16149J46241J166656R92607o38031q24257K53411M15756o7284
$$ 103177498 102797722 102581573 102727814 103894470 104887077 104249046 103424789 103678200 104093956 104026672
539A04026672r6344K92466J44104p19834o30996M68582O78451K81189M6730l40179
$$ 104026672 103930328 104222794 104366898 103647064 103016068 103484650 104163101 104444290 104491020 104150841
549A04150841l88718M0703j01357r25750r39705j20972n1239n35988p71736r73892
$$ 104150841 103762123 103802826 103701469 102775719 101836014 101715042 101663803 101127815 100356079 99382187
559I9382187j084641j110504j083328p52808j088447k208687k670456k878593k657082
$$ 99382187 98297546 97187042 96103714 95350906 94262459 92053772 89383316 86504723 83847641
568H3847641k007103j099991L91556J329514K085762K310508J925331J593781J020737
$$ 83847641 81840538 80740547 81132103 82461617 84547379 86857887 88783218 90376999 91397736
577I1397736P23198N95329N43144P79511N46691k49603m74693j76163k98355q91380
$$ 91397736 92120934 92716263 93259407 94038918 94585609 94336006 93861313 93685150 93386795 92495415
587I2495415q10478o6422K38915L61732L79036J99631J11313O9694l5431l17909k12311
$$ 92495415 91684937 91618515 91857430 92219162 92598198 92797829 92909142 92978836 92943405 92625496 92413185
598I2413185L16261N62531P48848O90719L49404O4323m57931l83377L83735O26206
$$ 92413185 92729446 93291977 94040825 94731544 95080948 95145271 94687340 94303963 94687698 95313904
608I5313904O36558M61693k06970j82053P22855N74547o68671r07158l95080k15775
$$ 95313904 95950462 96412155 96205185 96023132 96745987 97320534 96651863 95744705 95349625 95133850
618I5133850j96648N5054O04057P98340P47612O64833M49013K90871J39664P537k19375
$$ 95133850 94937202 94992256 95596313 96394653 97142265 97807098 98256111 98546982 98686646 98694183 98474808
629I8474808r8130M89853O27068M04312L75603M13681M73472P49634N08476n23735
$$ 98474808 98376678 98866531 99493599 99897911 100273514 100687195 101160667 101910301 102418777 101895042
639A01895042n18508N81069P18743J62170j03142m06433m16397n9532L8742l2898l959
$$ 101895042 101376534 101957603 102676346 102838516 102735374 102328941 101912544 101853012 101891754 101858856 101854897
650A01854897J36230P4196l16330k16919N11864M93576k17774m62028n50080l98635
$$ 101854897 101991127 102065323 101748993 101532074 102043938 102537514 102319740 101857712 101307632 100908997
660A00908997J48941L82637O52763K68028j218963j327675k22496K73323P76932O42707
$$ 100908997 101057938 101440575 102093338 102361366 101142403 99814728 99592232 99865555 100642487 101285194
670A01285194l18740p04598p89787q77663q47702q78860r67408r49356q01063p81441
$$ 101285194 100966454 100261856 99472069 98594406 97746704 96867844 95900436 94951080 94150017 93368576
680I3368576r37103q22899l62564l06374m89639q20869j389222j929710k388382l246330
$$ 93368576 92431473 91608574 91246010 90939636 90449997 89629128 88239906 86310196 83921814 80675484
690H0675484m453804n729004p684662q151817p472111o448292m626514l019738j219036
$$ 80675484 76221680 70492676 62808014 54656197 47184086 40735794 36109280 33089542 31870506
699C1870506J52661J038742K288269L912616N017090N864239O298374O398442O004047
$$ 31870506 32023167 33061909 35350178 39262794 44279884 50144123 56442497 62840939 68844986
708F8844986M965683M041481K939346K069451J325752P21931K76917r8847l34907o23840
$$ 68844986 73810669 77852150 80791496 82860947 84186699 84908630 85185547 85086700 84751793 84127953
718H4127953r17435j216034j565720j781990j926300j937385j832489j604225j095437
$$ 84127953 83210518 81994484 80428764 78646774 76720474 74783089 72950600 71346375 70250938
727G0250938r42344j125817j086525r33952p89474n12009n44594q98598j085712j192547
$$ 70250938 69308594 68182777 67096252 66162300 65372826 64860817 64316223 63417625 62331913 61139366
737F1139366j361275j550003j784324k166558k261833k098320j998283j907944j720428
$$ 61139366 59778091 58228088 56443764 54277206 52015373 49917053 47918770 46010826 44290398
746D4290398j506352j090290m64653J64749Q51963J586369K457569L117702L696110
$$ 44290398 42784046 41693756 41229103 41393852 42245815 43832184 46289753 49407455 53103565
755E3103565M023194M214550L977348L235413K586242J755074J243446R29092P99462
$$ 53103565 57126759 61341309 65318657 68554070 71140312 72895386 74138832 75067924 75867386
764G5867386R46861J014542J026436J243423J749588J947334J986794J864738J421570
$$ 75867386 76814247 77828789 78855225 80098648 81848236 83795570 85782364 87647102 89068672
773H9068672J298981J507805J362869R30954O30020K86247J76690L59153L25394J08223
$$ 89068672 90367653 91875458 93238327 94169281 94799301 95085548 95262238 95621391 95946785 96055008
783I6055008Q4640J96549K99026N02777N09858L58482J93504j17469j89972l4523O225
$$ 96055008 96139648 96336197 96635223 97138000 97647858 98006340 98199844 98082375 97892403 97857880 97864105
794I7864105P8438n9990m56047o79871q32511r40011j050689r45351o06872l23151
$$ 97864105 97942543 97882553 97426506 96746635 95914124 94974113 93923424 92978073 92371201 92048050
804I2048050J55777J17615n54177o81495l41988m03168q87420q37685k48192r9327
$$ 92048050 92203827 92321442 91767265 91085770 90743782 90340614 89453194 88615509 88367317 88267990
814H8267990l10371k23801J08170K36869K76162K19055r1240k0813N26733N31601k1621
$$ 88267990 87957619 87733818 87841988 88078857 88355019 88574074 88482834 88462021 88988754 89520355 89498734
825H9498734n1835L43087M73358N60356M08173j80870k20490K26860M24576O04004
$$ 89498734 89446899 89789986 90263344 90823700 91231873 91051003 90830513 91057373 91481949 92085953
835I2085953N76164K75925J52679Q8410J05835K51533L16162L47664L63586L46688
$$ 92085953 92662117 92938042 93090721 93179131 93284966 93536499 93852661 94200325 94563911 94910599
845I4910599L48182L36892L86047N32387N55778N00222M09820J71974J92642N26047
$$ 94910599 95258781 95595673 95981720 96514107 97069885 97570107 97979927 98151901 98344543 98870590
855I8870590N49149L10730K38533K57087K40471K44286J72043j91q0490j75880n0499
$$ 98870590 99419739 99730469 99969002 100226089 100466560 100710846 100882889 100882698 100802208 100626328 100575829
866A00575829M27505M94698K00988J10001J27487O6567q5358r0958O0158Q8738N7388
$$ 100575829 101003334 101498032 101699020 101809021 101936508 102003075 101917717 101826759 101886917 101975655 102033043
877A02033043n272j22429k30186m03122m07173k05040j80268k64931l47160m94049
$$ 102033043 102027771 101905342 101675156 101272034 100864861 100659821 100479553 100214622 99867462 99373413
887I9373413n49225n13122n40634o70060n93612k49169j93405l32306m85519p95174
$$ 99373413 98824188 98311066 97770432 97100372 96506760 96257591 96064186 95731880 95246361 94451187
897I4451187q73375o97899p45628r73297j077225j177879j097252p66899o38718o48262
$$ 94451187 93577812 92879913 92134285 91160988 90083763 88905884 87808632 87041733 86403015 85754753
907H5754753o01555n28145n03898n31815n24353n49583m22951j03882O0562O3896K78855
$$ 85754753 85153198 84625053 84121155 83589340 83064987 82515404 82092453 81988571 82049133 82113029 82391884
918H2391884O87187R88869J415016J340843P10343L72100P3861k4056J57501J41403
$$ 82391884 83079071 84067940 85482956 86823799 87534142 87906242 87980103 87956047 88113548 88254951
928H8254951J1208r0362k63688k49916m3251P4204J62071K63527L83659M58580M94522
$$ 88254951 88266159 88175797 87912109 87662193 87618942 87693146 87855217 88118744 88502403 88960983 89455505
939H9455505N30175N57014N70061N77476N51560N08636M11087K26471J21811P9750
$$ 89455505 89985680 90542694 91112755 91690231 92241791 92750427 93161514 93387985 93509796 93589546
949I3589546K335o4018k07062m33235o29349q54660r85718r76135j135109j469589
$$ 93589546 93591881 93527863 93320801 92887566 92258217 91403557 90417839 89441704 88306595 86837006
959H6837006j642586j707337j788215j884270j875015j786736j635170j323295j223732
$$ 86837006 85194420 83487083 81698868 79814598 77939583 76152847 74517677 73194382 71970650
968G1970650j395462j229950p40959m82346l47397k09335j15845l006J50871J95031
$$ 71970650 70575188 69345238 68604279 68121933 67774536 67565201 67449356 67446350 67597221 67792252
978F7792252J15005J19377K17774J63032m5303j58379j93527l30330n77782p20451
$$ 67792252 67907257 68026634 68244408 68407440 68362137 68203758 68010231 67679901 67102119 66381668
988F6381668p78412q87153j068142j100159r98737r23203q55423p08866n72060j77551
$$ 66381668 65603256 64716103 63647961 62547802 61549065 60625862 59770439 59061573 58489513 58311962
998E8311962M98009J093624J939301K076004J571060J113937L07892N0163K21474M01489
$$ 58311962 58809971 59903595 61842896 63918900 65489960 66603897 66911789 66961952 67183426 67584915
1008F7584915Q03955R94080J028755J114967J281113J206375Q74260O71242M88159
$$ 67584915 68388870 69382950 70411705 71526672 72807785 74014160 74888420 75559662 76047821
1017G6047821L75015M19113K20894k53082m69612m10530o82022j228333j666359k292434
$$ 76047821 76422836 76841949 77062843 76809761 76340149 75929619 75247597 74019264 72352905 70060471
1027G0060471k304390j905892j084518N36316J437622K051353K168221J621773J286865
$$ 70060471 67756081 65850189 64765671 65301987 66739609 68790962 70959183 72580956 73867821
1036G3867821R42825N97290K30141q5877m11293n77026n29312o52260r46358j025680
$$ 73867821 74810646 75407936 75638077 75552200 75140907 74563881 74034569 73382309 72435951 71410271
1046G1410271r38866q77525p85919o95519o29593m63577j70921J7471J42128K71576
$$ 71410271 70471405 69593880 68807961 68112442 67482849 67019272 66848351 66865822 67007950 67279526
1056F7279526L73176N09072P20237P80442O77658O86210P77085P91954P25624P57172
$$ 67279526 67652702 68161774 68882011 69662453 70340111 71026321 71803406 72595360 73320984 74078156
1066G4078156Q81744R39392R81499R62257Q19748Q47343J083855J080559R59488O81282
$$ 74078156 74959900 75899292 76880791 77843048 78662796 79510139 80593994 81674553 82634041 83315323
1076H3315323J86920k48314p06100j135132j606560j887344k095459j992180j705223
$$ 83315323 83502243 83253929 82547829 81412697 79806137 77918793 75823334 73831154 72125931
1085G2125931r62418M73923J380783K129478K457406K372695K105309J468895R78828
$$ 72125931 71163513 71637436 73018219 75147697 77605103 79977798 82083107 83552002 84530830
1094H4530830M96605O0623l65371o74683q63907j053329j156265j399231j783394k077767
$$ 84530830 85027435 85088058 84722687 84048004 83184097 82130768 80974503 79575272 77791878 75714111
1104G5714111k370666k539971k590843k624779k625488k556896k422764k244304j992798
$$ 75714111 73343445 70803474 68212631 65587852 62962364 60405468 57982704 55738400 53745602
1113E3745602j761982j508141j312664j172447j018688q20328p70691r51859q42311
$$ 53745602 51983620 50475479 49162815 47990368 46971680 46151352 45380661 44428802 43586491
1122D3586491m62342k52224q5804k7515j10004j38501k52029q9314M19594O33644O43231
$$ 43586491 43124149 42871925 42786121 42758606 42648602 42510101 42258072 42168758 42588352 43221996 43865227
1133D3865227P27749Q49365Q79742Q54419P59533O08154L61824k4696l32237o04298
$$ 43865227 44592976 45442341 46322083 47176502 47936035 48544189 48906013 48881317 48549080 47944782
1143D7944782q86104j185299j426293j683281j735210j576569j450706j310108j101471
$$ 47944782 47058678 45873379 44447086 42763805 41028595 39452026 38001320 36691212 35589741
1152C5589741p82967n75352m49085l01906j64986j5904J73615K67818K53487L19050
$$ 35589741 34806774 34231422 33782337 33480431 33315445 33299541 33473156 33740974 33994461 34313511
1162C4313511M72999M92741M00208L30089K40162J64604R7512K8251n8124r1435n0499
$$ 34313511 34786510 35279251 35679459 36009548 36249710 36414314 36511826 36540077 36481953 36390518 36340019
1173C6340019r0408k10663k58232k69127k52582j70563j66058k32364k53510k37011
$$ 36340019 36249611 36038948 35780716 35511589 35259007 35088444 34922386 34690022 34436512 34199501
1183C4199501k68890l36956m04122n04207n39254n50605m71138k51627j56451j53423
$$ 34199501 33930611 33593655 33189533 32685326 32146072 31595467 31124329 30872702 30716251 30562828
1193C0562828j07143n9510K1624J74261K14195J88326R3222j15585k57159m09794m41360
$$ 30562828 30455685 30396175 30417799 30592060 30806255 30994581 31087803 30972218 30715059 30305265 29863905
1204B9863905l13330l11994m35067m05527k33078j56044j37878q6498J2756Q822j33395
$$ 29863905 29550575 29238581 28803514 28397987 28164909 28008865 27870987 27784489 27797245 27806067 27672672
1215B7672672j22642K4986Q2302Q1562J20663J76311K43712L46708L94703L85736M18211
$$ 27672672 27550030 27575016 27657318 27738880 27859543 28035854 28279566 28626274 29020977 29406713 29824924
1226B9824924M55021N45906P07032Q23929R50763R85073Q84533R20704J077698J147438
$$ 29824924 30279945 30825851 31532883 32356812 33307575 34292648 35177181 36097885 37175583 38323021
1236C8323021J199509J163360R98306R37630R48025R29092R39488Q44787O17340N02060
$$ 38323021 39522530 40685890 41684196 42621826 43569851 44498943 45438431 46283218 46900558 47402618
1246D7402618M77028L85025J92593J90403L54313M89879O72409P94938Q61236R62998
$$ 47402618 47879646 48264671 48457264 48647667 49001980 49491859 50164268 50959206 51820442 52783440
1256E2783440J102710J178692J241066J190926J016903Q63048O99879N00942K63905
$$ 52783440 53886150 55064842 56305908 57496834 58513737 59376785 60076664 60577606 60841511
1265F0841511K4250k60834m55639n68439p02164q41190r45114j038960j063057j035454
$$ 60841511 60865761 60604927 60149288 59580849 58878685 58037495 57092381 56053421 54990364 53954910
1275E3954910r44042p72907n98095l90816j90426j3492K45594N80311R11117J298187
$$ 53954910 53010868 52237961 51639866 51249050 51058624 51045132 51290726 51871037 52782154 54080341
1285E4080341J580120J812436J934337J925728J927757J960282J802635J388382J203750
$$ 54080341 55660461 57472897 59407234 61332962 63260719 65221001 67023636 68412018 69615768
1294F9615768J233124J052597O94298M53400K29332J29181K35672J10580k67555l75054
$$ 69615768 70848892 71901489 72595787 73049187 73278519 73407700 73643372 73753952 73486397 73111343
1304G3111343k65579k48474k70538k35581j46934q7693l2875M96J7884J4473J6166
$$ 73111343 72845764 72597290 72326752 72091171 71944237 71856544 71823669 71824165 71842049 71856522 71872688
1315G1872688p6080k11601m94141j026939j293427j368164j469444j518173j612549
$$ 71872688 71796608 71585007 71090866 70063927 68770500 67402336 65932892 64414719 62802170
1324F2802170j765633j827049j818035j804043j746323j734684j814628j714657j442600
$$ 62802170 61036537 59209488 57391453 55587410 53841087 52106403 50291775 48577118 47134518
1333D7134518j238991j034809q65864p76196n54107j29486N485j46889j03759J03306
$$ 47134518 45895527 44860718 43994854 43218658 42664551 42535065 42540550 42393661 42289902 42393208
1343D2393208J17610o7638o8691O8809J43433J60789K99645N26356P96653J107621
$$ 42393208 42510818 42443180 42374489 42443298 42586731 42747520 43047165 43573521 44370174 45477795
1353D5477795J515007K133392K448345K514694K627472K679062K804802L130295L017448
$$ 45477795 46992802 49126194 51574539 54089233 56716705 59395767 62200569 65330864 68348312
1362F8348312K524376K056404J392083J011894R45740N93467m0672l73703m58282o66741
$$ 68348312 70872688 72929092 74321175 75333069 76278809 76872276 76831604 76457901 75999619 75332878
1372G5332878q97049j185081j629525j799888j731491j713944j689148j599884j456691
$$ 75332878 74435829 73250748 71621223 69821335 68089844 66375900 64686752 63086868 61630177
1381F1630177j274777j094459p39529j33347K41185N00251O61682O06297P92721J234482
$$ 61630177 60355400 59260941 58521412 58388065 58629250 59129501 59791183 60397480 61190201 62424683
1391F2424683J418781J590320J282982L30422j36208k85980n73921j001168j108409
$$ 62424683 63843464 65433784 66716766 67047188 66910980 66625000 66051079 65049911 63941502
1400F3941502r59706p58293l22315j75953k59354k88032l60108l67782l32287k76829
$$ 63941502 62981796 62223503 61901188 61725235 61465881 61177849 60817741 60449959 60117672 59840843
1410E9840843j95694q8619J20117J27293j63510o3728M78958N66365K81833J90140
$$ 59840843 59645149 59556530 59676647 59803940 59640430 59576702 60055660 60622025 60903858 61093998
1420F1093998N9723K51747R16004J091934Q34130Q84727J189278J223297J087669R03244
$$ 61093998 61153721 61405468 62321472 63413406 64247536 65132263 66321541 67544838 68632507 69535751
1430F9535751N12101M25125N21064P74071J495339J465896O95755L63518K45522N7647
$$ 69535751 70047852 70472977 70994041 71768112 73263451 74729347 75425102 75788620 76034142 76091789
1440G6091789o1516l82347r73442j290085j333999j643173k024704k712532l993729
$$ 76091789 76030273 75647926 74674484 73384399 72050400 70407227 68382523 65669991 61676262
1449F1676262m486321m860237l818104j331378J188301N262638O216167M260803L224282
$$ 61676262 57189941 52329704 48511600 47180222 48368523 53631161 59847328 64108131 67332413
1458F7332413J942299J244018J032067Q66676J022270Q40660L03772J41976K08900
$$ 67332413 69274712 70518730 71550797 72417473 73439743 74280403 74584175 74726151 74935051
1467G4935051L59444O39129J010681J705094J835586J367424J326279J659370J551865
$$ 74935051 75294495 75933624 76944305 78649399 80484985 81852409 83178688 84838058 86389923
1476H6389923J034355P99271P58102N72518L15735L2928l62282n69649n74974p35687
$$ 86389923 87424278 88223549 88981651 89554169 89869904 89902832 89540550 88970901 88395927 87660240
1486H7660240q41072j376694k359108l236892m319664m920510n374763n027962m297020
$$ 87660240 86819168 85442474 83083366 79846474 75526810 70606300 65231537 60203575 55906555
1495E5906555k168819K022312M600384O788875P369751O093483N176064L746437L072624
$$ 55906555 53737736 55760048 60360432 67149307 74519058 80612541 85788605 89535042 92607666
1504I2607666L314636K564385P33711Q3183L55667L19100K81143K43141J37184K33322
$$ 92607666 95922302 98486687 99220398 99303581 99659248 99978348 100259491 100502632 100639816 100873138
1514A00873138O83617O09467r5513j27220N34157N05112j38283l17116k45453j46156
$$ 100873138 101556755 102166222 102070709 101943489 102477646 102982758 102844475 102527359 102281906 102135750
1524A02135750J66397J72279j29844k14959k21420j21017K17697K40494K1461j81770
$$ 102135750 102302147 102474426 102344582 102129623 101908203 101787186 102004883 102245377 102266838 102085068
1534A02085068o74034m93676N13390P69043N73585L03727l66524n10262j52633j20217
$$ 102085068 101411034 100917358 101430748 102199791 102773376 103077103 102710579 102200317 102047684 101927467
1544A01927467l45443k72011J09199K05345O8978Q2825K00775K24281J87416J52260
$$ 101927467 101582024 101310013 101419212 101624557 101693535 101776360 101977135 102201416 102388832 102541092
1554A02541092j7075J60813R56299Q06167l59375o98135n50553l97422M7233J20110
$$ 102541092 102524017 102684830 103641129 104447296 104087921 103389786 102839233 102441811 102489044 102609154
1564A02609154k27043j37879M39789M40933m2465l13545o71768o16387n1231J38283
$$ 102609154 102382111 102244232 102684021 103124954 103082489 102768944 102097176 101480789 101429558 101567841
1574A01567841K49099k1240q85322j190377j096489j116203j273109r60518j08170
$$ 101567841 101816940 101795700 100910378 99720001 98623512 97507309 96234200 95273682 95165512
1583I5165512L96134Q60572R39896N93353L29109m1503k71988m07822n13550n13481
$$ 95165512 95561646 96422218 97362114 97955467 98284576 98243073 97971085 97563263 97049713 96536232
1593I6536232o46210q40950j142265j607658j962563k407410k415207k172447j460266
$$ 96536232 95890022 95049072 93906807 92299149 90336586 87929176 85513969 83341522 81881256
1602H1881256j50749J025246K558898L216271L215408K917694J995705J397659Q20854
$$ 81881256 81730507 82755753 85314651 88530922 91746330 94664024 96659729 98057388 98878242
1611I8878242N27520N35179N11459O82617M75853k28614l78777r7916N5024L15620
$$ 98878242 99405762 99940941 100452400 101135017 101610870 101382256 101003479 100905563 100960587 101276207
1621A01276207L00552l8910j24862p0595j167K24899J66489k46910k92420o3629R0927
$$ 101276207 101576759 101537849 101412987 101342392 101341225 101566124 101732613 101485703 101193283 101129654 101220581
1632A01220581L74008L23204o9481l09921o06460o20179l07174j82251j63552o3751
$$ 101220581 101594589 101917793 101848312 101538391 100931931 100311752 100004578 99822327 99658775 99595024
1642I9595024J04065K04926L84613J94816n24139o85318n43114j67084R32694Q66127
$$ 99595024 99699089 99904015 100288628 100483444 99959305 99273987 98730873 98563789 99496483 100362610
1652A00362610m13941q28956p89505p32041m99290k84126M0718J58981J55930O553
$$ 100362610 99948669 99119713 98330208 97598167 97098877 96814751 96855469 97014450 97170380 97176933
1662I7176933m63249n32196k73804j15509J45836J24718j89758l68592o35933n24238
$$ 97176933 96713684 96181488 95907684 95792175 95938011 96062729 95872971 95504379 94868446 94344208
1672I4344208J80031J54922n65117p96181p34878p78908r06944q06740m01497l10798
$$ 94344208 94524239 94679161 94114044 93317863 92582985 91804077 90897133 90090393 89688896 89378098
1682H9378098l80112o07994j218865j316505r65500q03993o46614n96932p60483o11831
$$ 89378098 88997986 88389992 87171127 85854622 84889122 84085129 83438515 82841583 82081100 81469269
1692H1469269o3156Q537l21915m77028o50955o44584k83623m64394j270843j471161
$$ 81469269 81406113 81414650 81092735 80615707 79964752 79320168 79036545 78572151 77301308 75830147
1702G5830147j136490j214340j565148j799606k018547k208183k370930k510979k583359
$$ 75830147 74693657 73479317 71914169 70114563 68096016 65887833 63516903 61005924 58422565
1711E8422565k764083l146626l181385k822613k803039l102257l069256k809666k552272
$$ 58422565 55658482 52511856 49330471 46507858 43704819 40602562 37533306 34723640 32171368
1720C2171368k224112j888275j475811j199652j093960q09120k34079j62840p01164
$$ 32171368 29947256 28058981 26583170 25383518 24289558 23480438 23246359 23083519 22382355
1729B2382355o32000j27341K83553J062820Q90804n62954o56986M14038P87210Q10837
$$ 22382355 21750355 21623014 21906567 22969387 23860191 23297237 22640251 23054289 23841499 24652336
1739B4652336R54367J041246J308155J741028K159428K605724L090786L697968M082870
$$ 24652336 25606703 26647949 27956104 29697132 31856560 34462284 37553070 41251038 45333908
1748D5333908M410267M365444L909828L512192K887795K706771L104401K869103J999565
$$ 45333908 49744175 54109619 58019447 61531639 64419434 67126205 70230606 73099709 75099274
1757G5099274J712631J884132J793648J630425J357574P91267P03766J149651J138023
$$ 75099274 76811905 78696037 80489685 82120110 83477684 84268951 84972717 86122368 87260391
1766H7260391P49512O52313P60864P49184P41791N66368J11725n127J46812K26212
$$ 87260391 88009903 88662216 89423080 90172264 90914055 91480423 91592148 91587021 91733833 91960045
1776I1960045L35075M06624N02495M42787J46103J17828L63160L55621J29631P3715
$$ 91960045 92295120 92701744 93204239 93647026 93793129 93910957 94274117 94629738 94759369 94833084
1786I4833084R2369J79024M40124M56307K79144J21399j48704k17102p4433p2357j96198
$$ 94833084 94925453 95104477 95544601 96000908 96280052 96401451 96252747 96035645 95961212 95888855 95692657
1797I5692657j53038R3743J04645j12198j50017p0473l3790O866K4254r873M4655K10022
$$ 95692657 95539619 95633362 95738007 95625809 95475792 95405319 95371529 95378395 95402649 95392776 95437431 95647453
1809I5647453K57157K13768J97960J74095J66458J63322J87157K51343K79899K96593
$$ 95647453 95904610 96118378 96316338 96490433 96656891 96820213 97007370 97258713 97538612 97835205
1819I7835205K82028K09564K04995K71179K70744J87020K23899M26461M10362K13264
$$ 97835205 98117233 98326797 98531792 98802971 99073715 99260735 99484634 99911095 100321457 100534721
1829A00534721O8596j59981j60545J04401J72592R7702J26984K65403K45766K0882
$$ 100534721 100603317 100443336 100282791 100387192 100559784 100657486 100784470 101049873 101295639 101316521
1839A01316521M6592L45299L71262J80839R4109L2516r964k1644m3297p9781p0877
$$ 101316521 101363113 101708412 102079674 102260513 102354622 102387138 102377174 102355530 102312233 102232452 102161575
1850A02161575p873J3733K0080J953l5858j03569k60612k59117q8952l8795k3956r4658
$$ 102161575 102153702 102167435 102187515 102189468 102153610 102050041 101789429 101530312 101441360 101402565 101378609 101283951
1862A01283951l38791l54553j66054p8636O706q16j33179j71707j72714j29769L220
$$ 101283951 100945160 100590607 100424553 100345917 100352623 100351807 100218628 100046921 99874207 99744438 99747658
1873I9747658L5118l3997j3519P4554J27480J85562J90186J23977J14922J59882J43119
$$ 99747658 99782776 99748779 99735260 99809814 99937294 100122856 100313042 100437019 100551941 100711823 100854942
1884A00854942L1021P3578L28606L14743K8275l4790M1419R7107K14409K24449J15319
$$ 100854942 100885963 100959541 101288147 101602890 101631165 101596375 101637794 101734901 101949310 102173759 102289078
1895A02289078J03454J54137J89682K64458K38655R6031M1275L2066L2853O1012Q2496
$$ 102289078 102392532 102546669 102736351 103000809 103239464 103335495 103376770 103408836 103441689 103502701 103585197
1906A03585197J20491J16066N9220M8668R5886N6030j02638j08459K9136P6203J15989
$$ 103585197 103705688 103821754 103880974 103929642 104025528 104081558 103978920 103870461 103899597 103975800 104091789
1917A04091789M9279k01226k27424l8392o126o5063j05690j76712j92788j51207j48269
$$ 104091789 104141068 103939842 103712418 103674026 103667900 103602837 103497147 103320435 103127647 102976440 102828171
1928A02828171j69304j76743j89613j69350q4686r9228j99486k75871l89221m05975
$$ 102828171 102658867 102482124 102292511 102123161 102038475 101939247 101739761 101463890 101074669 100668694
1938A00668694l04512l05008m04068l95371l07655k32552j30462o8482m9423N035J04447
$$ 100668694 100364182 100059174 99655106 99259735 98952080 98719528 98589066 98520584 98471161 98476196 98580643
1949I8580643J32232Q5999R1713J25389J56952K16675K13569J26961J30585K13478
$$ 98580643 98712875 98798874 98890587 99015976 99172928 99389603 99603172 99730133 99860718 100074196
1959A00074196K45643K61757K53083K09068J80366J50391J34804J35712J28837J30341
$$ 100074196 100319839 100581596 100834679 101043747 101224113 101374504 101509308 101645020 101773857 101904198
1969A01904198R9899Q057J2901J20232J48727J45958J02669k6131n1285M624M2793
$$ 101904198 102004097 102012154 102025055 102145287 102294014 102439972 102542641 102516510 102465225 102469849 102512642
1980A02512642J05598J22071R0881Q7982J22589Q1543p3646p6012P6058J09100P1670
$$ 102512642 102618240 102740311 102831192 102919174 103041763 103123306 103049660 102973648 103049706 103158806 103230476
1991A03230476M2839k4574k0843M4731R9586J92520K00608J39236O9695p5753q7570
$$ 103230476 103273315 103248741 103227898 103272629 103372215 103564735 103765343 103904579 103974274 103898521 103810951
2002A03810951N6771N7434o5300r2865q0208k6200J33729J39877p721m9637m3274j8623
$$ 103810951 103867722 103925156 103859856 103766991 103686783 103660583 103794312 103934189 103926468 103876831 103833557 103814934
2014A03814934O2797P6889L6194J4572j2619k0813n340r506l4119l2906j6517J1299
$$ 103814934 103877731 103954620 103990814 104005386 103992767 103971954 103966614 103957108 103922989 103890083 103873566 103884865
2026A03884865P6866P8628K3079j4213p5119o7879J8288M8256M0481N6145J07216Q4404
$$ 103884865 103961731 104040359 104063438 104049225 103974106 103906227 103924515 103972771 104013252 104069397 104176613 104261017
2038A04261017j9554o6704r6779q9073l1799P171N8602O7070K7656J5114J0895J4404
$$ 104261017 104241463 104174759 104077980 103988907 103957108 103964279 104022881 104089951 104117607 104132721 104143616 104158020
2050A04158020M5586K5177o1844p6370k7894j7616l6217j9836K6245N9151J14372R2720
$$ 104158020 104203606 104228783 104166939 104090569 104062675 104045059 104008842 103989006 104015251 104074402 104188774 104281494
2062A04281494k1454o6421q7075o5872J7906O3462J15921R5276k9641n4214J0941L601
$$ 104281494 104260040 104193619 104106544 104040672 104058578 104122040 104237961 104333237 104303596 104249382 104260323 104263924
2074A04263924o8161p4463l7499J595P6843R3315O7047K8778n9890p6393k4224j2016
$$ 104263924 104195763 104121300 104083801 104085396 104162239 104255554 104322601 104351379 104291489 104215096 104190872 104178856
2086A04178856k0882j7837j3756J594M6898L7102l1494n9105q0704n6480L2471P0686
$$ 104178856 104157974 104140137 104126381 104127975 104174873 104211975 104180481 104121376 104040672 103984192 104016663 104087349
2098A04087349R5634P2930j3634o4781j30585j10222L9917M4419r7184j07788l5980
$$ 104087349 104182983 104255913 104242279 104177498 104046913 103936691 103976608 104021027 103923843 103816055 103780075
2109A03780075L5072J74622J88805Q1321L1067j5739k3102K0264L2859M4777J7067
$$ 103780075 103815147 103989769 104178574 104259895 104290962 104275223 104252121 104272385 104305244 104350021 104367088
2120A04367088p8056r0454l0113p248n226J9455Q6547P3388l6149n4954n531J4854
$$ 104367088 104289032 104198578 104168465 104161217 104155991 104175446 104261993 104335381 104299232 104244278 104238747 104253601
2132A04253601M1008L0922k8992m2389l0281n272N5672P2937N3642M8706M7875M1153
$$ 104253601 104294609 104325531 104296539 104254150 104223869 104218597 104274269 104347206 104400848 104449554 104497429 104538582
2144A04538582L4759J3573m0367m0268J1848L7240O6688N5740r30l7598r9731p1236
$$ 104538582 104573341 104586914 104546547 104506279 104518127 104555367 104622055 104677795 104676865 104639267 104539536 104468300
2156A04468300P8178J11031N4237L7552M8187P462j08460j25625n1689l0205l5736
$$ 104468300 104546478 104657509 104711746 104749298 104797485 104804947 104696487 104570862 104519173 104488968 104453232
2167A04453232k6756j2230K029J9310L2089M8142M3602M486J0467P9270O0158o2943
$$ 104453232 104426476 104414246 104416275 104435585 104467674 104515816 104559418 104563904 104574371 104653641 104713799 104650856
2179A04650856p5127J1750L0090J6548p965q2893p1625L8269O0249J6564M608q850
$$ 104650856 104575729 104587479 104617569 104634117 104626152 104543259 104471634 104509903 104570152 104586716 104591324 104582474
2191A04582474J1352Q7525R4909N5672N768q6113j30699j56098j39236o0745k1485
$$ 104582474 104593826 104681351 104776260 104831932 104837700 104751587 104620888 104464790 104325554 104264809 104243324
2202A04243324l929K2621O3614O6323K8472J1681J1803j6213j00540q3565M3175Q7975
$$ 104243324 104239395 104262016 104325630 104391953 104420425 104432106 104443909 104427696 104327156 104243591 104286766 104374741
2214A04374741R2552Q1398M2419o02p3952r6489r6131m2297J19255J40839M1099p148
$$ 104374741 104467293 104548691 104591110 104590508 104516556 104420067 104323936 104281639 104400894 104541733 104582832 104575684
2226A04575684o1608o4445j0803K1888O2081P3341N8243M2557K3155j3428q2916j08963
$$ 104575684 104514076 104449631 104438828 104460716 104522797 104596138 104654381 104696938 104720093 104706665 104623749 104514786
2238A04514786j13510q5091J122L4240M6540J9760q5427r3574l0403L1212J67701J46057
$$ 104514786 104401276 104316185 104317307 104351547 104398087 104417847 104332420 104238846 104208443 104239655 104407356 104553413
2250A04553413n6503j15898r8084o3346N7144M8233r7656j35277j25626p0282J06003
$$ 104553413 104496910 104381012 104282928 104219582 104276726 104324959 104227303 104092026 103966400 103896118 104002121
2261A04002121J03638r4651j20430r727J2924j9218j4687J3596K5604K2865L9047P3746
$$ 104002121 104105759 104011108 103890678 103880951 103893875 103874657 103859970 103873566 103899170 103922035 103961082 104034828
2273A04034828R4727J28502J01211m486m5486m6830n1498m6127m1252m3198j6357P2746
$$ 104034828 104129555 104258057 104359268 104354782 104309296 104262466 104210968 104164841 104123589 104080391 104064034 104136780
2285A04136780N4619p3555j31318j81823j52939n081L1158j2489l2425n7747p5836
$$ 104136780 104191399 104117844 103986526 103804703 103651764 103646683 103677841 103665352 103632927 103575180 103499344
2296A03499344j07552q2328L0044L7857m4540q2993j10359j29677j25671j56571k60589
$$ 103499344 103391792 103309464 103339508 103377365 103332825 103249832 103139473 103009796 102884125 102727554 102466965
2307A02466965k26853l4431K1843k6848j0468O3157N5290p439r3010k83310k83050
$$ 102466965 102240112 102205681 102227524 102200676 102190208 102253365 102308655 102301216 102208206 101924896 101641846
2318A01641846r1027p324J9219Q3831K37297J81054j38092k09046j11580l7979J11504
$$ 101641846 101550819 101543495 101562714 101646545 101883842 102064896 101926804 101717758 101606178 101568199 101679703
2329A01679703J30111K6032k7107j01067q2634N1354R4940Q8737P6126L0373J4999
$$ 101679703 101809814 101835846 101808739 101707672 101625038 101676392 101771332 101860069 101936195 101966568 101981567
2340A01981567J023M0603J90354J71638J3069j21337l28301l85048l36670k25586O1966
$$ 101981567 101982590 102023193 102213547 102385185 102398254 102276917 101948616 101563568 101226898 101001312 101063278
2351A01063278J13342n4100r7366q3046q7997o2256j28983l84826l20320R1079K33719
$$ 101063278 101176620 101122520 101025154 100942108 100854111 100791855 100662872 100278046 99957726 100048805 100282524
2362A00282524K49649J86134r2575r0744J54328K95807M77981M70352K20414J68350
$$ 100282524 100532173 100718307 100625732 100534988 100689316 100985123 101463104 101933456 102153870 102322220
2372A02322220K72438K59140J44096J38001K47597K34870J11245O8710P9826O2012
$$ 102322220 102594658 102853798 102997894 103135895 103383492 103618362 103729607 103798317 103878143 103940155
2382A03940155K7390J0086J548J717L0159Q415q5876q4877J4213L2181m669k2339n3070
$$ 103940155 103967545 103977631 103979179 103980896 104011055 104019470 103933594 103848717 103862930 103895111 103890442 103868103 103815033
2395A03815033m1870J8791M3602N1384N2238M7822K1339n0926n7480M074J2444k6322
$$ 103815033 103773163 103791954 103835556 103886940 103939178 103987000 104008339 103957413 103899933 103904007 103916451 103890129
2407A03890129j5282M7829N6839L0235p6o5353p2693j8280j0445m3846l1738J1329
$$ 103890129 103874847 103922676 103979515 104009750 104009674 103944321 103871628 103853348 103842903 103799057 103767319 103778648
2419A03778648N6527J45912J39785K9442j0582j4259k0622P698l9833k38060j77170
$$ 103778648 103835175 103981087 104120872 104150314 104139732 104125473 104104851 104112549 104072716 103834656 103657486
2430A03657486K05635K49123k411o4942k5802j9715k1865K838P8941P2861l3165l4683
$$ 103657486 103863121 104112244 104109833 104044891 104019089 103999374 103977509 103980347 104059288 104132149 104098984 104064301
2442A04064301O7039P2456k3269j457J59935J54037j2108n9891n4649j3946J21192
$$ 104064301 104131340 104203796 104180527 104179070 104339005 104493042 104480934 104421043 104366394 104352448 104473640
2453A04473640J32225M5060k5460j58241j52801j885O4751J18423J03432j4519m2656
$$ 104473640 104605865 104650925 104625465 104467224 104314423 104312538 104377289 104495712 104599144 104584625 104541969
2464A04541969m341J023l594j0971l4760k7824J4618K6154J5899J3832J6381P576j8357
$$ 104541969 104537628 104538651 104535057 104524086 104489326 104461502 104476120 104502274 104518173 104532005 104548386 104555962 104537605
2477A04537605k2575k152q010m1985m5990k2507j9790k9915l6408l9077n5100j11267
$$ 104537605 104515030 104512878 104504868 104462883 104416893 104394386 104374596 104344681 104308273 104269196 104214096 104102829
2489A04102829q3405N2338P6431J6785j8929q9286o7734O6780J03477P8553N7937J9051
$$ 104102829 104019424 104071762 104148193 104164978 104146049 104056763 103989029 104055809 104159286 104237839 104295776 104314827
2501A04314827j3924o4041o3247M074P125n4405m8805J1185M4723Q2283Q2703L4736
$$ 104314827 104300903 104236862 104173615 104177689 104184814 104130409 104081604 104092789 104137512 104219795 104302498 104337234
2513A04337234K4560M9446L4004k3674m0871l5499j8738M4060K5222j11534r3574Q4472
$$ 104337234 104361794 104411240 104445244 104421570 104380699 104345200 104326462 104370522 104395744 104284210 104190636 104275108
2525A04275108J28197J01997M2366j29150j35452L0899O2942K2652l1090j74019j62170
$$ 104275108 104403305 104505302 104547668 104418518 104283066 104313965 104376907 104399559 104368469 104194450 104032280
2536A04032280J808Q4328J86973J36704j38161j77788k0317K6780L2371K8137j3832
$$ 104032280 104034088 104118416 104305389 104442093 104303932 104126144 104105827 104132607 104164978 104193115 104179283
2547A04179283j3779M7234J3634j57524j39069Q8455J19995k0240k4056R2957Q4854
$$ 104179283 104165504 104212738 104226372 104068848 103929779 104018234 104138229 104117989 104093933 104186890 104271744
2558A04271744m9210o0150L0472N9532O9641N3238r323l1876l4736k3156L3310J7975
$$ 104271744 104222534 104162384 104192856 104252388 104322029 104375267 104365944 104334068 104299332 104276176 104309486 104327461
2570A04327461p4913j05903j15296q1444L8170N1567l3378n6168l6857n6054j39572
$$ 104327461 104252548 104146645 104031349 103949905 103988075 104039642 104006264 103950096 103913239 103857185 103717613
2581A03717613j03546O7902J27128J31577R8778j3329n4451n5649m2984K1363J1825
$$ 103717613 103614067 103681969 103809097 103940674 104039452 104026123 103971672 103916023 103873039 103894402 103906227
2592A03906227r7824p7393J07720Q8951j43143j82251q7501k8633O2370Q3046K8419
$$ 103906227 103808403 103731010 103838730 103927681 103784538 103602287 103514786 103486153 103548523 103631569 103659988
2603A03659988K0501L8818M3007L8460M4014O1866O4324N3428M8569O8237J8952j55808
$$ 103659988 103680489 103719307 103762314 103800774 103844788 103906654 103970978 104024406 104072975 104141212 104160164 104004356
2615A04004356j36657J05903J34156J983o8664j66703j58554j2443J0826n5786q3405
$$ 104004356 103867699 103973602 104107758 104109741 104041077 103874374 103715820 103703377 103714203 103658417 103575012
2626A03575012j28364r4292N3070Q0299J8692k3552j04026j00823j3946L4332Q6899
$$ 103575012 103446648 103352356 103405426 103485725 103504417 103480865 103376839 103276016 103262070 103296402 103383301
2637A03383301R4459O2256J8524r9281o9397J54114J65603L739q0490j90521j63743
$$ 103383301 103477760 103540016 103558540 103459259 103389862 103543976 103709579 103713318 103632828 103442307 103278564
2648A03278564M1962R5322M8401K3910k1652l7094l1044k0386J1635J4687o577k0744
$$ 103278564 103320526 103415848 103464249 103488159 103466507 103429413 103398369 103377983 103389618 103404305 103397728 103376984
2660A03376984l5622n1712q7212o9069J6976M0771J4923J8883L9192M9904O6521N2879
$$ 103376984 103341362 103289650 103202438 103133369 103150345 103191116 103206039 103224922 103264114 103314018 103380539 103433418
2672A03433418p820j2161K7611N6816J17347R6085l6957m8828M6967P1335O9099L9932
$$ 103433418 103425598 103413437 103441048 103497864 103615211 103711296 103674339 103625511 103672478 103743813 103812912 103852844
2684A03852844n2833o2302m005L7315J02447J12748P7102L8338m6081m9096M0985N0263
$$ 103852844 103800011 103737709 103733704 103771019 103873466 103986214 104063316 104101654 104055573 104006477 104047462 104097725
2696A04097725J6022l7293j82220j53237Q8387J21948j8906m8324j6838q270n433O600
$$ 104097725 104113747 104076454 103894234 103740997 103829384 103951332 103932426 103884102 103867264 103858994 103853561 103860161
2708A03860161K4368M6585J10840O7955j20094j52352o9023j0322R7274R9900Q08n9341
$$ 103860161 103884529 103931114 104041954 104109909 103989815 103837463 103768440 103758118 103855392 103955292 103956100 103896759
2720A03896759j45004j39382k1095P530l0090k5246J7617P461n3429q3160j23192q9622
$$ 103896759 103751755 103612373 103591278 103598808 103568718 103543472 103561089 103568550 103515121 103431961 103308769 103219147
2732A03219147N3764P8133j404j6525M432O440m075J809L0563K7115n127k4986n8510
$$ 103219147 103272911 103351044 103349640 103333115 103337547 103343987 103339912 103341721 103372284 103399399 103394272 103369286 103310776
2745A03310776m2801N9944L5332j40213j58219m3510n509o744J2329N4497M8782j4641
$$ 103310776 103267975 103327919 103363251 103223038 103064819 103021309 103015800 103009056 103021385 103075882 103124664 103110023
2757A03110023k5817J4732j190p3151r5054r6367o5445L1967M6921m525l8032j04714
$$ 103110023 103084206 103098938 103097748 103024597 102929543 102833176 102767731 102799698 102846619 102842094 102804062 102699348
2769A02699348q4518M1916P6889N5244L5019p248l5995p3959o5827J2726Q827p8468
$$ 102699348 102614830 102656746 102733635 102788879 102823898 102816650 102780655 102706696 102640869 102653595 102662422 102583954
2781A02583954r2911m4037m9995j12793j06316k7031j5144n4741o9405q7761p2021
$$ 102583954 102491043 102447006 102397011 102284218 102177902 102150871 102135727 102080986 102011581 101923820 101851799
2792A01851799p965R651L273k2346j00945j02302j0132k0127j30912j52497j06476
$$ 101851799 101843834 101853485 101856758 101834412 101733467 101631165 101621033 101600906 101469994 101317497 101211021
2803A01211021r6557j14731q9569K434m418j12579j46675j45294j29647n1933q2420
$$ 101211021 101114464 100999733 100910164 100912598 100908180 100795601 100648926 100503632 100373985 100322052 100239632
2814A00239632k71202k47788J2566M0054j28700j70632j49109j33941r0409q7738j06788
$$ 100239632 99968430 99720642 99733208 99773262 99644562 99473930 99324821 99190880 99100471 99012733 98905945
2825I8905945j55213k57515l08082l30620l36075l00857l08441l53890l73505l66134
$$ 98905945 98750732 98493217 98185135 97854515 97518440 97217583 96909142 96555252 96181747 95815613
2835I5815613m00116m87564n11963m69727m91813n82100n94185n53658n04921m32823
$$ 95815613 95415497 94927933 94415970 93946243 93454430 92872330 92278145 91724487 91219566 90786743
2845I0786743l53699k47497j78269j25976j06720j61621j10153M7615J31271K20322
$$ 90786743 90433044 90185547 90007278 89881302 89774582 89612961 89502808 89550423 89681694 89902016
2855H9902016J76841l1807j37184k06855k39251k35153j93146j03851o439J44028K06924
$$ 89902016 90078857 90047050 89909866 89703011 89463760 89228607 89035461 88931610 88925171 89069199 89276123
2866H9276123K21703J71043k5894k8465J94549J77261l6834j55853k36031l44467m93698
$$ 89276123 89497826 89668869 89642975 89614510 89809059 89986320 89949486 89793633 89557602 89213135 88719437
2877H8719437n66819n51460o14143p26792q35159r69238j063446j146080j169510j149445
$$ 88719437 88152618 87601158 86987015 86260223 85425064 84455826 83392380 82246300 81076790 79927345
2887G9927345j070808r21723p65113n50721m16732l52333k62551j70135p9224L1807
$$ 79927345 78856537 77934814 77169701 76618980 76202248 75849915 75587364 75417229 75338005 75369812
2897G5369812Q0246P7797O0371J740k9206k1339q8333k47841l15689l22556l29971
$$ 75369812 75450058 75527855 75588226 75589966 75560760 75539421 75451088 75203247 74887558 74565002 74235031
2908G4235031l01170l21724l91266m25720m39118m59366n20607m58457k44065j57165
$$ 74235031 73933861 73612137 73220871 72795151 72356033 71896667 71376060 70917603 70673538 70516373
2918G0516373j42624j41480j97479j94786j39717j23070j27937j31439j31058j60050
$$ 70516373 70373749 70232269 70034790 69840004 69700287 69577217 69449280 69317841 69186783 69026733
2928F9026733k52418k39082j21689o3088m173j8524j43601j56112n8319o4705j40763
$$ 69026733 68774315 68535233 68413544 68350456 68346283 68327759 68184158 68028046 67969727 67905022 67764259
2939F7764259k10312l09486l70171m14016m22760l64929l85094m98459m99916m29131
$$ 67764259 67553947 67244461 66874290 66460274 66037514 65672585 65287491 64789032 64289116 63859985
2949F3859985l32664j75331n1499N0782J77932L32547M57546N64125O64306P63962
$$ 63859985 63527321 63351990 63300491 63351273 63529205 63861752 64319298 64883423 65547729 66311691
2959F6311691Q27286Q57666Q77075Q73780Q72535Q77335Q47366P88826P17598N92301
$$ 66311691 67138977 67996643 68873718 69747498 70620033 71497368 72344734 73133560 73851158 74443459
2969G4443459N62309O47880O18386M93766M24744L73337L40393L21220L33359M13132
$$ 74443459 75005768 75653648 76272034 76765800 77190544 77563881 77904274 78225494 78558853 78971985
2979G8971985L97583K77618K52434K75971L33335M64150N24567N56350N35919M30848
$$ 78971985 79369568 79647186 79899620 80175591 80508926 80973076 81497643 82053993 82589912 83020760
2989H3020760L94172M16329L82522L16429K37793J25077M4418m2221m9118J1276J02806
$$ 83020760 83414932 83831261 84213783 84530212 84768005 84893082 84937500 84895279 84846161 84857437 84960243
3000H4960243K78763L61893L81325L97613L95844L74748L67645K42424p988k23328
$$ 84960243 85239006 85600899 85982224 86379837 86775681 87150429 87518074 87760498 87752510 87529182
3010H7529182m54902o57776q19038j035477j301880j542259j805428j972130k085922
$$ 87529182 87074280 86416504 85597466 84561989 83260109 81717850 79912422 77940292 75854370
3019G5854370k092026k033851j792740j360893q88474l02025K54723Q83179J321312
$$ 75854370 73762344 71728493 69935753 68574860 67686386 67384361 67639084 68522263 69843575
3028F9843575J618652J838852J955124K010772K005791J896790J636963J456634J306297
$$ 69843575 71462227 73301079 75256203 77266975 79272766 81169556 82806519 84263153 85569450
3037H5569450J153618J037926Q34106N05211L23944K54219J67466J40266n463k85385
$$ 85569450 86723068 87760994 88595100 89100311 89424255 89678474 89845940 89986206 89980743 89695358
3047H9695358m58671n80452o71219p00524p69683q80318r24896r41613q85246p74719
$$ 89695358 89236687 88656235 87985016 87284492 86514809 85634491 84709595 83767982 82882736 82108017
3057H2108017n79643k58011q515J89064M52469Q05283J035309J217392J264236J145004
$$ 82108017 81528374 81270363 81261848 81450912 81903381 82708664 83743973 84961365 86225601 87370605
3067H7370605J070382J021057Q63594N76095L79677K24404Q8974Q85j28846k91107
$$ 87370605 88440987 89462044 90325638 90901733 91281410 91505814 91594788 91595673 91466827 91175720
3077I1175720m33487n85724o81427q24096o66428j91208J85181N92155R28139J301270
$$ 91175720 90742233 90156509 89475082 88650986 87984558 87793350 87978531 88570686 89498825 90800095
3087I0800095J380279J128121J024223R80019Q70063P12464N60165L72818K58637K33078
$$ 90800095 92180374 93308495 94332718 95312737 96182800 96895264 97455429 97828247 98086884 98319962
3097I8319962J25785o4537j62529k31033j94237j0872P7797J15227J68800K22351K73156
$$ 98319962 98445747 98381210 98218681 97987648 97793411 97782539 97860336 97975563 98144363 98366714 98639870
3108I8639870L30139L60130L67043L68171L58414L40820L32642K61711J09047K2606
$$ 98639870 98970009 99330139 99697182 100065353 100423767 100764587 101097229 101358940 101467987 101490593
3118A01490593o0417l7049J42792J75713R4009P1594P0382O8687P1457Q0345J03066
$$ 101490593 101430176 101393127 101535919 101711632 101805641 101877235 101947617 102016304 102087761 102168106 102271172
3129A02271172J06788R5871Q5518P4318N2475K6634k0271j38779j09649J04904J34514
$$ 102271172 102377960 102473831 102559349 102633667 102686142 102712776 102692505 102553726 102444077 102548981 102683495
3140A02683495q32j0704R1530O8611q1726j13419p6385j7266J34896J42982N005l3974
$$ 102683495 102682663 102671959 102763489 102832100 102750374 102636955 102560570 102543304 102678200 102821182 102826187 102792213
3152A02792213k0072j4023N584J3901J6136J6213K5108n295j09001j01951L456P2479
$$ 102792213 102772141 102758118 102763702 102777603 102793739 102809952 102835060 102829765 102720764 102618813 102622269 102694748
3164A02694748J48987J92238K40539J81152k5077j08887j49109r9777J10527J49895
$$ 102694748 102843735 103035973 103276512 103457664 103432587 103323700 103174591 103074814 103185341 103335236
3174A03335236N0567J5259n096j7052l4546M478J52428J37634m3029j05530j12198
$$ 103335236 103385803 103401062 103395966 103378914 103344368 103348846 103501274 103638908 103595879 103490349 103378151
3185A03378151r7748n0575J7311J58623J74453P2716K0409l3692n1879m2267j0186
$$ 103378151 103280403 103229828 103247139 103405762 103580215 103652931 103673340 103639648 103587769 103545502 103535316
3196A03535316P5768R5062O4110L7529o676l5476p4341n4764N7884N6221q3328n9464
$$ 103535316 103611084 103706146 103770256 103807785 103801109 103765633 103691292 103636528 103694412 103750633 103667305 103607841
3208A03607841J32370J72379J25885N1186j29837j62987o7848k0172M3579M4799k8732
$$ 103607841 103740211 103912590 104038475 104089661 103959824 103796837 103728989 103708817 103752396 103797195 103768463
3219A03768463m9705n3360k6322O7711P0122l2593k7847P0640J05072J26435Q8455
$$ 103768463 103718758 103665398 103639076 103706787 103776909 103744316 103716469 103787109 103892181 104018616 104107071
3230A04107071l7933r0455j09672r5970l0586J1734O7634O5231j8096k0333M6517O8092
$$ 104107071 104069138 103978683 103869011 103773041 103742455 103754189 103821823 103887054 103868958 103848625 103895142 103963234
3242A03963234P2716O1485K2316K243p484j9028l0037l7911l4858n4764j29913r7374
$$ 103963234 104035950 104097435 104119751 104121994 104114510 104095482 104065445 104027534 103992676 103937912 103807999 103710625
3254A03710625O3919J06483N8434N4573R4032M5136j37764j40564M1122P5317P752
$$ 103710625 103774544 103881027 103939461 103994034 104088066 104133202 103995438 103854874 103895996 103971313 103979065
3265A03979065j2619j4229l2356p2762p7179n5977k5993K9617O0051P8370Q3160P6126
$$ 103979065 103966446 103952217 103919861 103847099 103769920 103713943 103687950 103717567 103777618 103855988 103939148 104015274
3277A04015274N1857l761k8946m7852k5818N5260Q7982J15822P2121r9709j06949O1196
$$ 104015274 104067131 104063370 104034424 103986572 103960754 104016014 104103996 104219818 104291939 104192230 104085281 104146477
3289A04146477O8718o1180q5404o7451L410K08618K11601J2040n2575n6793l9909N8510
$$ 104146477 104215195 104154015 104068611 104001160 104004570 104213188 104424789 104436829 104384254 104327461 104287552 104346062
3301A04346062L5644j20239j59477j39214q0871P1266J15539Q4969M8950m7707n3977
$$ 104346062 104381706 104261467 104101990 103962776 103881905 103953171 104068710 104153679 104202629 104154922 104100945
3312A04100945L6621M7035j0681p912M4914O0753O7017M0939n9608m3656J13396J21879
$$ 104100945 104137566 104184601 104173920 104166008 104210922 104271675 104338692 104379631 104320023 104276367 104389763 104511642
3324A04511642J7312n2788j61934j63651n6457O981P4890J06956J24787Q2061m2121
$$ 104511642 104528954 104476166 104314232 104150581 104094124 104101105 104175995 104282951 104407738 104489799 104447678
3335A04447678j17951k14981j84944o340Q6594J90879J52398q9905j38024m6394M745
$$ 104447678 104329727 104114746 103929802 103923462 104010056 104200935 104353333 104263428 104125404 104079010 104083755
3346A04083755R6291Q4595p1526o3804J31965J10489j43341j64101J7449N8746K0027
$$ 104083755 104180046 104264641 104193115 104129311 104261276 104371765 104228424 104064323 104081772 104140518 104160545
3357A04160545K793l2311k9564K1035K3384k0142k2987j290K2889P6560P3647J1375
$$ 104160545 104163338 104131027 104101463 104122498 104145882 104125740 104102753 104101463 104124352 104200912 104274559 104285934
3369A04285934j3046K960m8187k03445k07688q1276J816J17180J36162M9354K2980
$$ 104285934 104272888 104275848 104227661 104024216 103816528 103735252 103737068 103854248 103990410 104039764 104062744
3380A04062744L0281J1894k3193n1712j09558p6531R6680R2484r9091j20659j0345
$$ 104062744 104093025 104104919 104081726 104030014 103920456 103843925 103940605 104033089 103933998 103813339 103802994
3391A03802994K6771M0268L6904P370j7830o5590n8937K2217K0294o7879p2311J403
$$ 103802994 103829765 103870033 103906937 103914307 103896477 103830887 103771950 103794167 103814461 103746582 103674271 103675674
3403A03675674N341m5921o2775o4941o3233l9764n5199j26625j25282n8892k5657N485
$$ 103675674 103681015 103635094 103572319 103507378 103444145 103404381 103349182 103222557 103097275 103038383 103012726 103018211
3415A03018211Q370j6762m4754j03233j06858l6026n4618j63651j95366j77643j66794
$$ 103018211 103026581 103009819 102965065 102861832 102754974 102718948 102664330 102500679 102305313 102127670 101960876
3426A01960876j31561j40785k07497k10998j58196j42433j49483j43028j33758j15532
$$ 101960876 101829315 101688530 101481033 101270035 101111839 100969406 100819923 100676895 100543137 100427605
3436A00427605p1717p5058j43264j32965n3475j1063K4315L8720J4595L5903J10650
$$ 100427605 100355888 100280830 100137566 100004601 99951126 99940063 99964378 100003098 100017693 100053596 100164246
3447A00164246J22711P5775P0923R9304R5367O6376M8569J0918M1099J63269J92978
$$ 100164246 100286957 100362732 100433655 100532959 100628326 100694702 100743271 100754189 100795288 100958557 101151535
3458A01151535J39885J49651K11715K22420K23541J51497o2469p9850Q0445J55258
$$ 101151535 101291420 101441071 101652786 101875206 102098747 102250244 102187775 102107925 102188370 102343628
3468A02343628K25166K30713J63010J16829N5977L0090K6489M5937J42914R8510j32538
$$ 102343628 102568794 102799507 102962517 103079346 103135323 103165413 103191902 103237839 103380753 103479263 103346725
3479A03346725j50222L6712O2828l4477l9749L2166K5108n4291p6462q0658l9451P9941
$$ 103346725 103196503 103233215 103296043 103261566 103221817 103253983 103279091 103224800 103148338 103067680 103028229 103108170
3491A03108170J18751J05743Q4664N1018k1103k01653j85226N2620J08597P0594r750
$$ 103108170 103226921 103332664 103417328 103468346 103447243 103245590 103060364 103112984 103221581 103292175 103282425
3502A03282425k44659k37252J1444J08551J54801J39786L8909l9268j56754j74148
$$ 103282425 103037766 102800514 102811958 102920509 103075310 103215096 103254005 103214737 103057983 102883835
3512A02883835q7807n1666m6898N127J26129J50322J03325M8233o3896j00540q4732
$$ 102883835 102796028 102744362 102697464 102702591 102828720 102979042 103082367 103130600 103066704 102966164 102881432
3523A02881432n7030K5703L1182m8211m9972K6588J5946q3016j00517o0844l6736L357
$$ 102881432 102824402 102850105 102881287 102833076 102783104 102809692 102825638 102742622 102642105 102581261 102544525 102547882
3535A02547882N798n1261k6894R5535J08406M0055j5473j10176j30417q2397n5214
$$ 102547882 102553680 102502419 102475525 102571060 102679466 102719521 102704048 102593872 102463455 102381058 102325844
3546A02325844k1645j770P607J3801K266K3560Q9378J02097O4132O3256Q1749J02523
$$ 102325844 102304199 102302429 102310036 102323837 102326103 102349663 102439041 102541138 102605270 102668526 102750275 102852798
3558A02852798J57235J36230P012R155J69609J40861p3120j41029j19545j13487r7702
$$ 102852798 103010033 103146263 103153275 103162430 103332039 103472900 103399780 103258751 103139206 103025719 102928017
3569A02928017o8070k1889K5849J21216R4764j02684j05163Q8188J07857l8452j2253
$$ 102928017 102859947 102838058 102863907 102985123 103079887 102977203 102872040 102960228 103068085 103029633 103017380
3580A03017380J85417K20253J48628P9247n0804r8687p9673p5676o2851n4764o9046
$$ 103017380 103202797 103423050 103571678 103650925 103600121 103501434 103421761 103346085 103283234 103228470 103159424
3591A03159424k1881J24328J35308K1598k4864m3396o8687j07384r8534o6879K5513
$$ 103159424 103137543 103261871 103397179 103418777 103393913 103350517 103281830 103174446 103075912 103009033 103034546
3602A03034546K76489K56561n2520j48270j24954j08055l2929l2875j17752j14921
$$ 103034546 103311035 103567596 103515076 103366806 103241852 103133797 103100868 103067993 102950241 102835320
3612A02835320n4383J1063J56738J34064p7629j47080j33301j31820j60195n2787K62191
$$ 102835320 102780937 102792000 102948738 103082802 103005173 102858093 102724792 102592972 102432777 102379990 102642181
3623A02642181L31612K14104J28265j717r1125j87325j85585o0218j9028k1271k2262
$$ 102642181 102973793 103187897 103316162 103314445 103223320 103035995 102850410 102790192 102771164 102749893 102727631
3634A02727631n8892k8610R9678R8923k3316p0526r6153q2924k9754M1580K15316J76217
$$ 102727631 102668739 102640129 102739807 102838730 102815414 102744888 102648735 102565811 102536057 102577637 102792953 102969170
3646A02969170j06621j94596k08450j04072K33886K99858J56380N8800j10558j36520
$$ 102969170 102862549 102667953 102459503 102355431 102589317 102889175 103045555 103104355 102993797 102857277
3656A02857277p744J4969k7466l7956o4110j2878J23169K21206L82325L24851J191
$$ 102857277 102849533 102864502 102837036 102799080 102734970 102722092 102845261 103066467 103448792 103773643 103774834
3667A03774834j16776j77650n9105M02550M29939P1235q8829k03781k44301k02560
$$ 103774834 103658058 103480408 103421303 103823853 104253792 104325027 104236198 104032417 103788116 103585556
3677A03585556j39290j5587P3593J90812J80793j0109j2115J78818J76689K983m2343
$$ 103585556 103446266 103430679 103504272 103695084 103875877 103865768 103853653 104032471 104209160 104212143 104169800
3688A04169800K9564l6721k98378k71461N4619J53282J29532Q9645k7679q3573j17706
$$ 104169800 104199364 104162643 103864265 103592804 103647423 103800705 103930237 104019882 103992203 103908630 103790924
3699A03790924j10527n1384k670N3001J08147J84494K02438K02866J01806j74163k47574
$$ 103790924 103680397 103629013 103626343 103679344 103787491 103971985 104174423 104377289 104479095 104304932 104057358
3710A04057358j65535j17089l0654l724n0254j7075Q8547J42532K07276J56974n5999
$$ 104057358 103891823 103774734 103744080 103740356 103690102 103673027 103761574 103904106 104111382 104268356 104212357
3721A04212357j15609p7896l4927N1903J19903K34413J96740l5782r3796l2929m5J13800
$$ 104212357 104096748 104018852 103983925 104035828 104155731 104390144 104586884 104551102 104457306 104424377 104424332 104538132
3733A04538132J9645m02473l83713N2384K30903L69171K72797j96747k90916j29677
$$ 104538132 104557777 104155304 103771591 103823975 104054878 104424049 104696846 104500099 104209183 104079506
3743A04079506J7982L56507L36975p1358j96648j72592j36566k212K2194n0377o3774
$$ 104079506 104097488 104453995 104790970 104719612 104522964 104350372 104213806 104211594 104233788 104183411 104119637
3754A04119637m5853m1390l7384m1336p5653m3396P7873J01449M2884K6513J8600K9373
$$ 104119637 104073784 104032394 103995010 103953674 103878021 103834625 103912498 104013947 104056831 104083344 104101944 104131317
3766A04131317R7702N7701j12655j59600j34658q5709K2293R6848K05795J70090n0332
$$ 104131317 104229019 104286720 104174065 104014465 103879807 103794098 103816391 103913239 104119034 104289124 104238792
3777A04238792j16417r0957o1943L9673K5535j16058j50162j20872q6808j9455K5582
$$ 104238792 104122375 104031418 103969475 104009148 104034683 103918625 103768463 103647591 103560783 103541328 103566910
3788A03566910N3116R9182K06566J67801n9174r8946K0531L5568P248m5296k11410
$$ 103566910 103620026 103719208 103925774 104093575 104034401 103935455 103955986 103991554 103998802 103953506 103742096
3799A03742096j53015J96098K32842J4419q5014j93932j72928K2919P4265K5200J8669
$$ 103742096 103589081 103785179 104018021 104032440 103947426 103753494 103580566 103603485 103677750 103702950 103721619
3810A03721619K7061J7693n0072J8761K87079L07991J24649J1085j36879j76857q9195
$$ 103721619 103748680 103766373 103716301 103735062 104022141 104330132 104454781 104465866 104328987 104152130 104062935
3821A04062935r5146k07833j53923P7965J68892K19582J46156j57692j83151M0146
$$ 104062935 103967789 103759956 103606033 103683998 103852890 104072472 104218628 104060936 103877785 103917931
3831A03917931J21757J56265J55709J24099L3135j87134k28638j06742o8429n1399
$$ 103917931 104039688 104195953 104351662 104475761 104508896 104321762 104093124 103986382 103917953 103866554
3841A03866554n8037j26884j01349m3724J38542O06201O23467K38396n722l12355m11202
$$ 103866554 103808517 103681633 103580284 103536560 103675102 104281303 104904770 105143166 105137444 104825089 104413887
3852A04413887l15880k42302j17759j7426J06743J37352R1934J7448j58164j93764
$$ 104413887 104098007 103855705 103737946 103720520 103827263 103964615 104056549 104073997 103915833 103722069
3862A03722069j17157n8556L4928Q1893J26320P3525j37329j68183l9238p896k7679
$$ 103722069 103604912 103546356 103581284 103663177 103789497 103863022 103725693 103557510 103518272 103510376 103482697
3873A03482697k7009l8436l434J22551J02425r5993j07193L3119J01975J92588J54931
$$ 103482697 103455688 103417252 103413818 103536369 103638794 103542801 103435608 103468727 103570702 103763290 103918221
3884A03918221o6094j00204M8065K6275j46484j94336k00271j08269J58310K36847
$$ 103918221 103852127 103751923 103799988 103826263 103679779 103485443 103285172 103176903 103335213 103572060
3894A03572060J89758J29677l1212n4382O4109O9931K0928o0196k64504k50534J6816
$$ 103572060 103761818 103891495 103860283 103805901 103870010 103939941 103960869 103900673 103636169 103385635 103402451
3905A03402451N5694r8350j05599r842K4170L5645L2425n387o035K6947L5881L1640
$$ 103402451 103458145 103359795 103254196 103244354 103268524 103304169 103336594 103331207 103325172 103352119 103388000 103419640
3917A03419640K8297L5286O64j07331j09748j7403L3829R9113R3559L952l2234m2602
$$ 103419640 103447937 103483223 103483887 103376556 103266808 103249405 103283234 103382347 103475906 103479858 103447624 103405022
3929A03405022n4291o0577o1326p3738k9350J18919J14060o0249q1772K9060L1426
$$ 103405022 103350731 103290154 103228828 103155090 103125740 103244659 103358719 103298470 103216698 103245758 103277184
3940A03277184m4518p8720j20545r2842K9374O8946M7593N5290R3818O5781o1851n9746
$$ 103277184 103232666 103153946 103033401 102940559 102969933 103038879 103086472 103141762 103235580 103301361 103239510 103179764
3952A03179764Q7478Q8829l5903p4883o3141p2548j09573p6798N3193P3173j2566j4213
$$ 103179764 103267242 103356071 103320168 103245285 103182144 103109596 103000023 102923225 102976418 103049591 103037025 103022812
3964A03022812L0594Q2298K26471J60217j75117k42302j12343l8651P0054J01753Q0154
$$ 103022812 103053406 103135704 103362175 103522392 103347275 103104973 102992630 102953979 103024033 103125786 103205940
3975A03205940K2316j41235j49704q301M2870O9450M8592o0608p1953L13K6649L5073
$$ 103205940 103228256 103087021 102937317 102929016 102971886 103041336 103089928 103029320 102957367 102957680 102984329 103019402
3987A03019402M3060N3383L7170M769n6389k02607j96411l4523L2257N3551Q1345J27769
$$ 103019402 103062462 103115845 103153015 103157784 103101395 102898788 102702377 102667854 102700111 102753662 102835007 102962776
3999A02962776R2316
$$ 102962776 103055092
4000A03055092
$$ 103055092
##END=$$ End of the data block
