##TITLE=$$ Begin of the data block
##JCAMP-DX=5.00 $$ ACD/SpecManager v 10.08
##SPECTROMETER/DATA SYSTEM=16PC
##DATE=17 Jul 2013 16:31:06
##DATA TYPE=INFRARED SPECTRUM
##DATA CLASS=XYDATA
##ORIGIN=
##OWNER=
##NPOINTS=3601
##FIRSTX=400.00000000
##LASTX=4000.00000000
##MAXX=4000.00000000
##MINX=400.00000000
##MAXY=490.47616577
##MINY=0.00457668
##XFACTOR=1.0000000000
##YFACTOR=0.000001000000000
##FIRSTY=40.95938110
##DELTAX=1.00000000
##XUNITS=1/CM
##YUNITS=TRANSMITTANCE
##XYDATA=(X++(Y..Y))
400D0959381M734253O3253716K06271858J75256958o1952088j18179260l8340332k9948425
408B42056061n7100174n5896073n2807472n848770J39881737J22791595q2611557j12765701
416A37699646p326019K8766144O2406265L0953949j09128983j21049587k2316838K0312024
424B0316601N5763698N5088524O991913j4398369k8181221l2089088k4932526j3736870
432B4822662Q839417K0455551L2469986K1789337l4381576k1768692Q3423584P1738876
440B07389145p0626648p9001686M2556908M5605010o0957740o4285992K4282429L7253334
448H2214760n451920j6024612j9254135l791809N4134056M8087814k9496674m1919326
456F8498154m278748P119148R212761J0554238P627205N944747M649003J658104m565026
$$ plain form
400 40959381 45693634 108947350 315219208 490476166 428524078 310344818 272004486 242056061
408 242056061 184955887 129059814 76252342 70403572 210285309 333076904 250465347 137699646
416 137699646 130373627 159139771 221546036 252499985 143371002 22321415 4577 20316601
424 20316601 76080299 131168823 138160736 123762367 95581146 63492058 38559532 24822662
432 24822662 33662079 54117630 86587616 108376953 73995377 52226685 135650269 207389145
440 207389145 136762497 57760811 100317719 145922729 84964989 20678997 44961426 82214760
448 82214760 76762840 60738228 41484093 37692284 91826340 139914154 110417480 68498154
456 68498154 64219406 71338554 80551315 91105553 98732758 104677505 109326508 110984612 106419586
465A06419586n790138l110886l82995N143310O324410L829811K125099J47293k317406
474A12388084p034774o728226r56223J238488K472931J321762m643441m283638K673455
483I6448418L999260J446296K32865j405716j629311o67572N57686L571892L195122
492A05748940p69234k355194l327439k593376P38335K009796K440140J810478o98563
501A03003883j590614j831886j053955J712776K221275Q13652L68286L11402N9555
510A04014374j80649o52176j968620j432915J379272K073525J421333P31041p55790
519A04629395j314019j298095j015564j40145L30498O73866P77336O12664M05334R6947
529A03758217l04680j245087r49890R82094J171661k85026l93486N73158P12631J80390
$$ plain form
465 106419586 100629448 97518562 97135567 102278877 108603287 112433098 114558197 114705490 112388084
474 112388084 105353310 98625084 97668861 98907349 101380280 102702042 98058601 93774963 96448418
483 96448418 100447678 101893974 102126839 100721123 99091812 98424240 98981926 102553818 105748940
492 105748940 104979706 102624512 99297073 96703697 97442032 99451828 101891968 103702446 103003883
501 103003883 101413269 99581383 98527428 100240204 102461479 103275131 103643417 103954819 104014374
510 104014374 103833725 103181549 101212929 99780014 101159286 103232811 104654144 105385185 104629395
519 104629395 103315376 102017281 101001717 100861572 101192070 101865936 102643272 103255936 103661270 103758217
529 103758217 103453537 102208450 101258560 102240654 103412315 103127289 102733803 103306961 104019592 104199982
539A04199982K56683J141708P54387j122856j538803q34679n96885m29199l30185k90726
549A01209427l48740m73877p49633j469330j376366n45380O5537P28439J312973K172539
559A00525589K023605P09320J40259j76956j79405L88504M41124J34247o9733l78441
569A03558113m24057j98936j01441K4742m7561m75121m03831K80449K66960n15801
579A01963516m71229M13818M90097j09840k67388q3374k73231r28040r68078m83391
589I9282860j93810J01212L19023O06636M58427k00653n64979j001122q48556k7443
599I7931595M81964J127533J097992K68715n0545j25832k02964j94771k04415k56134
609I9873138j50108J79909K69005K06924R9259j55884k56798l24608j76811K70271
$$ plain form
539 104199982 104456665 105598373 106352760 105229904 103691101 102856422 102259537 101830338 101500153 101209427
549 101209427 100860687 100386810 99637177 98167847 96791481 96246101 96311638 97040077 98353050 100525589
559 100525589 102549194 103258514 103398773 103221817 103042412 103430916 103872040 104006287 103936554 103558113
569 103558113 103134056 102935120 102833679 102858421 102810860 102335739 101931908 102212357 102479317 101963516
579 101963516 101492287 101906105 102396202 102286362 102018974 101935600 101662369 100734329 99766251 99282860
589 99282860 99089050 99190262 99509285 100115921 100574348 100373695 99808716 98807594 97959038 97931595
599 97931595 98413559 99541092 100639084 100907799 100857254 100731422 100528458 100333687 100129272 99873138
609 99873138 99723030 99902939 100171944 100378868 100478127 100322243 100065445 99740837 99564026 99834297
619I9834297M99130P70188N58998m13208n06897K27928L51479J13838m5555l85430
629A01004768l10661K59209M07074K52365K34154K62878K57378L22219J19950o39412
639A02169922m58527R32358R56581l44131n60265K6657J33110k0218l2570L6789K4109
650A02863815q8936o5422O9642J78962L68996L50906J56494n2925n30861m24820L92464
661A03218315N59303K56089J22711K0981j36345m47541m32319o5422P1548J34156Q1680
672A03383156j90758k23228l9742m509p2670n9509L883N6961J10962J81313L74199
683A03520058K49221l34480l73100J19659J94741m6204o0867O2774J33995K27402K35222
694A03928421J37589J21742K12806J22887j83250k77138k64191j51588K77588J62773
$$ plain form
619 99834297 100333427 101103615 101662613 101249405 100742508 100970436 101321915 101435753 101390198 101004768
629 101004768 100694107 100953316 101360390 101612755 101846909 102109787 102367165 102689384 102809334 102169922
639 102169922 101711395 102643753 103600334 103256203 102695938 102722595 102855705 102835487 102802917 102839706 102863815
650 102863815 102774879 102709457 102779099 102958061 103327057 103677963 103834457 103781532 103250671 102825851 103218315
661 103218315 103777618 104033707 104156418 104177399 104041054 103593513 103161194 103095772 103167320 103301476 103383156
672 103383156 103192398 102969170 102929428 102924919 102852249 102792740 102796623 102853584 102964546 103145859 103520058
683 103520058 103769279 103434799 103061699 103181358 103376099 103329895 103269028 103331802 103465797 103693199 103928421
694 103928421 104066010 104187752 104400558 104523445 104340195 104063057 103798866 103647278 103924866 104087639
704A04087639o33026p01592j70570O2088K81807K44575j33896k72560l39889k43118
714A02181458J81983J85463k83119k72102J49414L06084M65965K31857o57249p60315
724A01729439j67824M0962J75026P7339m32396m76196r4223l784n1430j33995l66562
735A00296356l92273k25403j65725j43242j38329k02583j49513P7347O5490j95549
745I8826576k51678k16744q9645K82623K86675q3260j90712j89422j01136J21590L10493
756I8705360O16837O03561K61803O3950j45203k17339j64749q6639J10168J51947K1218
767I9920914O1516K62619L21579L32878K21397j43242j64680J93740J88759j06720
777A01088760k41134m05434k87529K28233L66906K93800J22574l71529m03381j3657
$$ plain form
704 104087639 103454613 102753021 102582451 102644539 102926346 103170921 103037025 102764465 102424576 102181458
714 102181458 102363441 102548904 102265785 101993683 102143097 102449181 102915146 103147003 102489754 101729439
724 101729439 101561615 101602577 101777603 101854942 101422546 100946350 100852127 100848343 100796913 100662918 100296356
735 100296356 99904083 99678680 99512955 99369713 99231384 99028801 98879288 98956635 99022125 98826576
745 98826576 98574898 98358154 98268509 98551132 98837807 98754547 98563835 98374413 98273277 98394867 98705360
756 98705360 99322197 99925758 100187561 100251511 100106308 99888969 99724220 99637581 99747749 99899696 99920914
767 99920914 99982430 100245049 100566628 100899506 101120903 100977661 100812981 101006721 101195480 101088760
777 101088760 100847626 100442192 100154663 100382896 100749802 101043602 101166176 100794647 100391266 100377609
787A00377609J75186M30230L05366l46092m91593k71133j57494L1418L9673q8501k74223
798I9730446o74515p40547n36896l54248j20804J66962P27753O82953p3960k38540
808I8568604J5831P8056P7988J07360J86539J42174k1225j48583l89480l00926K41111
819I8557449K97165p4676j67511n9296j45485m88731m43268k075J60766K26830J43913
830I8005081k53128k51770Q4732K96707O54770N35828p8613m91761j004837j110145
840I6386864q37662n75470k06162J88378P65793R77142R20960P51831K94494R5345
850I8761513P2784O607l7887j01998k20413k13196j09672K7275L33954L27942m4655
861I8802254q6136J95022J34659k90489l23555l578O8573l4668k365J71402J51802
$$ plain form
787 100377609 100552795 100983025 101288391 100942299 100450706 100179573 100022079 100053497 100093170 100004669 99730446
798 99730446 99055931 98315384 97778488 97424240 97303436 97470398 98198151 98881104 98807144 98568604
808 98568604 98584435 98662491 98740479 98847839 99034378 99176552 99155327 99006744 98617264 98316338 98557449
819 98557449 98854614 98779938 98612427 98553131 98407646 97918915 97475647 97473572 97634338 97861168 98005081
830 98005081 97751953 97500183 97584915 97881622 98536392 99072220 98993607 98501846 97497009 96386864
840 96386864 95549202 94973732 94767570 94955948 95721741 96698883 97619843 98371674 98666168 98761513
850 98761513 98834297 98840904 98803017 98701019 98480606 98267410 98157738 98185013 98518967 98846909 98802254
861 98802254 98716118 98911140 99045799 98755310 98431755 98428177 98496750 98462082 98459717 98631119 98782921
872I8782921k2988j70867l95562m64653l41613m04976o28449p38907q08090q22449
882I3984367p56836p25532q12195n67985p821M79004J126908J387527J361321J194595
892I6663353P24266M56100K77848J32400O8634n2162k50526l05916k24930k01797k14219
903I7073051j57333l0708N8937J87904J57547r5947j18897J19378M2175k88605n43953
914I6403549q94737r86694q83316o85189k61337l5355R6985J41938P484N5099K63596
925I3222023L56056M09149L92884L08090J81267p0763j41907q0703O71K28828K09336
936I5014931p1816j64459j66611j36444k3796K8542O7375M8141m5967j03431j15944
947I4330521k28402m51873n97191p64061p42935n19730l60558k45880J2009N40741
$$ plain form
872 98782921 98759933 98589066 98193504 97728851 97387238 96982262 96353813 95614906 94806816 93984367
882 93984367 93227531 92501999 91689804 91121819 91113998 91593002 92719910 94107437 95468758 96663353
892 96663353 97387619 97843719 98121567 98253967 98322601 98270439 98019913 97713997 97489067 97287270 97073051
903 97073051 96915718 96885010 96943947 97131851 97289398 97193451 97074554 97193932 97236107 96947502 96403549
914 96403549 95508812 94522118 93638802 92953613 92692276 92656921 92753906 92895844 92903328 92958427 93222023
925 93222023 93578079 93987228 94380112 94688202 94869469 94798706 94656799 94576096 94576767 94805595 95014931
936 95014931 94943115 94778656 94612045 94475601 94451805 94480347 94547722 94595863 94549896 94446465 94330521
947 94330521 94102119 93650246 93053055 92288994 91546059 91026329 90665771 90419891 90431900 90972641
957I0972641O41815L80303J94290o9046k36748l26302m40765n95047o26800m85108
967H9409233n36110p77962q52035p21909q92204j345543j647163j959633k067757k104660
977G6504257j753143q44887l70544k18392J55091O97609J074508J396675J555062J616096
987G9812332J422981Q65364N41329L34122J12625q4328k81166n53391n74615l38982
997H1256271j96388n2238O4804J13723K87056N52636Q46313J319000J431038J198693
1007H6820908J096443R96300R35531R39896Q68820P71072N92133L05679P1503k30316
1017I3167969k80213o271j5991k62314l26080k46293k86315l99491n09384p45583o66114
1028H9423920k57401j5922J93405L26584L55079M36898N92376N81932L78891L29209
$$ plain form
957 90972641 91614456 91994759 92189049 92120003 91883255 91556953 91116188 90521141 89894341 89409233
967 89409233 88873123 88095161 87243126 86521217 85629013 84283470 82636307 80676674 78608917 76504257
977 76504257 74751114 73906227 73535683 73317291 73472382 74169991 75244499 76641174 78196236 79812332
987 79812332 81235313 82100677 82642006 82976128 83088753 83004425 82723259 82169868 81595253 81256271
997 81256271 81059883 81007645 81072449 81186172 81473228 82025864 82872177 84191177 85622215 86820908
1007 86820908 87917351 88913651 89849182 90789078 91657898 92428970 93021103 93326782 93398285 93167969
1017 93167969 92887756 92881485 92865494 92603180 92277100 92030807 91744492 91345001 90835617 90090034 89423920
1028 89423920 89166519 89150597 89344002 89670586 90025665 90462563 91054939 91636871 92015762 92344971
1038I2344971L89511L87306L49831L40706L69644L34045K45072J60453O8215m1580
1048I4948174k08306k64694k19368k05376j75384j85799k73582k34841j06865N5390
1058I3129349L72192M17114J82419J25145J81816J49033N7793j2780p2097j61721k67929
1069I4100334m04243o35216o89148n54710n49118o22300o57699p77031o10024k07779
1079H8393066K63596J058701J324935J188660R96903N59921K89566P7270n4863r7679
1089I4000076j10176n4024k3796K5132Q796n2330j56379k88102n10482r17244j070595
1100I0850876j016304j009155r45664r85191j149826j192139j094650j175003j445030
1109H0837914j540017j541824j487999j351952j202606j007248q28125o20788n00847
$$ plain form
1038 92344971 92734482 93121788 93471619 93812325 94181969 94516014 94761086 94921539 94989754 94948174
1048 94948174 94739868 94475174 94255806 94050430 93875046 93689247 93415665 93180824 93073959 93129349
1058 93129349 93501541 93918655 94101074 94226219 94408035 94557068 94614861 94602081 94529984 94368263 94100334
1069 94100334 93696091 93060875 92371727 91817017 91267899 90645599 89987900 89210869 88600845 88393066
1079 88393066 88656662 89715363 91040298 92228958 93225861 93785782 94075348 94152618 94097755 94000076
1089 94000076 93889900 93835876 93812080 93837212 93846008 93793678 93637299 93349197 92838715 91921471 90850876
1100 90850876 89834572 88825417 87879753 86894562 85744736 84552597 83457947 82282944 80837914
1109 80837914 79297897 77756073 76268074 74916122 73713516 72706268 71878143 71257355 70756508
1118G0756508m37691m38354n92499n34653k51289j62102k36969j76880J1322N5863
1128F7993256n9433J831K31315L25821L24349L73932M80941M72924L41659K92465L40798
1139G1119858K19436n7434k79541m77867p38930j098106j327705j539566j514145j221756
1149F3084244j000763p26841n59071n07232l73078j75499l7220J11889J13918r8228
1159E9832119r8469O4305J59427K58164L06175K76543L31306M83463N18658M96578
1169F2628269L92483J22883M6421J57425J19972q606j22093k92351l38219k44499k53441
1180F2208244l38958l63255l79635l12755p5459r1934l66665m57623m31560m63558
1190E8926842n07782n72705p04551p09938n79357n44262n97813n36034l30497k99218
$$ plain form
1118 70756508 70318817 69880463 69287964 68753311 68502022 68339920 68102951 67926071 67937393 67993256
1128 67993256 67933823 67935654 68166969 68492790 68817139 69191071 69672012 70144936 70486595 70779060 71119858
1139 71119858 71339294 71281860 71002319 70524452 69785522 68687416 67359711 65820145 64306000 63084244
1149 63084244 62083481 61356640 60797569 60290337 59917259 59741760 59704540 59816429 59930347 59832119
1159 59832119 59733650 59797955 59957382 60215546 60521721 60798264 61129570 61613033 62131691 62628269
1169 62628269 63020752 63143635 63190056 63347481 63467453 63458847 63336754 63044403 62706184 62461685 62208244
1180 62208244 61869286 61506031 61126396 60813641 60738182 60646248 60279583 59821960 59390400 58926842
1190 58926842 58419060 57846355 57141804 56431866 55852509 55308247 54710434 54174400 53843903 53544685
1200E3544685m55425m28177k59876j52084j6526m814j51111j67488j11439m1100Q7330
1211E1843975J56521J82751K18151K48863K78160L05275L29945L40725L83522M73831
1221E4761719N03708N02704M60221L37909K99477K93804L61443N88176N90134M16115
1231E9115410K54536j5450r9087k0313K1625J645K19249O99471J042679J410076J556400
1242F4186241J536057J376602R45808P45056P14569N91897M00016L09418L11211K70202
1252G1387077J85273J95961K92129L74413M77127N62019O78062O67550M96101M58626
1262G5774338N11520N34058O33529N01107J08169j21925k68700m37446o45615p18285
1272G5870750o87881n99861l77564k82264k93015k32696j31295m6066J5900J39999
$$ plain form
1200 53544685 53089260 52661083 52401207 52249123 52232597 52227783 52076672 51909184 51797745 51756645 51843975
1211 51843975 52000496 52183247 52401398 52650261 52928421 53233696 53563641 53904366 54287888 54761719
1221 54761719 55265427 55768131 56228352 56566261 56865738 57159542 57520985 58109161 58699295 59115410
1231 59115410 59369946 59354496 59255409 59235096 59256721 59258366 59477615 60177086 61219765 62629841 64186241
1242 64186241 65722298 67098900 68044708 68789764 69504333 70096230 70496246 70805664 71116875 71387077
1252 71387077 71572350 71768311 72060440 72434853 72911980 73473999 74152061 74819611 75315712 75774338
1262 75774338 76285858 76819916 77453445 77954552 78062721 77940796 77672096 77234650 76589035 75870750
1272 75870750 75182869 74583008 74205444 73923180 73630165 73397469 73266174 73220108 73236008 73376007
1282G3376007L22296M92882P34711P85782O75796N47722K76710K19010L10798M50974
1292G8192688O98517R18411J199059J321548J356369J240372Q89465P02980O30524
1301H7149933M74281K60475Q1940j15227k08450j80435k22969l22602l41461l23562
1311H6251923k30957O561P0167j4282l1402L1234r1484m16893o10786p28745q82553
1322H3352783j059013j199410j353576j381302j274368j206208j083374j106407j298141
1331G2390984j366761j418800j320007j047684q27026o09803l63922k1934J14013J3520
1341F5542580J00204L58109M27436L76984K91229J00090r30o9069p0931l6430J20422
1352F7139694L05321Q09433J799034K317856K569008K696136K668831K464821K095528
$$ plain form
1282 73376007 73698303 74191185 74925896 75711678 76387474 76935196 77211906 77430916 77741714 78192688
1292 78192688 78891205 79809616 81008675 82330223 83686592 84926964 85816429 86519409 87149933
1301 87149933 87624214 87884689 87966629 87851402 87642952 87462517 87239548 86916946 86575485 86251923
1311 86251923 86020966 86027527 86097694 86083412 86052010 86083244 85991760 85574867 84964081 84235336 83352783
1322 83352783 82293770 81094360 79740784 78359482 77085114 75878906 74795532 73689125 72390984
1331 72390984 71024223 69605423 68285416 67237732 66410706 65800903 65436981 65415047 65529060 65542580
1341 65542580 65642784 66000893 66428329 66805313 67096542 67196632 67195702 67126633 67055702 67019272 67139694
1352 67139694 67445015 68254448 70053482 72371338 74940346 77636482 80305313 82770134 84865662
1361H4865662J537300O69647k121p18758j022720r60022q04420m45824n1209M91646
1371H3559181R00551J394630J379540Q09143M62219J65894j67153n32272q60977j221298
1381H5889458j409981j533157j369713q13057n11048l19412j67770j57974M6753L88740
1391H0042839P61864J438003J435471P63817L66256J2398l19526o51719q73588j087784
1401H1888031r94682n26406k54272J0940Q3451q4023j16844r7420p1098k1362L0761
1412G9847076J36612J11695j26549o3446L21411M31465M19480K70843k41089j95412
1422H0912086M21578O34140N62622P01286J063629J101235Q97552O67092K70294N0590
1432H7282104j08955q4206L57338J61553o20361j139115j647407j983948k123238k328949
$$ plain form
1361 84865662 86402962 87072609 87070488 86351730 85329010 84368988 83564568 83118744 83067535 83559181
1371 83559181 84459732 85854362 87233902 88043045 88505264 88671158 88504005 87971733 87110756 85889458
1381 85889458 84479477 82946320 81576607 80763550 80252502 79933090 79765320 79607346 79654099 80042839
1391 80042839 80804703 82242706 83678177 84441994 84808250 84820648 84501122 83849403 82975815 81888031
1401 81888031 80893349 80366943 80112671 80123611 80207062 80123039 80006195 79908775 79837677 79816315 79847076
1412 79847076 79983688 80095383 79968834 79905388 80226799 80658264 81077744 81348587 81107498 80912086
1422 80912086 81333664 81967804 82530426 83231712 84295341 85396576 86294128 86961220 87231514 87282104
1432 87282104 87173149 87088943 87446281 87607834 86987473 85848358 84200951 82217003 80093765 77764816
1442G7764816k631019k646256k497787k076531j235512o71791m39544L74763K019577
1451F7960716K587364K065636K411934L808571L568748J792504P66151j49055o84525
1460H4128044r70604p54547K62619O32217N36538O94969R67834J194336J390213J653221
1470H9734840K193688K072357J204803Q67745Q34923P34611O84098N85792M44244L38578
1480I9695679K33604J90949K17292K24122K61421K17537N9005L1281J35895J20903
1490A01387688K243l2112l5141J6899J74476K11716J65176J14296n600j5571J03973
1501A02088043R5703m5631m1939J02188J26908P7316L2738o4469o3225O5850N3856
1512A02427338j10123j13655K716Q8432K40944K20703n722o5109M646j8478j35613
$$ plain form
1442 77764816 75133797 72487541 69989754 67913223 66677711 66005920 65566376 65941139 67960716
1451 67960716 70548080 72613716 75025650 78834221 82402969 84195473 84961624 84812569 84128044
1460 84128044 83157440 82402893 82665512 83297729 83834267 84529236 85497070 86691406 88081619 89734840
1470 89734840 91928528 94000885 95205688 96073433 96908356 97642967 98327065 98912857 99357101 99695679
1480 99695679 99929283 100120232 100337524 100561646 100823067 101040604 101099609 101130890 101266785 101387688
1490 101387688 101389931 101357819 101322678 101339577 101514053 101725769 101890945 102005241 101999641 101984070 102088043
1501 102088043 102183746 102138115 102096176 102198364 102325272 102402588 102435326 102370857 102307632 102373482 102427338
1512 102427338 102317215 102203560 102206276 102294708 102535652 102756355 102750633 102685524 102690170 102671692 102536079
1523A02536079j20353M2633O5300j6953n7960j32271q8142J02874J74927K08687J47011
1534A02861832j03661j12038J04332J84082K52274J69945j49445k21031r1820n8792
1544A02835678n8006m8470n4313k0340P8254Q6876k3796J8173K46453K54081P5676
1555A03390266k0340j43310j24313J04042J03187j06376j68259j74164j13769O6520
1565A02813484J41785J66870J47148O4972j4427j44669j76574j39046o5659J23093
1575A02916977J42387M311n4977j06095j03042k8664K342J3992K4460N3978L388j88378
1587A02680679j77978L3569J06911J20376R9633J2115l7674p0907j07407j73660j43936
1598A02341721o9N9441R2643O5544o3232r4360o8360k2766R5818J11129L0472O41p797
$$ plain form
1523 102536079 102415726 102458359 102523659 102506706 102448746 102316475 102228333 102331207 102506134 102714821 102861832
1534 102861832 102758171 102646133 102750465 102934547 103186821 103356766 103207321 102986290 102894470 102835678
1544 102835678 102777672 102729202 102674889 102654549 102732803 102819679 102795883 102814056 103060509 103314590 103390266
1555 103390266 103369926 103226616 103102303 103206345 103309532 103203156 103034897 102860733 102746964 102813484
1565 102813484 102955269 103122139 103269287 103334259 103319832 103175163 102998589 102859543 102793884 102916977
1575 102916977 103059364 103063675 103008698 102902603 102799561 102770897 102773239 102787231 102811691 102865669 102869057 102680679
1587 102680679 102502701 102536270 102643181 102763557 102863190 102875305 102837631 102766724 102659317 102485657 102341721
1598 102341721 102341652 102401093 102493736 102559280 102496048 102401688 102333328 102310562 102406380 102517509 102547981 102548622 102540825
1611A02540825k4033m9354m9469L746l6743k17698k05017J168O7062N4009N0109K7375
1623A02161980R514p294l1807p4791q4427q4877l1326J53679J15493j80580k41256
1634A01704308j10764j05476k03019j76452l9650L5766J03379J20376N4482P7293K16057
1645A01676300J89972K0622r7656k90680k49794O7665J82152K52365J23093l32901
1655A01541138m51683l41156k33933k2438R5436K07001J60576r2674k05712k76420
1665A00380135k60567j19568n2261R391q178j28601j84128k08191k35054k28333k99385
1676I8665260n22972m88663j12983j40457o43608n87868R2888R9373m93172o86623
1686I5181175p12799o42586l32450k85935m99130m84490l15376j86066R1149m0291
$$ plain form
1611 102540825 102516792 102467438 102417969 102421715 102384972 102167274 101962257 101963425 102030487 102084496 102134605 102161980
1623 102161980 102171494 102164200 102132393 102057602 101973175 101888298 101856972 102010651 102126144 101945564 101704308
1634 101704308 101593544 101488068 101285049 101108597 101068947 101104713 101208092 101328468 101382950 101460243 101676300
1645 101676300 101866272 101886894 101789238 101498558 101248764 101316429 101498581 101750946 101874039 101541138
1655 101541138 101089455 100748299 100514366 100491928 100587364 100794365 100954941 100862267 100656555 100380135
1665 100380135 100119568 100000000 99947739 99957130 99948952 99820351 99636223 99428032 99192978 98964645 98665260
1676 98665260 98142288 97653625 97540642 97400185 96756577 96168709 96261597 96360970 95867798 95181175
1686 95181175 94468376 93825790 93493340 93207405 92708275 92223785 91908409 91722343 91813492 91773201
1696I1773201q04497p48611K93800K04109r83139j287529j016929r20510p00927p98729
1706H5010239j243805j476189j604347j754517j888634k033164k338456k176643j412773
1715F9081711j214722j277565j653168k750110k882481k168442j821281j497433j357937
1724E2458572j532222j341771o80042o51954j370480j278946q45055K45240L307438
1733D8310780K765464k146602k789093p222R40156J310539J332737N03372O06846J511574
1743E2338551J959255K114364K577164L406021L767014L876045L703377L196312K595092
1752G9533195J506211J263450J958107J891091J226112J007370J055618J043534J158760
1761I1643448R77852L89389K62428N38803N82169N41755M56856K14531K27242N56396
$$ plain form
1696 91773201 90968704 90220093 90513893 90718002 89734863 88447334 87430405 86509895 85808968 85010239
1706 85010239 83766434 82290245 80685898 78931381 77042747 75009583 72671127 70494484 69081711
1715 69081711 67866989 66589424 64936256 62186146 59303665 57135223 55313942 53816509 52458572
1724 52458572 50926350 49584579 48904537 48252583 46882103 45603157 44758102 45003342 48310780
1733 48310780 51076244 48929642 46140549 46133327 47073483 48384022 49716759 50220131 50826977 52338551
1743 52338551 54297806 56412170 58989334 62395355 66162369 70038414 73741791 76938103 79533195
1752 79533195 81039406 82302856 84260963 86152054 87378166 88385536 89441154 90484688 91643448
1761 91643448 92621300 93010689 93273117 93811920 94394089 94935844 95392700 95607231 95834473 96390869
1771I6390869N43877K06497J35063K87750K40891j0895k2476J99196K36557J24359
1781I8331688J41144K79403K90558J98204J56235J08048J25984K58445K39396N8120
1791A00187225K3201J07910J10337N3909M6562N5077J04187K44163K49031J22162P5775
1802A01379539O5064N6931O7665O5086N4314M7065L7331L7148M2366N7464J11458Q3641
1814A02105072m7905p5005m8591K6543K39318K38465J7219m6447l5904M074J40762
1825A02517601J49704L5500L913K3339J4305p462k5581n5695n1620k2072K1645J08863
1837A02712440J33347J29555O5689j46225j22810J63200K19009J29250M8012j24573
1847A03206894j43410K625K3796o8619l0350J61652J70799L6240o2134k42157k12555
$$ plain form
1771 96390869 96934746 97141243 97276306 97564056 97804947 97794052 97771576 97970772 98207329 98331688
1781 98331688 98472832 98752235 99042793 99240997 99397232 99505280 99631264 99889709 100129105 100187225
1791 100187225 100210426 100318336 100428673 100482582 100529144 100584221 100688408 100932571 101181602 101303764 101379539
1802 101379539 101444603 101501534 101569199 101634285 101688599 101735664 101772995 101810143 101852509 101909973 102021431 102105072
1814 102105072 102057167 101982162 101933571 101960114 102199432 102437897 102455116 102408669 102372765 102376839 102517601
1825 102517601 102667305 102702805 102706718 102730057 102744362 102736900 102711319 102655624 102604004 102581932 102603577 102712440
1837 102712440 102845787 102975342 103041031 102894806 102771996 102935196 103154205 103283455 103331467 103206894
1847 103206894 103063484 103066109 103089905 103021286 102990936 103152588 103323387 103359627 103297493 103055336 102842781
1858A02842781O3614J47224J18874R5100K8687q270l5027m6898n1758k2888P2884P5958
1870A03280281k4696k5399P3342O9786l3692m5181J8456L2737L3898J388r8350j10840
1882A03171730n6694q041Q6120R3933J7502j9714o8474m9309O8314Q2680J144m028
1894A03315163N5076N4474J0780j8646o7161n8983J7494L9864K4253K8229M9919L8987
1906A03489449p225k8138m7729l0640M6829N4291n844j2901J5548K8847N6435L1212
1918A03590134p2747q4877k0523J0865O0752L2616j05926j29036n4047l7743n4786
1929A03134682m9881m8760l837J25457J29227K289k5108J4755K0431K0935J412n2597
1941A03269005o8711o5071m1648L4118L1540o0936o6734L052J5998k6016J602J32462
$$ plain form
1858 102842781 102906395 103053619 103172493 103267593 103296280 103288010 103252983 103206085 103154327 103131439 103204323 103280281
1870 103280281 103255585 103230186 103303528 103373314 103339622 103294441 103312897 103345634 103379532 103380920 103282570 103171730
1882 103171730 103115036 103106995 103193115 103287048 103304550 103284836 103216362 103167053 103235367 103318047 103319191 103315163
1894 103315163 103370239 103424713 103435493 103416847 103349686 103290703 103308197 103348061 103372314 103400543 103450462 103489449
1906 103489449 103482224 103454086 103406357 103375717 103422546 103476837 103470993 103458092 103473640 103502487 103558922 103590134
1918 103590134 103517387 103432510 103411987 103422852 103483604 103516220 103410294 103281258 103227211 103189468 103134682
1929 103134682 103084801 103036041 103032204 103157661 103286888 103289177 103264069 103278824 103299255 103320190 103321602 103269005
1941 103269005 103200294 103135223 103093575 103127693 103159233 103098297 103031563 103034615 103050613 103024597 103026199 103158661
1953A03158661J07124r4459j32851n4665j2901M1412O5331N6503O7063R0889R9990
1964A03392097J12916Q3305k983m3244n7510o8474p4310n9868j2184J617j1017j2939
1976A03247406n653k0722p9887o4759K9038O5689O7253Q1162J22924Q2993o6086j05331
1988A03354027o3111m4921j4138j1779l1113n8197j46935r5825J30730J88637J44264
1999A03351639P6011j01089j25816Q796J3398r1576r8869m6494J0109J31081J31279
2010A03258469R346m4251q1993q4732m9049q103O8093R2575Q1298N7442P004l7262
2022A03268837r8137j17493j22017o3323J08978J44676P0663K9305l5194m2176J4305
2033A03158424K9442J7220K6245O8169M7584m8492p2884m5540l4019k3461n958K9037
$$ plain form
1953 103158661 103265785 103171326 103038475 102983810 102970909 103012321 103077652 103134155 103201218 103292107 103392097
1964 103392097 103505013 103588318 103585335 103542091 103484581 103416107 103341797 103281929 103269745 103271362 103260345 103247406
1976 103247406 103241753 103221031 103141144 103076385 103105423 103171112 103238365 103319527 103442451 103525444 103459358 103354027
1988 103354027 103290916 103245995 103231857 103220078 103188965 103130768 102983833 102888008 103018738 103207375 103351639
1999 103351639 103427650 103326561 103200745 103209541 103222939 103131363 103032494 102986000 102996109 103127190 103258469
2010 103258469 103267815 103223564 103141571 103056839 103007790 102999687 103067780 103160355 103241653 103299095 103306099 103268837
2022 103268837 103170700 103053207 102931190 102867867 102976845 103121521 103192184 103221489 103186295 103144119 103158424
2033 103158424 103187866 103205086 103231331 103299500 103347084 103298592 103225708 103180168 103146149 103122688 103116730 103145767
2045A03145767L1349p339l868K3964O4186J60118J50108L9505l1563j26152j32347
2056A03313728l8620l318l975K7893J12007J00784j2733n3383n7434n5290l7339j1703
2068A03280617M7920M4228l6889m2007L1807J9119p5676j04851j01829q0948k6672
2079A02954819J2916O6521O7429n967o63R0240Q5976k90m0672p3884p3051k2079j2207
2092A03049088m6036k1965P1579Q6616L1014K1293N5504K4605q7379j07506o4965j6166
2104A02995682P2075J23497J95816J34231j36902j60553M7806R3003M7737J6136o1554
2115A03366974n0552O4666Q7113N8937Q629j16059j34918n6053k7565k6940L716Q7143
2127A03265091P4249n2429p4219k4963J1749R1461P5386n8319q3778l4096k975M8088
$$ plain form
2045 103145767 103177116 103169777 103165909 103189873 103254059 103414177 103564285 103603790 103572227 103446075 103313728
2056 103313728 103275108 103271790 103267815 103295708 103407715 103508499 103495766 103442383 103384949 103329659 103292320 103280617
2068 103280617 103328537 103372765 103335876 103293869 103325676 103344795 103269119 103164268 103062439 102981491 102954819
2079 102954819 102967735 103034256 103101685 103095718 103095055 103185295 103271271 103270981 103230309 103156425 103083374 103061295 103049088
2092 103049088 103003052 102981087 103052666 103139282 103170296 103191589 103247093 103271698 103184319 103076813 103011848 102995682
2104 102995682 103067757 103191254 103387070 103521301 103384399 103223846 103271652 103364655 103412392 103428528 103366974
2115 103366974 103316422 103381088 103468201 103527138 103535767 103419708 103284790 103228737 103201172 103174232 103177948 103265091
2127 103265091 103339340 103286911 103212692 103187729 103199478 103290939 103366325 103308006 103224228 103190132 103187157 103235245
2139A03235245N8624L1067J5930N364j9936q6899o8619N5672P5836J3809q155j3207
2151A03294731l1067o8168o9397l7293j6907L579K1957L5049N7602J23528Q2397r0889
2163A03305122j45698j32103j00563p179K2819n485J2443O4995R3933J36948J01211
2174A03346443m5753q1490l3859j4229N196K4437N8174M7516k0409l5522r179o202
2186A03235123q438k3911q5739n3642R0431J33682J24527Q1871m5296p1838j0635M722
2198A03370857L983J526n699j9959p1571l7217J21094J28075k075n1064o8527p4432
2210A03294991o7971l2524O9100P1571l4187m6540K5864J5854p2907q8188n2910k7748
2222A03054405J4397K5635O553K289j808P698L4477N0141O2675O8382P8102N2002k8373
$$ plain form
2139 103235245 103293869 103324936 103340866 103346230 103326294 103239395 103170776 103226448 103302284 103316093 103307938 103294731
2151 103294731 103263664 103195496 103126099 103088806 103071899 103075478 103097435 103132484 103190086 103313614 103396011 103305122
2163 103305122 103159424 103027321 102926758 102919579 102942398 102936913 102949356 103014351 103108284 103245232 103346443
2174 103346443 103300690 103219200 103185341 103171112 103176308 103200745 103258919 103306435 103286026 103250504 103241325 103235123
2186 103235123 103226685 103202774 103117035 103063393 103153824 103287506 103412033 103493904 103448608 103376770 103366135 103370857
2198 103370857 103374840 103376366 103370667 103350708 103279137 103241920 103363014 103491089 103489014 103437950 103369423 103294991
2210 103294991 103227020 103194496 103263596 103335167 103300980 103254440 103280304 103296158 103223251 103135063 103082153 103054405
2222 103054405 103068802 103094437 103100990 103103279 103101471 103109169 103143646 103193787 103256462 103324844 103402946 103454948 103426575
2235A03426575m9683k6207j4351N913J0513O203j0139m7326o7016r0431p1122o698
2247A03066231M6684J42715J22689l9864q0444m8325j1085J05949P1358j53778j82388
2258A03039742n8434O531Q9546R4009N150k1744j4259j7593k8183j5473L7529L2090
2270A03148911l8765m8378k1073J3756R4200R7061K6299j0803m7966n7915l5217k8992
2282A03091118l2189k4246k693J648j6762n104N8579L3500j01448j21238n1117j5419
2294A02814629L6262K6459o1127q3946o4354n5618l3974m1275q5327r3033o3057p3936
2306A02221703j34995j30363o8093l2188J1658R895o2180n2261P6172K4536k37419
2317A01626465k90367j98151j24931m105O1852J36299O8069k56920k31475J67747K39853
$$ plain form
2235 103426575 103376892 103350685 103336334 103342247 103352760 103358963 103348824 103301498 103234482 103144051 103072929 103066231
2247 103066231 103112915 103255630 103378319 103338455 103258011 103209686 103198601 103304550 103375908 103222130 103039742
2258 103039742 102981308 102987839 103077385 103171394 103176544 103154800 103140541 103122948 103094765 103079292 103116821 103148911
2270 103148911 103110146 103061768 103040695 103054451 103148651 103245712 103272011 103261208 103213242 103155327 103120110 103091118
2282 103091118 103058929 103034683 103031990 103033638 103016876 103011772 103070351 103103851 103002403 102881165 102830048 102814629
2294 102814629 102850891 102877350 102816223 102732277 102667923 102612305 102578331 102537056 102451729 102358696 102295639 102221703
2306 102221703 102086708 101956345 101888252 101856064 101867722 101877617 101815437 101763176 101839348 101863884 101626465
2317 101626465 101336098 101137947 101013016 101008911 101070763 101207062 101275131 101018211 100786736 100954483 101194336
2328A01194336Q8020L13j49940j44341N0636Q2238m4068K289K69539K34123j17470
2339A01465675k07519j33438q3351j6503R2125L40698L11379N936j64963l51311l64136
2350A00894592j50825j10955j87469k09145k57896j77551J00425J45508j8745n6122
2360I9971817l4615j8646L5858J6831j16966q8524Q0513J99745L52028L96271L46405
2371A01140717K87696J74446J04218R872O1989L42102L53295J08307N3001J22215J30371
2382A02888229J34133R2293l2975m9377N2383M2481o3965r7847j01280p5005J6045
2393A02805115L2066k2125k6177J427J4160K1607L1730O3256L3424j00021q5495Q9813
2405A02858780J23024M9759L0205L7956J8432k9327m7226m7546l9551O340j9287j53496
$$ plain form
2328 101194336 101282356 101282669 101132729 100988388 101039024 101121262 101077194 101079483 101349022 101583145 101465675
2339 101465675 101258156 101124718 101041367 101024864 101116989 101457687 101769066 101775002 101610039 101258728 100894592
2350 100894592 100743767 100632812 100445343 100236198 99978302 99800751 99901176 100046684 100027939 99971817
2360 99971817 99937202 99918556 99954414 99971245 99854279 99765755 99846268 100046013 100398041 100794312 101140717
2371 101140717 101428413 101602859 101707077 101716949 101778938 102121040 102474335 102582642 102635643 102757858 102888229
2382 102888229 103022362 103114655 103081680 103032303 103084686 103127167 103063202 102965355 102864075 102789070 102805115
2393 102805115 102837181 102815056 102788879 102790306 102804466 102826073 102857803 102921059 102954483 102854462 102768967 102858780
2405 102858780 102981804 103031563 103061768 103099724 103118156 103088829 103041603 102994057 102954506 102960846 102941559 102788063
2417A02788063j38779K4865P9826P5912P1236M4540K2622o890k1263k6489k1553j0132
2429A02881958K1309J12846R0409p4456r4062Q659L7743K8419L5690M9546N5023N8319
2441A03211403M9446K5986P393k4559j6571L9627N7647N6076M6975K5054q77n3932
2453A03423668n0568L7689J3375j49224j50154k647M6226N2552L8978l2325l2929L5950
2465A03230591N0644L3333J8638j0841k0409j0711j4039k3147l5027n5816o4156p6843
2477A03022217m8302M7417O0585M478k4574p0457n4123L9108P1449Q0155N4008l7414
2489A03144547o1463k8824k9731n4596n1735l2479l380N8007O8069K2530K1881N8319
2501A03111145O2561N3810K4468m9424o4521k9900j2726J2108J1040k8893k2293L5523
$$ plain form
2417 102788063 102649284 102674149 102753975 102829887 102901123 102945663 102968285 102961395 102940132 102913643 102892090 102881958
2429 102881958 102903267 103016113 103106522 103032066 102938004 102946663 102984406 103012825 103048515 103098061 103153084 103211403
2441 103211403 103260849 103286835 103294228 103269669 103253098 103292725 103350372 103406448 103453423 103478477 103477600 103423668
2453 103423668 103373100 103410789 103424164 103274940 103124786 103122139 103168365 103220917 103259895 103227570 103194641 103230591
2465 103230591 103281235 103314568 103333206 103322365 103301956 103291245 103277206 103254059 103219032 103163216 103099060 103022217
2477 103022217 102973915 103021332 103081917 103086395 103061821 102991364 102937241 102976349 103047798 103127953 103181961 103144547
2489 103144547 103083084 103054260 103024529 102969933 102918198 102885719 102882339 102940346 103008415 103030945 103052826 103111145
2501 103111145 103173706 103227516 103251984 103202560 103138039 103108139 103095413 103107521 103118561 103089668 103067375 103102898
2513A03102898M0290N04j3809j0704k8130p2555q0155o1058l8933j3610L7834J62002
2525A03024574J49323l220p4142j47469j08764J02806J29104O226n2315j26648j09932
2536A02789543O439Q0872J91833J66794k2888r0073j02951p5912L3379O9763O4895
2547A03111694M7303o127l1616n0377m1389K1316J2848q8829p1007Q3016R3628j9425
2559A03061035n5725o6063m7851K5062M5464L4500J4664m4945m3320L4546K7252n7533
2571A02927086q9096j17851p3243J01738J08261m4609r4337r3079r4818r8587n4458
2582A02377007O8573R6557O8855J931j68038k02347j27983p5958K7825J7639j52939
2593A01931122j32614Q2802J25343M3053J1611k2651k1118J9569M7234Q2870R4536
$$ plain form
2513 103102898 103143188 103143692 103129883 103119179 103091049 103018494 102938339 102877281 102838348 102824738 102862572 103024574
2525 103024574 103173897 103170677 103096535 102949066 102840302 102943108 103072212 103078438 103026123 102899475 102789543
2536 102789543 102795982 102876854 103068687 103235481 103212593 103122520 103019569 102943657 102977036 103046799 103111694
2547 103111694 103158997 103152870 103121254 103070877 103029488 103050804 103063652 102974823 102903816 102986832 103080460 103061035
2559 103061035 103005310 102939247 102891396 102916458 102961922 102996422 103011086 102966141 102922821 102957367 102984619 102927086
2571 102927086 102837990 102720139 102646896 102748634 102856895 102812286 102717949 102624870 102530052 102431465 102377007
2582 102377007 102445580 102542137 102610992 102612923 102444885 102242538 102114555 102038597 102066422 102084061 101931122
2593 101931122 101798508 101881310 102006653 102049706 102061317 102038666 102017548 102037117 102084351 102167221 102261757
2604A02261757R3651O6375j0635l0373k815M891J2230Q033o767k5063p3791n2307O7901
2617A02313087P2075l0014o2874o7543n5572q751J1581J2612K6756O4415N1170k5917
2629A02301025m1107O462j2611j06430j13152n7670k266J03279J20308P3196L052j52946
2641A02121140j84708r1339q6663j43859j56716j52633j28388o8024l8909p439m0962
2652A01021500j63025k12387k30049k13456j42547j00403p3410l2967M4388L6003o9641
2663I9864006j04095j06926q8433l2852P057M1771Q2039J32797J63338J78696J89186
2674A00326584K00416J79505J01425R8915J68564J91048K05490J74667Q9981K2720
2684A01759315p6583q1368J3489O0799J19285J00945q225o4255j29341r8968P3074
$$ plain form
2604 102261757 102355408 102421783 102411148 102380775 102377960 102382851 102395081 102403114 102396347 102371284 102297493 102245186 102313087
2617 102313087 102385162 102355148 102292274 102224731 102169159 102160408 102171989 102184601 102211357 102275772 102326942 102301025
2629 102301025 102259918 102266380 102253769 102147339 102034187 101976517 101974251 102077530 102197838 102271034 102274086 102121140
2641 102121140 101936432 101845093 101758430 101614571 101457855 101305222 101176834 101108810 101069901 101062462 101021500
2652 101021500 100858475 100646088 100416039 100202583 100060036 99959633 99886223 99853256 99897644 99933647 99864006
2663 99864006 99759911 99652985 99564552 99531700 99538757 99580528 99662567 99795364 99958702 100137398 100326584
2674 100326584 100527000 100706505 100807930 100906845 101075409 101266457 101471947 101646614 101736595 101759315
2684 101759315 101682732 101601364 101614853 101675652 101794937 101895882 101887657 101823402 101694061 101595093 101668167
2695A01668167R7366M654l8742r9899p6820O0508Q9768L8101J8883L883p652j8883
2707A01739334j6762j4923K7870J55930J50459M700l5545j8860L006N3879R0026J47629
2719A02286743J25549J862l4645K480k1554j17538j07574J3618M7012L5950N943r7778
2731A02140068q1848O8329J00975N3566K7870j2299k4322j1559l433J4687J3420P225
2743A02292679l2616j35155j55807j07025q3573o2629m0695k4636R255R5436P2288
2754A01827522p5241j25435j36734r7244M7081O7856k4483m3396k8610p721O6757L2211
2766A01502563j31729j81152j75453j21185M9690P1213n4337p0213L929j0201j17920
2777A00765205j19903o577j5663j21956j88804k75277k82005j85417j79314k45071
$$ plain form
2695 101668167 101765533 101770187 101731445 101631546 101554726 101615234 101705002 101743103 101761986 101765869 101758217 101739334
2707 101739334 101722572 101707649 101735519 101891449 102041908 102046608 102011063 101992203 101995209 102049088 102139114 102286743
2719 102286743 102412292 102414154 102379509 102381989 102360435 102242897 102135323 102148941 102195953 102231903 102237846 102140068
2731 102140068 102058220 102126549 102227524 102281090 102308960 102296661 102272339 102260780 102257347 102272034 102285454 102292679
2743 102292679 102260063 102124908 101969101 101862076 101778503 101715874 101675179 101650543 101659798 101755234 101827522
2754 101827522 101752281 101626846 101490112 101392868 101439949 101507805 101483322 101439926 101411316 101403595 101470352 101502563
2766 101502563 101370834 101189682 101014229 100893044 100942734 101013947 100959610 100889397 100893326 100883125 100765205
2777 100765205 100645302 100638725 100623062 100501106 100312302 100037025 99755020 99569603 99390289 99145218
2787I9145218k63733k85606k28692o6108J2298M4014O8665P5409O7711K6779K4055
2798I8620010P1068N0141l3715q3206j31294j43768j09673j07315j22208j34254j41762
2809I7734024j71829k56920k40089r4460q4541k13913k04064o0249m0077r9060j57814
2820I6111008k66144l04268k64976k97074l75603m51683n17921o52809q80936j025818
2830I1073776j123291j206611j221085j352547j596069j785637j975395k114746k241684
2839G6456711k254959k155045k041336j894119j693085j437950j150154p69184n15629
2848F2545250l97659j62266J61362M36950P04979R39678J155304J320343J460717J504066
2858F9668724J428146J394036J382492J309013J162743J071380J043183R17221P01950
$$ plain form
2787 99145218 98881485 98595879 98367187 98301079 98313377 98357391 98426056 98501465 98569176 98595955 98620010
2798 98620010 98691078 98741219 98707504 98624298 98493004 98349236 98239563 98132248 98010040 97875786 97734024
2809 97734024 97562195 97305275 97065186 96970726 96886185 96672272 96468208 96407959 96367882 96268822 96111008
2820 96111008 95844864 95540596 95275620 94978546 94602943 94151260 93633339 92980530 92099594 91073776
2830 91073776 89950485 88743874 87522789 86170242 84574173 82788536 80813141 78698395 76456711
2839 76456711 74201752 72046707 70005371 68111252 66418167 64980217 63830063 63060879 62545250
2848 62545250 62147591 61985325 62146687 62583637 63288616 64228294 65383598 66703941 68164658 69668724
2858 69668724 71096870 72490906 73873398 75182411 76345154 77416534 78459717 79376938 80078888
2867H0078888N24284K96112K42615M29657L68309J20422p2601k96875m49661n62668
2877H0678482o11778n42427n97237p61413q51632r30526r30878q30505p85645p70851
2887G3065590p31636o55266o47263p20092p18285o67717o20651n46600n15412n29571
2897F6713097n09316m59259m40697m60006m30413l30215l33378m46392m69589m13155
2907F2420677m36065n19230n80120o58204o78157o43540o15738n89466n24761l95248
2917E6780148l46520l97919l26587j48247k2842J17851J60576R6298P4051J7784Q2710
2928E6087303L09586L79776L19244L42510M11892M63581N16106N59116N92255O27281
2938F0608650O52695P02713P80632Q38802Q79551R40895J036812J073334J046539J066040
$$ plain form
2867 80078888 80603172 80899284 81141899 81571556 81939865 82060287 81987686 81690811 81241150 80678482
2877 80678482 80066704 79524277 78927040 78165627 77313995 76383469 75452591 74622086 73836441 73065590
2887 73065590 72333954 71678688 71031425 70311333 69593048 68925331 68304680 67758080 67242668 66713097
2897 66713097 66203781 65744522 65303825 64843819 64413406 64083191 63749813 63303421 62833832 62420677
2907 62420677 61984612 61465382 60885262 60227058 59548901 58905361 58289623 57700157 57175396 56780148
2917 56780148 56433628 56035709 55709122 55560875 55538033 55655884 55816460 55912758 55986809 56004593 56087303
2928 56087303 56396889 56776665 57095909 57438419 57850311 58313892 58829998 59389114 59981369 60608650
2938 60608650 61261345 61964058 62744690 63583492 64463043 65403938 66440750 67514084 68560623 69626663
2948F9626663J110672J155495J255279J215622J002694R46136R87824J030509J180291
2957G9511185J109863P86041O68793O85570O66481O42990O58989P49443P30514O05294
2967H6815163N44960M99839M97155N50552N77927O19384N96573M90975M54735M65919
2977I2113182M59938M68109M29581L17146L00217L64235L97896M42909M43481M00994
2987I6137688L65356L24799K76298J87851J90209L04390L15498K42073K24586K54036
2997I8822784K25785J32484J08078J27503J56784K39135K35489J41785J13228J32034
3007A00435089J14037O2652M8119N6099P3311J02996J45386K38564K29980J24024N5458
3018A01685715k8656n1453k1789J8737J12076J31897Q7761O7543M4586L7453N7442
$$ plain form
2948 69626663 70737335 71892830 73148109 74363731 75366425 76312561 77300385 78330894 79511185
2957 79511185 80621048 81407089 82075882 82761452 83427933 84070923 84729912 85479355 86209869 86815163
2967 86815163 87360123 87859962 88357117 88907669 89485596 90104980 90701553 91192528 91647263 92113182
2977 92113182 92573120 93041229 93470810 93787956 94088173 94452408 94850304 95293213 95736694 96137688
2987 96137688 96503044 96827843 97104141 97291992 97482201 97786591 98102089 98344162 98568748 98822784
2997 98822784 99048569 99181053 99289131 99416634 99573418 99812553 100048042 100189827 100303055 100435089
3007 100435089 100549126 100611778 100659897 100715996 100789307 100892303 101037689 101276253 101506233 101630257 101685715
3018 101685715 101657059 101605606 101583817 101602554 101714630 101846527 101934288 102001831 102046417 102083870 102141312
3029A02141312M0550k1835l1472J3970O912o9519m0413J03615J49895J49299J10695
3040A02553009j5381m0123J5854M5822J05072P8873o1943q6067j3619M273M242r392
3052A02580620o8115n0454O2203P3891n463j9882M623J5808K5391L8650P3052N3306
3064A02783630k8679o5544r3963p4906J2017M6135M4365N9700R4108Q6517L6385O989
3076A02906754n4482j91K57256K20054j53373j98883N0514O2469j29104j27915N3719
3087A02886818O8497n6626q2466o2584k2194Q3420J00517J8647L3020J50062J48773
3098A03265884N9555j8409j53992j71112q2352j3756J09124J14486j0063m3411k2316
3109A03033638k1004k8633j4450K3506M6372P5195O4331J7403l4714j31989j45698
$$ plain form
3029 102141312 102181862 102160027 102128555 102142525 102149437 102079918 102039505 102143120 102293015 102442314 102553009
3040 102553009 102537628 102497505 102513359 102559181 102664253 102743126 102681183 102595116 102581497 102585770 102590012 102580620
3052 102580620 102512505 102462051 102524254 102598145 102592682 102572800 102577423 102593231 102618622 102657272 102730324 102783630
3064 102783630 102754951 102689407 102595444 102520538 102532555 102578690 102623055 102682755 102776863 102863380 102899765 102906754
3076 102906754 102852272 102852081 103109337 103329391 103176018 102977135 103027649 103090118 102961014 102833099 102886818
3087 102886818 102955315 102898689 102816223 102753639 102731445 102814865 102915382 102934029 102967049 103117111 103265884
3098 103265884 103325439 103307030 103153038 102981926 102899574 102885818 102994942 103109428 103099365 103055954 103033638
3109 103033638 103012634 102984001 102969551 102993057 103039429 103114624 103178955 103196358 103161644 103029655 102883957
3120A02883957r0309l6980N7411R1553R3483N2185q3633r8061j4564M4723J32278J60119
3132A03192162J55090R7847m2267j23314k11975j83464J2108N0163m7920m3388M0054
3143A02895096N8288L5645J8860k2606j3565O7619N8914n0384n5641L1112N3261L6644
3155A03113243L4409L5637L0548L2776k884r9182j20064r5467m1962P0191J38382K32002
3167A03327629J75835q1345j59576j33225q4831N8861Q7097J2924n150O005m792n7937
3179A03141495k0813J40884J57311N7670n028j00784j02875M075L1784J1253O607k769
3191A03318810J457L0327K1217l2471m1679l7697J5335J88828J60934r8801j46988
3202A03379272l2661l220O9j0490o7879n2689M3778O7306N2544J4877r3673r6871J1871
$$ plain form
3120 102883957 102793648 102756668 102814079 102905632 102999115 103051300 102967667 102869606 102855042 102899765 103032043 103192162
3132 103192162 103347252 103445099 103402832 103279518 103067543 102884079 102896187 102946350 102898430 102855042 102895096
3143 102895096 102953384 102989029 103007889 102985283 102971718 103039337 103098251 103047867 102992226 103023338 103076599 103113243
3155 103113243 103147652 103183289 103213837 103246613 103243729 103144547 103024483 102929016 102887054 102957245 103095627 103327629
3167 103327629 103503464 103422119 103262543 103129318 103044487 103103348 103190445 103203369 103198219 103204224 103199432 103141495
3179 103141495 103120682 103261566 103418877 103476547 103471519 103370735 103267860 103271935 103303719 103314972 103321579 103318810
3191 103318810 103320267 103350594 103371811 103339340 103297661 103259964 103275299 103464127 103625061 103526260 103379272
3202 103379272 103346611 103343391 103343460 103332970 103265091 103212402 103256180 103323486 103376030 103390907 103297234 103200363 103212234
3215A03212234K9969j6449k9297l0930l0059l1548p317O5949O6589j1680k2225J7380
3227A03212616L0708M6593K6077l8124p7957j46248r9945J01921J52207J07719M8088
3238A03363655j13411j09794P9154J05523K815j5427J1849K6703P0381L5713j05972
3249A03351189j32805o1295m7348q3641m3602R7992J13297J1108j6235J953r728n0476
3261A03130409m8179N859M410o6941m3487Q1535J16448J04591O4133m0245q5472j11626
3273A03111435q1467L4279Q0971R8205Q1894j930j3611L3020N3383Q9264N8052p0427
3285A03473068r2964n1277J7998K00698J89881j7288j02761j57356j35895Q248M3396
3296A03375748J907j4336o8138j0391K28424K20802k1385j18446k03346j24169K30240
$$ plain form
3215 103212234 103242203 103225754 103196457 103165527 103135468 103103920 103096603 103162552 103229141 103217461 103195236 103212616
3227 103212616 103243324 103289917 103315994 103277870 103199913 103053665 102953720 103055641 103207848 103315567 103363655
3238 103363655 103250244 103140450 103219604 103325127 103327942 103312515 103324364 103351067 103421448 103457161 103351189
3249 103351189 103218384 103157089 103109741 103026100 102982498 103080490 103193787 103204895 103188660 103190613 103180885 103130409
3261 103130409 103082230 103088089 103092499 103025558 102982071 103063606 103180054 103284645 103348778 103308533 103223061 103111435
3273 103111435 103029968 103064247 103145218 103243423 103325317 103323387 103309776 103342796 103396179 103485443 103543495 103473068
3285 103473068 103380104 103328827 103346825 103547523 103737404 103720116 103617355 103459999 103324104 103332352 103375748
3296 103375748 103377655 103363319 103295181 103284790 103513214 103734016 103712631 103594185 103390839 103266670 103496910
3307A03496910K63115J9028q3565j61461j66153n8746m3389j23024q1733Q5975J41976
3318A03288933J36543J06476J1352k4246j5381k6657l9261o3873j26129j12862k6611
3329A03108284K9396J03500J05309K4864p866j1085m2298j26739j06125M7165O4445
3340A03188850k8732o6185j00899q7143k0500L5378J21376J37642R4223N0735k3651
3351A03301094o5590j02493q8287o989L1448O0868N5793p133r201M6471N3283K5032
3363A03294296J3138L647R61K0737m479r8968r8206O440J5831n8297o3797k5634L669
3376A03009338N7656N4405k5871k2126O2706P9255O0791K3323p6920q1230J3550L5927
3388A03190804Q865J2070L2615M2076N4436M1908O867l2349j16966j00525N2551N3261
$$ plain form
3307 103496910 103760025 103779053 103695488 103534027 103367874 103309128 103265739 103142715 103060982 103146957 103288933
3318 103288933 103425476 103531952 103543304 103519058 103503677 103477020 103437759 103373886 103247757 103134895 103108284
3329 103108284 103137680 103241180 103346489 103371353 103363487 103352402 103310104 103183365 103077240 103124405 103188850
3340 103188850 103160118 103093933 102993034 102905891 102885391 102920769 103042145 103179787 103274010 103324745 103301094
3351 103301094 103235504 103133011 103044724 103037735 103069183 103130051 103185844 103178711 103169510 103215981 103269264 103294296
3363 103294296 103307434 103311081 103312042 103332779 103328300 103229332 103131126 103137566 103153397 103095100 103031303 103005669 103009338
3376 103009338 103066994 103121399 103095528 103073402 103136108 103215363 103276154 103299477 103222557 103141327 103154877 103190804
3388 103190804 103199669 103211739 103244354 103286430 103340866 103382774 103389641 103357292 103240326 103139801 103192352 103245613
3400A03245613r6985j15135k9633r750k6634k6535l5195l547J12366Q7593r8298j38977
3412A02864883r0980l4592R9922J13701p86j4762N2383M9400o744l2951m0513o7420
3424A02891541j29914j25480l8552l3905j02470j15944r3010q7425r8038p6012L319
3435A01994110p538j25457j35514o8977j5801R0500P3815r2057j26381p6942l3447
3446A01476311M3007Q6334J25908J10008J5785j3946K525m723m0031j6113P9773J09123
3458A01973961R6275Q2375J2588O5041L29849K68105j69518k46879n7938L6667J45408
3469A02535934J94840K13150J60835k0889n7335L4279M7806L8383q728j43951j51062
3480A02843262m0772J3474O4895P3769M2389J099j00472r1576M0673P3860L0640M2511
$$ plain form
3400 103245613 103148628 103033493 103003860 102994110 102967476 102940941 102905746 102902199 103014565 103102158 103003860 102864883
3412 102864883 102773903 102739311 102839233 102952934 102952148 102937386 102989769 103039169 103032425 102999474 102958961 102891541
3424 102891541 102761627 102636147 102597595 102563690 102461220 102345276 102252266 102164841 102066803 101990791 101994110
3435 101994110 101986572 101861115 101725601 101656624 101640823 101731323 101805138 101713081 101586700 101509758 101476311
3446 101476311 101519318 101605652 101731560 101841568 101857353 101843407 101845932 101841209 101801178 101785065 101864838 101973961
3458 101973961 102070236 102152611 102165199 102230240 102560089 102828194 102658676 102411797 102353859 102390526 102535934
3469 102535934 102730774 102943924 103104759 103083870 103026535 103060814 103108620 103147003 103138275 102994324 102843262
3480 102843262 102802490 102815964 102880859 102954628 102997017 102998116 102897644 102806068 102846741 102920601 102951241 102993752
3492A02993752R9487J09703R9396N5191o3942q0757R53J8860J2398j4114j02112r0340
3504A03038475K5749O6475O8207O4972M8996J7235o1341n9539N2337K8252j63819j49894
3516A02976105N6816J34994J89087J22429j44859j96938o8618l6545o1058k4468P7011
3527A03023956J10268J12152O8069n8677j06812j29150p5745J10771J50780Q4419L0495
3538A03320526p5889r4079l1379N72M9927L5454o7666p9155q697J884k8541l3859n4551
3551A02934547N059K06779K07566p317l6148Q0612J03088P6706N9456M1771M028p9055
3563A03597092q7021j2879n073l9101o4613j19377j02707L952K5390j8615l2311o7230
3575A03077507j2924J84181J99173L1212Q316J07429R2820q728o8779j45012j35468
$$ plain form
3492 102993752 103093239 103202942 103302338 103357529 103293587 103212830 103213783 103232643 103245041 103230927 103128815 103038475
3504 103038475 103064224 103130699 103198906 103263878 103312874 103330109 103268768 103209229 103261566 103289818 103125999 102976105
3516 102976105 103032921 103167915 103357002 103479431 103334572 103137634 103069016 103032471 102971413 102946945 103023956
3527 103023956 103134224 103246376 103314445 103255768 103148956 103019806 102944061 103054832 103205612 103290031 103320526
3538 103320526 103244637 103150558 103119179 103119751 103169678 103205132 103137466 103058311 103049614 103051498 103022957 102989098 102934547
3551 102934547 102939606 103146385 103353951 103346634 103310486 103391098 103494186 103570892 103630348 103672119 103676147 103597092
3563 103597092 103510071 103497192 103492119 103453018 103388405 103269028 103166321 103170273 103195663 103177048 103144737 103077507
3575 103077507 103064583 103248764 103447937 103479149 103487465 103594894 103687714 103678986 103610207 103465195 103329727
3586A03329727k5390K3841O3446M9614o1630n0644R9114J01753j8311p3074j13602
3597A03324844j23787j21238n1857J41029J76399Q9745J9958j23191j17928Q0162P1594
3608A03365730j49299j60500K14O1561J13747O6971j37902j74881r9563j5831J77383
3619A03047630J79413l0495o8954N6747p652l31184k83676J68228K60689J04805J9722
3630A03115273j43097j08910K03133J94854j45073j73286L4950J37261K58323K41425
3640A03614853O2820k6123r0934j21026j05117r9228j13823n1094J37619J59790M5128
3651A03412865l2685j71684j53496M5159J12556J21254R2415o439o6681j60462j08070
3662A03084732J30081K15531K59735J55136k27905k63237O1508P0526j97456k21680
$$ plain form
3586 103329727 103304337 103328178 103391624 103441238 103379608 103328964 103428078 103529831 103511520 103438446 103324844
3597 103324844 103201057 103079819 103027962 103168991 103345390 103435135 103455093 103331902 103213974 103294136 103365730
3608 103365730 103216431 103055931 103056145 103117706 103231453 103298424 103160522 102985641 102886078 102870247 103047630
3619 103047630 103227043 103196548 103127594 103184341 103176689 102845505 102561829 102730057 102990746 103095551 103115273
3630 103115273 102972176 102863266 103066399 103261253 103116180 102942894 102977844 103115105 103373428 103614853
3640 103614853 103677673 103651550 103560616 103439590 103334473 103235245 103121422 103070328 103207947 103367737 103412865
3651 103412865 103380180 103208496 103055000 103100159 103212715 103333969 103426384 103419945 103353264 103192802 103084732
3662 103084732 103214813 103430344 103690079 103845215 103617310 103354073 103415581 103486107 103288651 103066971
3672A03066971o5758L906O8261O9740l0182k0058R0485J28555J45027J09055J3832
3683A03579834q2733k56561k62070j05339p698J33987J28319o7734r1026J2543O3293
3694A03044815J43318J03997r9328j39564o5971q797R6893J21399N7625O3446J43883
3705A03461716J20903p40o2317j18309j09841m623R064o6521n2147M0367P8987J01548
3717A03398087Q8615M5013k9251j99531k04544r5101P0641M45656M75975J97174K0645
3728A04213379k08832k81952k09877j57501o4232p797K3514O0531J20377J03447K5062
3739A03616119p6629l53577k36366M16847M68948J2207j85676l52478l44826j25770
3749A02838799J3237K03872K10785K930o0509o6017k6970J30249J24359l9718j00350
$$ plain form
3672 103066971 103001213 103005119 103073380 103143120 103112938 103092880 103183365 103311920 103456947 103566002 103579834
3683 103579834 103497101 103240540 102978470 102873131 102865433 102999420 103127739 103060005 102968979 102981522 103044815
3694 103044815 103188133 103292130 103192802 103053238 102987267 102978470 103075363 103196762 103254387 103317833 103461716
3705 103461716 103582619 103581879 103519562 103401253 103291412 103286789 103295853 103229332 103177185 103217552 103296539 103398087
3717 103398087 103486702 103531715 103502464 103302933 103098389 103003288 103073929 103519585 103995560 104192734 104213379
3728 104213379 104004547 103722595 103512718 103355217 103290985 103283188 103306702 103367233 103487610 103591057 103616119
3739 103616119 103539490 103185913 102949547 103366394 103835342 103847549 103661873 103309395 102964569 102838799
3749 102838799 102852036 103055908 103266693 103269623 103209114 103143097 103116127 103246376 103370735 103331017 103230667
3760A03230667j34399r6176O4804J00776L1685K5368M6707O7970J31966R5253p4318
3771A03490303j05095k1507K388n49J2275L4004M9134R6534L6004j94474k07000Q178
3783A03200195K4109j39549j34705p965P8896K24304J96259m5395j08002q7494P080
3794A03207733L40004K63100l11447l84285p0832R1004L55789K43042m11202m70733
3804A02852173k8061J50490K87895K58278k0050r4658l6263j4610R514M8805J74256
3815A03587769Q8836l20076l05153J39473K42737J58142M2725k67647k73804J5663
3825A03108665J35994K27837J93169l4363r1408l1830l837M6135N1880K6748j6685
3836A03612305j10817j39023j35231q0635N9486J27266J65962J60195O4850P5744K58255
$$ plain form
3760 103230667 103096268 103000092 103064896 103165672 103197357 103222725 103269432 103337402 103469368 103564621 103490303
3771 103490303 103385208 103363701 103366089 103365540 103377815 103411819 103460953 103557487 103593491 103399017 103192017 103200195
3783 103200195 103224304 103084755 102950050 102942085 103020981 103245285 103441544 103396149 103288147 103200653 103207733
3794 103207733 103547737 103810837 103499390 103115105 103044273 103135277 103491066 103734108 103322906 102852173
3804 102852173 102824112 102974602 103262497 103520775 103500725 103406067 103369804 103355194 103364708 103413513 103587769
3815 103587769 103676605 103356529 103051376 103190849 103433586 103591728 103634453 103366806 103093002 103108665
3825 103108665 103244659 103472496 103665665 103631302 103539894 103508064 103504227 103550362 103602242 103628990 103612305
3836 103612305 103501488 103362465 103227234 103146599 103206085 103333351 103499313 103659508 103724358 103800102 104058357
3847A04058357J54953k73323m12559m27178k73819K22061L18505O0768R468Q2016M8088
3858A03567337p1266j30081j92093j48415N7625R0340k3507n5671p1793l7880J02135
3869A03086731Q9935j09222r8465J27815J50177P584l6408m3007l1089N6312R918k32101
3881A02978180k13333P6431J39862N5618O150j02471p7102J28982J35712p2914n3116
3892A03001999J90231K32651J56143N7099j59455k10090j25054o6971L0922O3919M7593
3903A03218987K4337k0385p0855j67610j64268o1966k907N9029Q1329M6036O7207J69159
3915A03178093J40457k6680r0073j09413q8409L006M7996P4456Q7623Q7357O8901M1199
3927A03414513k7108j81411k09046j27990p9270l3043L2089J50826J62743O0058L4256
$$ plain form
3847 104058357 104213310 103939987 103527428 103100250 102826431 103048492 103366997 103427765 103437233 103519249 103567337
3858 103567337 103496071 103365990 103173897 103025482 103083107 103173447 103149940 103094269 103022476 102984596 103086731
3869 103086731 103176666 103067444 102968979 103096794 103246971 103254555 103218147 103175140 103144051 103200363 103210281 102978180
3881 102978180 102764847 102841278 102981140 103036758 103042908 102940437 102863335 102992317 103128029 103055115 103001999
3892 103001999 103192230 103424881 103581024 103638123 103478668 103268578 103143524 103076553 103107475 103171394 103218987
3903 103218987 103243324 103222939 103152084 102984474 102820206 102758240 102755333 102814362 102895691 102941727 103008934 103178093
3915 103178093 103318550 103291870 103201797 103092384 103003975 103006981 103054977 103129433 103217056 103304413 103373314 103414513
3927 103414513 103387405 103205994 102996948 102868958 102789688 102756645 102788734 102939560 103102303 103162361 103196617
3938A03196617N3078N3810R1026R033k70980k78069l5309P8484J71593J89537J25244
3949A03384064O1226m0963j10031j93878j72279q965L0632k5863k3484J8669K1744
3960A02940872k0363m463P5127R2483O0295N3452Q0994L1707j25930j54732q7265l0518
3972A02911659P5608R7389L0853K5391O3591O5422M6371K4552j2368l3409n7289l9986
3984A03197784N4528L8147j04279j24336p2266M341K08756J75407j26457k08572j65840
3995A02877213j06888M2274R4055Q1704N9867
4000A03048225
$$ plain form
3938 103196617 103249695 103303505 103394531 103403564 103132584 102854515 102819206 102897690 103069283 103258820 103384064
3949 103384064 103445290 103404327 103294296 103100418 102928139 102919174 102949806 102923943 102900459 102919128 102940872
3960 102940872 102920509 102916046 102991173 103083656 103143951 103197403 103278397 103310104 103184174 103029442 102942177 102911659
3972 102911659 102987267 103084656 103115509 103140900 103204491 103269913 103316284 103340836 103328468 103295059 103237770 103197784
3984 103197784 103252312 103290459 103186180 103061844 102989578 102993919 103202675 103378082 103251625 103043053 102877213
3995 102877213 102770325 102812599 102906654 102988358 103048225
4000 103048225
##END=$$ End of the data block
