##TITLE=$$ Begin of the data block
##JCAMP-DX=5.00 $$ ACD/SpecManager v 10.08
##SPECTROMETER/DATA SYSTEM=16PC
##DATE=25 Jun 2013 14:39:40
##DATA TYPE=INFRARED SPECTRUM
##DATA CLASS=XYDATA
##ORIGIN=
##OWNER=
##NPOINTS=3601
##FIRSTX=400.00000000
##LASTX=4000.00000000
##MAXX=4000.00000000
##MINX=400.00000000
##MAXY=42.89157867
##MINY=13.19653320
##XFACTOR=1.0000000000
##YFACTOR=0.000000100000000
##FIRSTY=23.33218002
##DELTAX=1.00000000
##XUNITS=1/CM
##YUNITS=TRANSMITTANCE
##XYDATA=(X++(Y..Y))
400 233321800 291121216 334091835 359458084 370193596 372498016 372311287 372893410 374560585
408 374560585 376185989 377063560 377787819 379742851 383845253 389631844 395383644 399151077 399917297
417 399917297 398124084 395300369 393140717 392656860 393854942 395974236 398003349 399132042 398963814
426 398963814 397509422 395073090 392111473 389092636 386373749 384139481 382441635 381317024 380887871
435 380887871 381339569 382759628 384946251 387352486 389255981 390084343 389700623 388464050 387018356
444 387018356 385937920 385438347 385304565 385043945 384148521 382322578 379584999 376244316 372788887
453 372788887 369739761 367500877 366238022 365833244 365950546 366201782 366342354 366387138 366576691 367210312
463 367210312 368449593 370216217 372246666 374262161 376140289 377978439 380014038 382460785 385367889
472 385367889 388585320 391844368 394889679 397575226 399868584 401778908 403277130 404278107 404702835
481 404702835 404566727 404000740 403147469 401968460 400095177 396874123 391668243 384305267 375434380
490 375434380 366541977 359541588 356084404 356920357 361630058 368856888 376900673 384353752 390473900
499 390473900 395174065 398733711 401465836 403533554 404967041 405785599 406091919 406064949 405882149
508 405882149 405654297 405428543 405247879 405201759 405413857 405970993 406847878 407887764 408857422 409540405
518 409540405 409808502 409636307 409065361 408158836 406982956 405622749 404210243 402934189 402015686
527 402015686 401656570 401984215 403013802 404639473 406654510 408790894 410769958 412349358 413360291
536 413360291 413727036 413471680 412706871 411619873 410443916 409413109 408705101 408388786 408405914 408604088
546 408604088 408814888 408938484 408986969 409057083 409246101 409560356 409876900 409985847 409692612 408922348
556 408922348 407767677 406453819 405242729 404327049 403763237 403464050 403243179 402883835 402206726 401120987
566 401120987 399648437 397914581 396099586 394361801 392761383 391228294 389604759 387755241 385689926
575 385689926 383629875 381960907 381087914 381258354 382448540 384373856 386613083 388772049 390598755
584 390598755 391998177 392966423 393507538 393600464 393230209 392451096 391419373 390358849 389474754 388865395
594 388865395 388486366 388182716 387759743 387045975 385917397 384293480 382139702 379505882 376588211
603 376588211 373769226 371578064 370552597 371047859 373078499 376284637 380051651 383736191 386890373
612 386890373 389380150 391349030 393066902 394759560 396509743 398267555 399929352 401413155 402673759
621 402673759 403663101 404290962 404443245 404065552 403257790 402301750 401578445 401408043 401902885 402922211
631 402922211 404152870 405262871 406034164 406408272 406444130 406242371 405892639 405465431 405021057 404603539
641 404603539 404217148 403813553 403321419 402710075 402035561 401417084 400942993 400568695 400094528 399258881
651 399258881 397895966 396047211 393944130 391876221 390050774 388556557 387454758 386898651 387140465
660 387140465 388360481 390412254 392684746 394248695 394271927 392489738 389432945 386240082 384125595
669 384125595 383795433 385135117 387332153 389330139 390335083 390096893 388861809 387099648 385218468
678 385218468 383433456 381816483 380426216 379389610 378873749 378987465 379700203 380843124 382190552
687 382190552 383563766 384892883 386212006 387602615 389123840 390764236 392428093 393957901 395186005
696 395186005 395999680 396394463 396484718 396454010 396460457 396546364 396609192 396459084 395936432 395021172 393869743
707 393869743 392757645 391965141 391673279 391919975 392622185 393629112 394764442 395842171 396674423
716 396674423 397098351 397029533 396515160 395744553 394992371 394511147 394425011 394679832 395074883 395355911
726 395355911 395319366 394878693 394073868 393032379 391912575 390856438 389962616 389276047 388787956 388442039
736 388442039 388148537 387806244 387329407 386667709 385810852 384773216 383566895 382177773 380558357
745 380558357 378645134 376393318 373813515 370993423 368091583 365306435 362830429 360806503 359296570
754 359296570 358268890 357601166 357097740 356521072 355635567 354257774 352295723 349763298 346759109
763 346759109 343421516 339886436 336268425 332672882 329216385 326021271 323166008 320606766 318119202
772 318119202 315313854 311747131 307094364 301312447 294712162 287904816 281643200 276625423 273335190
781 273335190 271963921 272417488 274379330 277396908 280971012 284640274 288055954 291034260 293570576
790 293570576 295804691 297946854 300191460 302650032 305325527 308128471 310920277 313562908 315957661
799 315957661 318066349 319911842 321562080 323103523 324614639 326152344 327757263 329473495 331366234
808 331366234 333518715 336003838 338841782 341969872 345246811 348492432 351545906 354312935 356781731
817 356781731 359007492 361080856 363094521 365119247 367184258 369262238 371265297 373065414 374542503
826 374542503 375644951 376427689 377036285 377634087 378309021 379015045 379590263 379849091 379695930 379193039
836 379193039 378541031 377987709 377721367 377813644 378236961 378932381 379870186 381059799 382506485 384155045
846 384155045 385869637 387472038 388820686 389877892 390725136 391515198 392386513 393386421 394434319
855 394434319 395337181 395843239 395715828 394810295 393140984 390921516 388555756 386565742 385462646
864 385462646 385596809 387045631 389585533 392765808 396052132 398982582 401275406 402859573 403835602
873 403835602 404400215 404772186 405140648 405640335 406343803 407264519 408367271 409587898 410857468 412126274
883 412126274 413375015 414608727 415836525 417048225 418201790 419228592 420058975 420654182 421032867
892 421032867 421275673 421503258 421832085 422327347 422973709 423682289 424331322 424823723 425130577 425298920
902 425298920 425419388 425573006 425787659 426029968 426231842 426335716 426328011 426244202 426147690 426099625 426139297
913 426139297 426283150 426535034 426891785 427338028 427835045 428315506 428696632 428907242 428915787 428741570
923 428741570 428443260 428092079 427745514 427433853 427164078 426929512 426718559 426515083 426296196 426033592
933 426033592 425703125 425296364 424827538 424327354 423828697 423348961 422882233 422402115 421873283 421261635
943 421261635 420539436 419683228 418672409 417493820 416154289 414696846 413209953 411822548 410680733
952 410680733 409912300 409590759 409713211 410203056 410938721 411796074 412688789 413587532 414509964 415488815
962 415488815 416534500 417612228 418645096 419538803 420215263 420636864 420813446 420791245 420633659 420403137
972 420403137 420148888 419901428 419672775 419458504 419243660 419009018 418736649 418412323 418024292 417562332
982 417562332 417019653 416399422 415720901 415017014 414320831 413644714 412964859 412223969 411355019 410315590
992 410315590 409112434 407801170 406457710 405136986 403841019 402513580 401062164 399390221 397417984
1001 397417984 395079536 392300682 388980865 385005608 380302315 374928932 369160004 363520355 358731613
1010 358731613 355562592 354621239 356154366 359934616 365286865 371258278 376874657 381394806 384469223
1019 384469223 386155205 386800232 386858215 386723328 386641388 386711922 386947632 387339020 387883263 388573875
1029 388573875 389375763 390214958 391000557 391663513 392185287 392593231 392923965 393179054 393304291 393209839
1039 393209839 392820473 392127457 391211014 390221367 389327011 388657951 388267174 388122292 388125381 388146591
1049 388146591 388061218 387779007 387261505 386523132 385614967 384597206 383508682 382348251 381075706
1058 381075706 379630203 377955093 376017456 373812408 371354904 368663445 365744286 362579193 359118347
1067 359118347 355280380 350962868 346060486 340484810 334173584 327083511 319171734 310384865 300674744
1076 300674744 290042553 278591728 266556892 254285908 242180443 230627975 219962215 210464859
1084 210464859 202389717 195967827 191371422 188647900 187669506 188143711 189693336 191967297 194723530
1093 194723530 197846241 201308498 205127754 209360867 214139214 219696274 226328926 234273319 243544064
1102 243544064 253832436 264540768 274961605 284520493 292961273 300383835 307122688 313543243
1110 313543243 319865513 326095238 332074966 337603607 342551689 346919785 350831451 354481010 358069572
1119 358069572 361750717 365594597 369575043 373582420 377460213 381057701 384276276 387089386 389526291
1128 389526291 391631737 393428421 394904175 396031189 396801033 397247543 397442894 397465324 397360153
1137 397360153 397117271 396678200 395969620 394945869 393621292 392079391 390459137 388923759 387625237
1146 387625237 386674042 386122894 385967064 386157722 386620369 387268372 388007736 388734779 389335823 389696960
1156 389696960 389720573 389341545 388526192 387252998 385483818 383148575 380165253 376496048 372221298
1165 372221298 367593460 363038597 359092369 356284828 355007401 355402298 357305107 360257721 363595352
1174 363595352 366594009 368651199 369451180 369060364 367907066 366637192 365892029 366089783 367301826
1183 367301826 369271698 371557274 373722000 375478897 376730232 377506065 377858887 377786827 377224579
1192 377224579 376092567 374359245 372067490 369308968 366169434 362679634 358806076 354477463 349628143
1201 349628143 344228935 338291473 331852112 324947624 317596378 309784908 301459694 292523746 282845612
1210 282845612 272289181 260765820 248297424 235071583 221470528 208062992 195554810 184701633
1218 184701633 176188641 170493965 167766895 167765884 169897614 173368473 177415829 181538696 185639095
1227 185639095 190013027 195194416 201716385 209890480 219685879 230744228 242501354 254353180
1235 254353180 265797329 276510563 286355953 295343399 303571472 311174011 318279476 324985428
1243 324985428 331344833 337364120 343012390 348237839 352985687 357209969 360875015 363947945 366389275
1252 366389275 368149681 369176178 369427109 368887482 367580528 365573273 362980804 359971466 356773148
1261 356773148 353667297 350960617 348928299 347740898 347403069 347733650 348404427 349026375 349249535
1270 349249535 348835754 347678223 345767365 343129959 339774513 335668983 330756721 324999962 318429680
1279 318429680 311183548 303517036 295781021 288368130 281639767 275856495 271138382 267472897 264770107
1288 264770107 262943192 261979599 261973820 263110409 265605297 269626541 275216751 282233887 290325584
1297 290325584 298950043 307454262 315201244 321715698 326796112 330542679 333280067 335404968 337222252
1306 337222252 338843918 340187607 341061516 341278076 340733757 339422798 337395401 334706688 331397743
1315 331397743 327525826 323225479 318759651 314528255 311021900 308735409 308071613 309264088 312336502
1324 312336502 317106590 323226128 330249672 337713737 345208664 352424126 359157753 365290222 370743752
1333 370743752 375452271 379361877 382462616 384829597 386638985 388135376 389553871 391031647 392555466
1342 392555466 393978271 395099030 395765991 395946808 395733452 395286179 394755211 394229126 393729744 393242950
1352 393242950 392750816 392234650 391643944 390852661 389633446 387671814 384628334 380237312 374425392
1361 374425392 367418594 359796181 352445488 346391678 342529259 341341515 342725677 346016235 350205956
1370 350205956 354271622 357455368 359386673 360026131 359514046 358041344 355815659 353106308 350284691
1379 350284691 347784042 345973930 345019798 344824905 345101700 345535889 345944023 346332779 346833916 347567825
1389 347567825 348525352 349538956 350352249 350741730 350621567 350080490 349338837 348649864 348190384 347986946
1399 347986946 347908058 347725487 347217369 346261444 344874496 343179550 341328049 339428940 337528191
1408 337528191 335640259 333792877 332034721 330390167 328793297 327064705 324972153 322359886 319276905
1417 319276905 316021862 313066101 310884342 309772949 309742718 310531597 311725769 312933941 313939800
1426 313939800 314770756 315650387 316850166 318503857 320476990 322373810 323697701 324095116 323551178
1435 323551178 322420883 321266670 320592041 320618706 321226578 322063103 322732010 322940598 322549667 321555481
1445 321555481 320074692 318359985 316791992 315767975 315472527 315639420 315493183 313996410 310345402
1454 310345402 304464340 297193375 290013943 284426460 281315403 280656471 281715851 283592663 285758591
1463 285758591 288271370 291566410 295997601 301444206 307234592 312422924 316235600 318416824 319283581
1472 319283581 319485378 319630623 319994297 320451584 320636864 320205421 319038181 317278614 315203075
1481 315203075 313016911 310706139 308042355 304750271 300760975 296423187 292549953 290245743 290553646
1490 290553646 294054146 300591469 309272461 318779316 327886238 335947609 343105392 350076866 357605209
1499 357605209 365859261 374135399 381073036 385308990 386222763 384345703 381183052 378535805 377702560
1508 377702560 378995743 381803551 385091057 387992554 390147858 391650124 392740517 393517456 393858070
1517 393858070 393556900 392531204 390927773 389076347 387357101 386087646 385475349 385602074 386393776
1526 386393776 387588425 388773994 389553337 389783134 389729576 389981384 391104927 393218155 395763474
1535 395763474 397669792 397855492 395802155 391864319 387138824 382972641 380389442 379725037 380616989
1544 380616989 382289276 383950424 385120049 385778313 386316490 387320251 389248161 392108040 395276794
1553 395276794 397599640 397804298 395095329 389647331 382707329 376186218 371891022 370761032 372493210
1562 372493210 375743561 378788948 380299530 379834061 377844658 375249176 372848473 370918388 369176521
1571 369176521 367102890 364395676 361284256 358511505 356991768 357338333 359525375 362870407 366340446
1580 366340446 369006042 370395317 370578842 369984932 369094391 368207169 367387428 366565819 365682373 364763412
1590 364763412 363903008 363196030 362688789 362374611 362211876 362130089 362023735 361760674 361228561 360397530
1600 360397530 359340553 358175163 356955605 355606689 353976364 351994324 349816246 347813301 346362762
1609 346362762 345553360 345016251 344039154 341935310 338452873 333957596 329255829 325158768 322052269
1618 322052269 319729500 317565117 314892941 311347466 306988697 302192879 297431889 293082485 289335175
1627 289335175 286172409 283361454 280451565 276827641 271870918 265203686 256901588 247532635 237958813
1636 237958813 228974705 220967045 213776779 206840630 199535999 191552429 183108501 174920864 167952309
1645 167952309 163059826 160700665 160821781 162979565 166633396 171469402 177579994 185381374 195287323
1654 195287323 207305393 220794411 234557648 247259274 257952442 266421185 273135147 278847256
1662 278847256 284086285 288856621 292719536 295174408 296063881 295723438 294782810 293777943 292861023
1671 292861023 291821651 290397701 288637085 287020721 286221313 286631584 287975597 289285221 289298649
1680 289298649 287069740 282438660 276097736 269226284 262915821 257700176 253413754 249389725 244830494
1689 244830494 239128532 232000618 223440266 213594875 202682762 190994358 178946476 167115917
1697 167115917 156199455 146896334 139751215 135014839 132571669 131965332 132525539 133571234 134627714
1706 134627714 135575237 136657352 138327780 140990133 144745026 149264297 153857374 157701283 160127335
1715 160127335 160834637 159944448 157894964 155253267 152552977 150235367 148698120 148385906 149825354
1724 149825354 153540344 159862690 168736134 179638958 191705303 204015198 215916576 227209072
1732 227209072 238084335 248860607 259670238 270292702 280236835 289017944 296451473 302775593
1740 302775593 308520317 314202309 320029373 325789070 330980759 335106125 337950897 339710197 340905304
1749 340905304 342155418 343929558 346391258 349391365 352581291 355579147 358110504 360077629 361552162
1758 361552162 362721863 363830261 365132294 366858635 369166718 372065849 375343704 378552971 381109772
1767 381109772 382502060 382524719 381417770 379808731 378469086 377997894 378596764 380045395 381867790
1776 381867790 383574905 384847603 385590172 385882683 385909996 385921097 386203575 387018204 388474007 390399017
1786 390399017 392318420 393612022 393810577 392873497 391270485 389787827 389148216 389654732 391057625
1795 391057625 392715302 393945084 394362450 394031219 393371391 392906837 393003464 393725166 394852982 396024666
1805 396024666 396910400 397342110 397350235 397108078 396823273 396633911 396563683 396552582 396538734 396530952 396619415
1816 396619415 396917343 397474518 398229332 399033928 399731789 400227966 400499001 400549126 400362816 399911880
1826 399911880 399218674 398418236 397745590 397430267 397560692 398024826 398588715 399071808 399490013 400047264
1836 400047264 400959854 402227592 403524284 404311600 404126892 402871284 400909576 398911705 397527771
1845 397527771 397090111 397507172 398386650 399284859 399923325 400260086 400412636 400516968 400626183 400702477
1855 400702477 400686111 400578842 400483856 400574875 401010590 401834602 402911148 403934021 404521599 404370537
1865 404370537 403405762 401846733 400145950 398809242 398186226 398332710 399017105 399858704 400513687
1874 400513687 400805779 400746498 400461578 400094604 399750977 399497757 399385567 399449005 399675102 399970703
1884 399970703 400173378 400119133 399732094 399075546 398323975 397670898 397230148 396994400 396868172 396747017
1894 396747017 396579819 396379814 396188812 396033630 395912132 395811195 395730743 395682449 395660591 395614929 395461388
1905 395461388 395137367 394669266 394197235 393925209 394014359 394483452 395181656 395857010 396283417 396369591
1915 396369591 396188087 395910416 395697517 395613251 395611496 395594444 395497818 395344009 395234489 395289116 395572739
1926 395572739 396051712 396601486 397059021 397291946 397253418 397001953 396677971 396447830 396435242 396667938
1936 396667938 397061996 397454605 397673836 397614059 397280693 396782837 396276817 395893402 395686417 395627441
1946 395627441 395643654 395669060 395677605 395680122 395693703 395710716 395691147 395586472 395377693 395102921 394852104
1957 394852104 394729080 394800911 395059776 395419235 395747070 395918236 395863914 395596352 395200119 394797058
1967 394797058 394501114 394382019 394448471 394655685 394927521 395185051 395368042 395445366 395414200 395293198
1977 395293198 395114479 394917641 394745827 394640274 394631233 394725876 394898186 395088539 395218201 395215988 395049820
1988 395049820 394745255 394381638 394062653 393872490 393838730 393920174 394026146 394058456 393954239 393710060
1998 393710060 393377953 393038330 392766762 392608795 392572212 392634163 392754669 392890053 393002701 393066139
2008 393066139 393068352 393010674 392904015 392763252 392602081 392431488 392262268 392106781 391977882 391881943 391812363
2019 391812363 391748848 391666107 391548882 391403809 391259346 391151772 391104927 391114388 391147041 391155357 391100655
2030 391100655 390970764 390785904 390589523 390430336 390343666 390339317 390397758 390476303 390521812 390486908 390345268
2041 390345268 390102081 389793587 389477119 389213562 389047050 388991737 389028091 389110260 389181824 389193916 389119568
2052 389119568 388960762 388746758 388522949 388334999 388212547 388158112 388147278 388138237 388089561 387977486 387805557
2063 387805557 387601738 387404366 387244072 387131004 387054062 386991272 386924438 386848640 386771011 386700630 386638298
2074 386638298 386575203 386502304 386424904 386369629 386376915 386479530 386679382 386937714 387185822 387353287 387396736
2085 387396736 387316208 387150879 386958504 386791801 386683578 386643105 386660271 386713104 386771927 386803551 386777267
2096 386777267 386675034 386500053 386279831 386060486 385891075 385806999 385816803 385899582 386011810 386102791 386131516
2107 386131516 386081238 385965652 385822792 385699539 385630798 385623131 385652428 385674324 385646477 385546188 385378036
2118 385378036 385167809 384947929 384745674 384579430 384461861 384403381 384409523 384472084 384561386 384628563 384622002
2129 384622002 384511909 384309731 384070892 383874474 383789291 383843040 384008751 384217758 384389725 384467583
2139 384467583 384436874 384325142 384181747 384053001 383964462 383918343 383901596 383897476 383890991 383868484 383814888 383715553
2151 383715553 383564529 383374023 383176956 383018074 382935295 382942848 383023987 383138275 383238106 383285484 383261108
2162 383261108 383165398 383015137 382838211 382669983 382544899 382485962 382492485 382535667 382566223 382534637 382413139
2173 382413139 382207718 381954994 381704292 381498795 381362648 381300583 381304092 381355171 381428223 381488686 381498566
2184 381498566 381428795 381275139 381065559 380852814 380692902 380619926 380631790 380693665 380757751 380785408 380762024
2195 380762024 380696945 380613136 380533600 380473404 380438614 380429459 380443306 380474014 380509872 380532646 380521164 380458107
2207 380458107 380338860 380176163 380000114 379849663 379761200 379755249 379828529 379953499 380085678 380178108 380196495
2218 380196495 380129356 379990692 379814644 379642258 379508514 379430084 379400978 379394608 379373817 379304314 379167633
2229 379167633 378968239 378731995 378497467 378303070 378176537 378129272 378156891 378243027 378362656 378485031
2239 378485031 378576355 378604851 378549385 378407478 378200302 377969055 377762299 377620964 377563210 377578506 377631035
2250 377631035 377672005 377655563 377555885 377376823 377154617 376946793 376812859 376789627 376873856 377020493 377158966
2261 377158966 377222290 377175484 377028084 376827164 376632957 376493034 376426086 376421852 376450806 376477242 376466789
2272 376466789 376391907 376237717 376012039 375753326 375528564 375413589 375462074 375677338 376005173 376353951
2282 376353951 376633644 376792488 376833115 376801033 376755753 376742821 376779442 376857071 376952858 377041245 377101135
2293 377101135 377120476 377101746 377066917 377057953 377128830 377329559 377690811 378214836 378875389 379622688 380388603
2304 380388603 381092033 381648674 381991272 382097473 382013245 381856194 381788788 381965675 382473526 383285179
2314 383285179 384249420 385123177 385644684 385627823 385046616 384068718 383008957 382203407 381851234 381904259
2324 381904259 382073479 381968842 381306496 380068626 378518410 377055359 375999107 375433731 375202866
2333 375202866 375039902 374720421 374119339 373140221 371607857 369266357 365961990 361934204 358012161
2342 358012161 355512352 355791626 359630852 366767502 375853310 384897728 391996002 395987663 396745033
2351 396745033 395000610 391865349 388317146 384899750 381710358 378589439 375352097 371930122 368393707
2360 368393707 364895287 361602402 358655128 356147614 354118080 352541237 351335411 350393257 349626884
2369 349626884 349004364 348553886 348335419 348401108 348772049 349442444 350397949 351628113 353117332 354822845
2379 354822845 356661758 358519745 360281639 361862640 363221397 364350357 365255737 365945053 366430550
2388 366430550 366740952 366926651 367048607 367155762 367265854 367363739 367418671 367409325 367341347 367247124 367171097
2399 367171097 367149734 367197876 367305489 367443581 367574577 367662888 367685089 367636719 367535858 367418671 367328682
2410 367328682 367300911 367348137 367455482 367585411 367692146 367737274 367701378 367586060 367407799 367187920 366945190
2421 366945190 366694374 366449509 366228142 366050224 365931320 365871696 365851517 365836105 365791702 365704536 365590019
2432 365590019 365486526 365434341 365451088 365518799 365588837 365605011 365530319 365364532 365143929 364924927 364760475
2443 364760475 364680862 364685478 364746284 364819260 364857483 364823189 364695854 364477196 364191284 363879967 363592911
2454 363592911 363373909 363247528 363211403 363237000 363280487 363298264 363261642 363164101 363018570 362848778 362679291
2465 362679291 362530861 362419853 362360306 362360992 362418404 362508926 362587433 362598152 362495499 362263641 361926003
2476 361926003 361537247 361162987 360857277 360649109 360540352 360513306 360539284 360583649 360610085 360586472 360494957
2487 360494957 360341949 360160522 359999390 359902534 359888000 359938393 360008125 360044212 360008278 359890251 359707603
2498 359707603 359494171 359285736 359108887 358976440 358888092 358832321 358791122 358745613 358680458 358590317 358480301
2509 358480301 358363953 358257027 358171730 358112640 358075867 358049583 358016930 357958298 357857094 357706146 357513847
2520 357513847 357306480 357121811 356996307 356950150 356976318 357041512 357098198 357102509 357031670 356891975 356715546
2531 356715546 356546669 356423950 356365509 356362724 356385345 356395531 356365395 356288834 356183624 356080284 356005745
2542 356005745 355968590 355955391 355939713 355898285 355824814 355733490 355649872 355596046 355578918 355588760 355607529 355620880
2554 355620880 355625076 355624924 355625305 355622330 355602722 355550385 355457230 355329628 355186806 355050201 354931870 354828873
2566 354828873 354725800 354605370 354459610 354294586 354127579 353977623 353855782 353760567 353680267 353600235
2576 353600235 353512039 353418617 353334045 353278236 353267174 353304062 353373070 353440628 353465080 353412514 353272476 353066330
2588 353066330 352841339 352651939 352534866 352490807 352482224 352450752 352345390 352147980 351881447 351598778 351357117
2599 351357117 351191330 351101112 351056175 351015358 350948143 350849342 350739403 350652733 350620117 350652580 350733109
2610 350733109 350819969 350860023 350808487 350648079 350398827 350113182 349857559 349686127 349621315 349645805 349713326
2621 349713326 349769287 349771080 349700050 349561310 349375916 349172173 348980408 348829880 348746223 348746338 348831635
2632 348831635 348984032 349169197 349345169 349474754 349534340 349518280 349437065 349310875 349165039 349023628
2642 349023628 348904457 348814926 348750610 348697319 348638000 348561478 348468437 348371201 348287926 348233299 348211594 348214951
2654 348214951 348227463 348232307 348218994 348186913 348144646 348105392 348080254 348071899 348070831 348057747 348010368 347914429
2666 347914429 347771797 347601852 347435570 347303123 347222290 347192497 347196960 347210426 347207794 347170525 347088127
2677 347088127 346958923 346789970 346597366 346405869 346244621 346138687 346099625 346118774 346167793 346208344 346205673
2688 346205673 346142654 346025848 345881157 345741196 345629768 345551262 345490761 345424271 345333786 345218468 345094757
2699 345094757 344986420 344909935 344863701 344829178 344781113 344702606 344593697 344470139 344353371 344258385 344186096
2710 344186096 344124947 344057007 343966026 343841667 343681030 343488045 343273849 343055763 342853470 342682648
2720 342682648 342546806 342434387 342323494 342193375 342035561 341857681 341676025 341502342 341333351 341151543
2730 341151543 340938072 340689354 340425873 340185699 340005722 339901733 339858742 339839706 339804916 339732018 339623871
2741 339623871 339501038 339385262 339284973 339191360 339085732 338952141 338786507 338597984 338403473 338220901
2751 338220901 338064079 337942047 337858124 337808113 337777443 337740402 337664528 337520981 337295303 336995392 336650963
2762 336650963 336304588 335998383 335760651 335597267 335490570 335406265 335306740 335166931 334985771 334786797
2772 334786797 334606514 334473152 334388008 334319687 334218063 334039230 333770142 333436699 333090286 332782288
2782 332782288 332539902 332359772 332219467 332096863 331984482 331887169 331808853 331739044 331651077 331514931 331315842
2793 331315842 331066933 330804825 330573425 330402870 330297356 330237389 330193062 330139580 330066795 329979630 329890518
2804 329890518 329810295 329741096 329674530 329595985 329491081 329352417 329183846 328997498 328807640 328623276 328444214
2815 328444214 328265305 328083954 327907906 327754707 327643356 327581482 327558327 327547340 327518959 327455597 327358742
2826 327358742 327243843 327127228 327012825 326888428 326732788 326528931 326274376 325983315 325678444 325380363
2836 325380363 325098839 324831657 324570045 324306068 324038467 323772430 323515053 323267632 323020134 322751122
2846 322751122 322433624 322046509 321584053 321060562 320505562 319952183 319425621 318937531 318488026 318072414
2856 318072414 317685413 317319565 316958694 316574039 316129570 315596123 314967480 314267559 313542118 312838364
2866 312838364 312184334 311579247 310999889 310417900 309815559 309191284 308554554 307915573 307280064 306651230
2876 306651230 306035175 305443230 304886608 304366169 303865013 303351154 302789631 302157764 301454010 300696239
2886 300696239 299911880 299125671 298352985 297599602 296863842 296139278 295414734 294675789 293909760 293112564
2896 293112564 292295170 291482296 290702496 289975929 289303799 288670387 288053169 287436581 286820469 286218395
2906 286218395 285649738 285130005 284667225 284261780 283908806 283597603 283307438 283006668 282657375 282228165
2916 282228165 281707802 281111259 280473347 279831448 279209671 278612137 278030205 277456303 276893845 276355095
2926 276355095 275848694 275367527 274888783 274388409 273864040 273349972 272912998 272627449 272542839 272659416
2936 272659416 272926159 273260479 273578072 273818703 273955822 273991356 273941307 273823433 273650799 273431797
2946 273431797 273170815 272867947 272518024 272112064 271644344 271121635 270571136 270041256 269591827 269279823
2956 269279823 269143867 269195347 269417572 269770489 270198116 270635891 271018295 271287746 271404419 271354885
2966 271354885 271153889 270838165 270451698 270029812 269588795 269126225 268632164 268105907 267569885 267075386
2976 267075386 266695423 266508923 266579399 266936684 267565212 268404903 269363880 270341034 271251240 272046356
2986 272046356 272723026 273316269 273880482 274466667 275104713 275798359 276531849 277285500 278050461 278836708
2996 278836708 279670563 280583591 281598396 282717285 283918896 285162392 286396637 287570400 288639030
3005 288639030 289567623 290331860 290920906 291340675 291618099 291799049 291939507 292089329 292275410 292491932
3015 292491932 292702827 292856941 292909241 292839069 292658787 292410011 292149391 291930733 291787052 291719570
3025 291719570 291695328 291655846 291535511 291284332 290887699 290373363 289802685 289249096 288770657 288391247
3035 288391247 288095398 287838097 287563438 287222919 286786900 286246891 285611916 284902306 284143391 283360062
3045 283360062 282571926 281788540 281006393 280209446 279374275 278479156 277515163 276493950 275448914 274427643
3055 274427643 273476868 272625313 271872292 271186981 270521317 269828053 269079018 268271427 267423363 266560154
3065 266560154 265700912 264851608 264006462 263153896 262282543 261384220 260454025 259490089 258494434 257473469
3075 257473469 256436443 255390224 254334030 253256817 252140484 250968628 249736481 248457451 247163620
3084 247163620 245899734 244712543 243639336 242696495 241873226 241132526 240422287 239694328 238923550
3093 238923550 238118973 237317963 236567326 235899162 235314922 234786072 234268932 233724537 233132229 232492313
3103 232492313 231820469 231140575 230481663 229876671 229358845 228952675 228663712 228473797 228348579 228254452
3113 228254452 228176289 228123283 228119488 228185139 228321056 228508224 228721256 228948517 229202919 229516449 229922314
3124 229922314 230434170 231037483 231696224 232371960 233043575 233717213 234422092 235195084 236062965 237029362
3134 237029362 238072605 239153118 240225258 241249771 242200603 243066578 243848705 244558296 245216160
3143 245216160 245851860 246499615 247188625 247929001 248702354 249463501 250156956 250742474 251213951 251602535
3153 251602535 251956711 252312260 252670307 252995548 253237896 253362770 253370953 253295574 253179073 253047161
3163 253047161 252897205 252709217 252468491 252184296 251889095 251618042 251383686 251164017 250912399 250584259
3173 250584259 250163002 249667931 249141445 248623466 248131657 247657089 247176361 246669521 246129646 245562191
3183 245562191 244975433 244374008 243759880 243138409 242522240 241925735 241352711 240785503 240186329 239513206
3193 239513206 238742657 237884655 236981144 236086636 235243473 234466038 233741570 233044624 232353554 231656113
3203 231656113 230944633 230204391 229409485 228530788 227553272 226490917 225388184 224304676 223290901
3212 223290901 222367706 221520557 220710220 219891968 219033108 218119259 217151241 216136894 215085182 214007092
3222 214007092 212919693 211849346 210828686 209887791 209042683 208287601 207596226 206932011 206264725
3231 206264725 205585423 204912720 204286823 203752403 203337517 203038616 202820625 202632751 202434521 202218475
3241 202218475 202018528 201897163 201917458 202114086 202477112 202959232 203501091 204062710 204643860 205282764
3251 205282764 206035595 206947422 208032188 209270096 210622997 212056065 213552094 215110359 216733418
3260 216733418 218412457 220122623 221832829 223522873 225195370 226872997 228580551 230323696 232077904
3269 232077904 233796310 235433369 236968803 238418636 239825630 241234760 242669239 244120102 245553761
3278 245553761 246931705 248229084 249443302 250589638 251690063 252763748 253822746 254873047 255916309
3287 255916309 256949272 257962513 258940086 259863892 260721378 261511307 262244225 262936306 263600025 264238853
3297 264238853 264848766 265426102 265976295 266516476 267067833 267641983 268228264 268790340 269276581 269640732
3307 269640732 269862823 269961071 269986267 270001984 270058346 270172691 270324764 270469913 270562248 270576801 270519943
3318 270519943 270424728 270334949 270286827 270297985 270366955 270481033 270625763 270789356 270960464 271122837 271252022
3329 271252022 271320229 271306705 271210270 271054993 270884876 270748062 270677929 270680180 270732193 270795135 270831985
3340 270831985 270822544 270768700 270689220 270608463 270545769 270509987 270499325 270503387 270504684 270479069 270398369 270236683
3352 270236683 269980412 269635963 269230118 268799953 268376675 267972527 267578564 267176762 266758175 266337986
3362 266337986 265955658 265660458 265489197 265448666 265512829 265634384 265764580 265870571 265941963 265986748 266021576
3373 266021576 266061783 266116810 266189194 266276760 266374035 266473637 266567268 266645870 266699276 266715031 266678143 266573429
3385 266573429 266392403 266140747 265842381 265535278 265257854 265033283 264860020 264715157 264569550 264406376
3395 264406376 264232063 264072056 263956451 263903008 263908596 263952789 264009285 264056377 264081039 264076042 264036179 263960037
3407 263960037 263855457 263745575 263665733 263650494 263715153 263842182 263983459 264078369 264081402 263984547 263822460
3418 263822460 263657932 263554001 263546734 263630753 263764629 263891716 263966007 263971844 263928452 263880043 263876343 263952541
3430 263952541 264116821 264349041 264609585 264854259 265048294 265175171 265236702 265246124 265218353 265163136 265086288
3441 265086288 264996052 264911766 264865627 264893627 265019035 265236778 265510674 265786266 266015148 266175709 266279583
3452 266279583 266359997 266449986 266565037 266699905 266839409 266973515 267104435 267243404 267400284 267577477
3462 267577477 267771378 267978878 268200779 268436737 268676147 268895416 269067879 269183178 269263096 269357433
3472 269357433 269519863 269775162 270100803 270435905 270714111 270899086 270999756 271057205 271114159 271190834
3482 271190834 271283016 271381340 271492558 271642742 271857586 272136059 272439022 272708511 272906799 273049107
3492 273049107 273202553 273449211 273833008 274325867 274837074 275261364 275535088 275666523 275721912 275779762
3502 275779762 275884724 276030598 276179867 276301613 276400280 276515121 276694927 276967659 277327175 277743168
3512 277743168 278184509 278635445 279093609 279553871 279993401 280371017 280644474 280792255 280826206 280786781
3522 280786781 280725327 280687294 280704823 280799847 280989227 281280632 281663113 282098923 282530346 282905464 283210068
3533 283210068 283485489 283813686 284270821 284871750 285539589 286125927 286479912 286530781 286336861 286065788
3543 286065788 285911407 285992432 286292667 286681404 287002277 287175045 287244987 287351723 287641697 288188763
3553 288188763 288975792 289941387 291041946 292264671 293569660 294803429 295668602 295808792 294989986
3562 294989986 293278198 291094284 289086056 287869129 287770538 288710346 290276451 291935501 293260021
3571 293260021 294062519 294402866 294509163 294675980 295178471 296198692 297752380 299630890 301408539
3580 301408539 302561493 302680283 301685467 299918613 298031216 296708565 296366692 296985855 298166962
3589 298166962 299367828 300174007 300458660 300367374 300175018 300127945 300361595 300912533 301770515 302905006
3599 302905006 304239674 305610237 306763401 307428131 307434902 306817093 305832653 304887829 304395752 304627342
3609 304627342 305607452 307084751 308586903 309560986 309580021 308560963 306898403 305409374 305045776
3618 305045776 306451550 309563046 313482609 316755829 317971592 316410618 312408409 307230072 302512436
3627 302512436 299564991 298886471 300111942 302354317 304698849 306574249 307858372 308762283 309643211
3636 309643211 310864925 312714062 315306015 318449039 321539421 323631058 323756371 321402473 316886692
3645 316886692 311365929 306405602 303302822 302529945 303607998 305461369 307021599 307722569 307641335
3654 307641335 307284889 307231445 307865143 309310417 311500130 314243755 317228794 320006676 322064819
3663 322064819 323011551 322775154 321656265 320152245 318642101 317144909 315337296 312839947 309586601
3672 309586601 306020432 302975616 301314983 301549950 303660145 307173672 311396484 315613670 319168091
3681 319168091 321459427 321985817 320494843 317180557 312769032 308366451 305093651 303675938 304206276
3690 304206276 306193886 308845291 311398067 313337154 314434338 314680843 314222908 313355751 312529545
3699 312529545 312273922 312999649 314748325 317046490 319001217 319646034 318390083 315339336 311310883
3708 311310883 307519341 305087547 304620762 306033497 308675957 311657200 314186497 315788212 316342678
3717 316342678 316001968 315070724 313915710 312915840 312423496 312707500 313873253 315785656 318034935
3726 318034935 319981270 320895042 320185699 317665291 313750324 309476261 306238823 305290661 307176666
3735 307176666 311388912 316473675 320614014 322436829 321627388 318999920 315969315 313722267 312579365
3744 312579365 311927547 310747452 308385944 305070839 301841030 299946251 300109234 302113953 304958191
3753 304958191 307441616 308805370 309046440 308767910 308720608 309348869 310591679 311994324 312997932
3762 312997932 313211594 312543793 311186028 309519138 308003578 307073326 307022991 307899494 309446259
3771 309446259 311158676 312461166 312938938 312510090 311441383 310197887 309210491 308690815 308588829
3780 308588829 308698864 308832073 308942299 309132175 309552650 310276489 311239643 312290478 313303757 314264507
3790 314264507 315246239 316287766 317259960 317838650 317636223 316429958 314334755 311789856 309346714
3799 309346714 307388039 305973740 304924335 304085617 303572617 303790359 305182247 307861385 311385727
3808 311385727 314858646 317319603 318189793 317495880 315746136 313567009 311360512 309204540 307025776
3817 307025776 304877014 303083134 302133865 302397728 303867111 306122627 308548126 310652466 312286816
3826 312286816 313622513 314918060 316239471 317321186 317659187 316782513 314542694 311252308 307593136
3835 307593136 304344234 302080536 301009502 301032295 301977386 303838310 306825943 311149845 316627789
3844 316627789 322376976 326851654 328325310 325654449 318945007 309736824 300540276 293897800 291404591
3853 291404591 293152905 297846069 303481121 308231602 311102943 312100182 311921597 311416073 311110935
3862 311110935 311021900 310779877 309950657 308351517 306204510 304064465 302575760 302188244 302971382
3871 302971382 304608994 306561356 308298569 309484653 310033112 310038757 309660378 309038563 308284702 307511902
3881 307511902 306845837 306381969 306116867 305923519 305620022 305110569 304511814 304162178 304479427 305729160
3891 305729160 307831764 310323811 312504101 313692894 313478470 311843204 309135494 305927734 302837715
3900 302837715 300380192 298878899 298439617 298970585 300237522 301938267 303776836 305512066 306968880
3909 306968880 308021717 308578644 308592453 308097649 307242126 306272545 305457878 304982033 304867935 304984798
3919 304984798 305140495 305202026 305165462 305128002 305184441 305324268 305408936 305253296 304759407 304011765 303263550
3930 303263550 302816715 302866898 303406029 304234982 305070076 305674400 305941525 305901794 305667324 305361595
3940 305361595 305068741 304817238 304588604 304341717 304043064 303695126 303349991 303094807 303011303 303129101
3950 303129101 303404140 303739967 304038181 304241638 304341335 304348373 304264393 304083004 303822861 303555584 303387794
3961 303387794 303395882 303559437 303755322 303829365 303701077 303417912 303113384 302900219 302787685 302691727 302528572
3972 302528572 302303104 302106552 302020226 302014179 301946774 301680260 301216488 300718136 300374317 300217648 300067635
3983 300067635 299681702 299003410 298270741 297836056 297800522 297786713 297134037 295466423 293193684 291395149
3993 291395149 290890865 290945339 288521309 278881416 257582092 222955341 177671394
4000 177671394
##END=$$ End of the data block
