##TITLE=$$ Begin of the data block
##JCAMP-DX=5.00 $$ ACD/SpecManager v 10.08
##SPECTROMETER/DATA SYSTEM=16PC
##DATE=25 Jun 2013 14:29:54
##DATA TYPE=INFRARED SPECTRUM
##DATA CLASS=XYDATA
##ORIGIN=
##OWNER=
##NPOINTS=3601
##FIRSTX=400.00000000
##LASTX=4000.00000000
##MAXX=4000.00000000
##MINX=400.00000000
##MAXY=42.76002884
##MINY=14.08709049
##XFACTOR=1.0000000000
##YFACTOR=0.000000100000000
##FIRSTY=25.23472404
##DELTAX=1.00000000
##XUNITS=1/CM
##YUNITS=TRANSMITTANCE
##XYDATA=(X++(Y..Y))
$$ plain form
400 252347240 313491898 355648918 376654243 382167397 381898994 384289703 392686539 404882202
408 404882202 415713501 420708389 418533936 411142426 402101059 394529190 389908485 388136520 388329277
417 388329277 389604378 391402702 393409882 395394897 397177277 398683777 399933510 400892105 401316986
426 401316986 400769386 398844795 395475731 391086006 386475449 382509308 379806290 378583794 378686028
435 378686028 379711227 381147118 382491837 383378601 383700294 383669357 383731041 384325943 385610313 387300148
445 387300148 388750000 389232750 388266335 385814400 382276039 378305931 374580536 371618538 369699554
454 369699554 368866463 368976097 369768372 370937462 372189827 373279877 374024773 374318924 374165993 373723869
464 373723869 373322067 373404465 374388504 376490097 379606934 383334007 387117958 390481987 393213730
$$ packed form
400B52347240O1144658M2157020K1005325N513154k68403K390709Q396836J2195663
408D04882202J0831299M994888k174453p391510r041367p571869m620705j771965J92757
417C88329277J275101J798324K007180J985015J782380J506500J249733R58595M24881
426D01316986n47600j924591l369064m389725m610557l966141k703018j222496J02234
435C78686028J025199J435891J344719Q86764L21693l0937O1684N94902J284370J689835
445C87300148J449852M82750r66415k451935l538361l970108l725395k961998j918984
454C69699554q33091J09634P92275J169090J252365J090050P44896K94151j52931m42124
464C73723869m01802Q2398R84039K101593L116837L727073L783951L364029K731743
$$ plain form
473 393213730 395431557 397504005 399858589 402759514 406142616 409583282 412425652 414031944 414040451
482 414040451 412490730 409729500 406135864 401835060 396603127 390067635 382116661 373266945 364737816
491 364737816 358133736 354873962 355660515 360249443 367610741 376348190 385142555 393029671 399465675
500 399465675 404255981 407459908 409321327 410208931 410527573 410602074 410590096 410485725 410222054 409806366
510 409806366 409391251 409222336 409491577 410193024 411084175 411787071 411974869 411535721 410618553 409542007
520 409542007 408624115 408035393 407752075 407621689 407489929 407306747 407154427 407193413 407568474 408333206
530 408333206 409428139 410709343 411999130 413131866 413983994 414496384 414691696 414681778 414644012 414758606
540 414758606 415125847 415704002 416307411 416676407 416588287 415954666 414859161 413520317 412202988 411118202
$$ packed form
473C93213730K217827K072448K354584K900925L383102L440666K842370J606292Q507
482D14040451j549721k761230l593636m300804n231933o535492p950974q849716q529129
491C64737816o604080l259774P86553M588928P361298Q737449Q794365P887116O436004
500C99465675M790306L203927J861419Q87604L18642P4501j1978j04371k63671m15688
510D09806366m15115j68915K69241P01447Q91151P02896J87798m39148r17168j076546
520D09542007r17892n88722k83318j30386j31760j83182j52320L8986L75061P64732
530D08333206J094933J281204J289787J132736Q52128N12390J95312r918l7766J14594
540D14758606L67241N78155O03409L68996q8120o33621j095505j338844j317329j084786
$$ plain form
550 411118202 410351181 409837837 409395866 408800697 407885895 406633530 405214653 403951225 403201485 403212242
560 403212242 404000931 405326080 406756592 407811623 408109207 407468910 405941467 403767014 401284370
569 401284370 398818398 396578827 394601898 392763367 390867043 388777390 386534042 384381371 382687988
578 382687988 381790619 381840668 382736931 384175835 385786972 387277184 388510971 389500160 390329475 391071434
588 391071434 391736603 392270813 392582588 392576904 392178421 391345024 390077095 388420563 386457329 384277534
598 384277534 381943016 379465446 376823044 374024010 371189423 368608932 366721115 366002655 366799927
607 366799927 369176750 372854729 377286835 381839180 385998421 389510880 392393379 394828377 397013321
616 397013321 399049492 400919533 402537498 403816071 404697151 405137444 405086060 404500999 403414841
$$ packed form
550D11118202p67021n13344m41971n95169r14802j252365j418877j263428p49740J0757
560D03212242P88689J325149J430512J055031K97584o40297j527443k174453k482644
569D01284370k465972k239571j976929j838531j896324k089653k243348k152671j693383
578C82687988q97369N0049Q96263J438904J611137J490212J233787R89189Q29315P41959
588C91071434O65169N34210L11775n684l98483q33397j267929j656532j963234k179795
598C84277534k334518k477570k642402k799034k834587k580491j887817p18460P97272
607C66799927K376823L677979M432106M552345M159241L512459K882499K434998K184944
616C97013321K036171J870041J617965J278573Q81080M40293n1384n85061j086158
$$ plain form
625 403414841 402007484 400615730 399641228 399387550 399911461 400983315 402184982 403095398 403459473
634 403459473 403255386 402642403 401841736 401032257 400308304 399697800 399198990 398801308 398482857 398203659
644 398203659 397908249 397537498 397035866 396352348 395452309 394350357 393153419 392061882 391292152 390933189
654 390933189 390830116 390603828 389852257 388438988 386678505 385248032 384821243 385620384 387182274
663 387182274 388530159 388695030 387286720 384758644 382186966 380686493 380814018 382307014 384284363
672 384284363 385747948 386061783 385147476 383349342 381135063 378858948 376713409 374826088 373361320
681 373361320 372516098 372417946 373025093 374132309 375491676 376962700 378578644 380479546 382761955
690 382761955 385353661 387999840 390365028 392182312 393355331 393964920 394193153 394220200 394151688 394001312
$$ packed form
625D03414841j407357j391754r74502k53678N23911J071854J201667R10416L64075
634D03459473k04087o12983q00667q09479p23953o10504m98810l97682l18451k79198
644C98203659k95410l70751n01632o83518r00039j101952j196938j091537p69730l58963
654C90933189j03073k26288p51571j413269j760483j430473m26789P99141J561890
663C87182274J347885J64871j408310k528076k571678j500473J27525J492996J977349
672C84284363J463585L13835r14307j798134k214279k276115k145539j887321j464768
681C73361320q45222r8152O07147J107216J359367J471024J615944J900902K282409
690C82761955K591706K646179K365188J817284J173019O09589K28233K7047o8512j50376
$$ plain form
700 394001312 393720551 393250198 392571106 391734581 390865936 390134850 389702187 389661980 390007210 390638161
710 390638161 391409950 392192535 392909431 393536491 394067307 394474487 394693832 394643059 394261398 393547058
720 393547058 392572517 391473274 390419502 389579544 389081688 388978844 389220772 389648972 390028877 390118599
730 390118599 389755020 388916016 387725868 386395264 385125694 384030380 383113365 382310638 381556854
739 381556854 380823708 380098534 379320717 378330612 376887207 374767189 371898613 368449364 364805832
748 364805832 361438370 358717422 356774178 355474663 354511948 353558731 352397575 350971184 349346466
757 349346466 347632484 345904045 344165077 342353630 340369835 338106270 335476913 332444534 329049072
766 329049072 325424232 321781578 318349113 315276127 312542915 309923210 307033730 303465557 298949852
$$ packed form
700C94001312k80761m70353o79092q36525q68645p31086m32663m0207L45230O30951
710C90638161P71789P82585P16896O27060N30816M07180K19345n0773l81661p14340
720C93547058r74541j099243j053772q39958m97856j02844K41928M28200L79905Q9722
730C90118599l63579q39004j190148j330604j269570j095314r17015q02727p53784
739C81556854p33146p25174p77817r90105j443405k120018k868576l449249l643532
748C64805832l367462k720948j943244j299515r62715r53217j161156j426391j624718
757C49346466j713982j728439j738968j811447j983795k263565k629357l032379l395462
766C29049072l624840l642654l432465l072986k733212k619705k889480l568173m515705
$$ plain form
775 298949852 293489914 287403851 281260452 275738792 271466198 268891048 268216724 269392776 272144852
784 272144852 276026230 280488110 284974098 289029446 292400761 295085716 297303295 299387741 301645737
793 301645737 304236870 307127647 310131474 313008232 315570965 317750568 319596939 321227264 322757874
802 322757874 324258499 325749283 327236824 328758469 330400429 332269020 334427948 336838799 339350319
811 339350319 341755066 343891754 345735283 347417793 349161263 351155281 353453407 355946960 358432465
820 358432465 360726509 362756767 364577217 366309052 368054581 369840698 371621056 373316612 374853554
829 374853554 376168594 377187576 377811356 377940216 377533646 376670456 375562248 374502335 373771629
838 373771629 373552856 373895912 374745331 375998878 377558708 379347725 381295700 383321915 385333748
$$ packed form
775B98949852n459938o086063o143399n521660m272594k575150o74324J176052K752076
784B72144852L881378M461880M485988M055348L371315K684955K217579K084446K257996
793C01645737K591133K890777L003827K876758K562733K179603J846371J630325J530610
802C22757874J500625J490784J487541J521645J641960J868591K158928K410851K511520
811C39350319K404747K136688J843529J682510J743470J994018K298126K493553K485505
820C58432465K294044K030258J820450J731835J745529J786117J780358J695556J536942
829C74853554J315040J018982O23780J28860m06570q63190j108208j059913p30706
838C73771629k18773L43056Q49419J253547J559830J789017J947975K026215K011833
$$ plain form
847 385333748 387244644 388994026 390552254 391906548 393041229 393927994 394528847 394801178 394692497
856 394692497 394128189 393015060 391282845 388966141 386285324 383670654 381684494 380852051 381469307
865 381469307 383483353 386509857 389984207 393369904 396320992 398729668 400655479 402203445 403431625
874 403431625 404338570 404920349 405241547 405462837 405801697 406450081 407500000 408916740 410569038 412292061
884 412292061 413947792 415455551 416793175 417977371 419042168 420020676 420932198 421774635 422524109
893 422524109 423147011 423621712 423959656 424211235 424447403 424725761 425059204 425407867 425701714 425880280
903 425880280 425926781 425875511 425789413 425726547 425714188 425748253 425812798 425902023 426027489 426206169 426437798
914 426437798 426692276 426916656 427061081 427106781 427079964 427040520 427052727 427151337 427321587 427500839 427600288
$$ packed form
847C85333748J910896J749382J558228J354294J134681Q86765O00853K72331j08681
856C94692497n64308j113129j732215k316704k680817k614670j986160q32443O17256
865C81469307K014046L026504L474350L385697K951088K408676J925811J547966J228180
874D03431625R06945N81779L21198K21290L38860O48384J049919J416740J652298J723023
884D12292061J655731J507759J337624J184196J064797R78508R11522Q42437P49474
893D22524109O22902M74701L37944K51579K36168K78358L33443L48663K93847J78566
903D25880280M6501n1270q6098o2866j2359L4065O4545Q9225J25466J78680K31629
914D26437798K54478K24380J44425M5700k6817l9444J2207R8610J70250J79252R9449
$$ plain form
925 427600288 427538834 427273865 426819115 426242905 425647011 425132103 424762650 424541931 424409294 424260979
935 424260979 423986206 423507004 422805138 421926346 420961304 420008202 419133797 418344269 417579575 416734009
945 416734009 415696869 414400253 412855339 411163712 409499054 408065605 407046280 406559753 406636009
954 406636009 407217789 408184280 409387665 410690498 411991196 413230095 414378166 415416260 416319847
963 416319847 417059288 417614174 417991982 418234253 418402710 418551826 418703117 418838387 418915787 418898354
973 418898354 418775215 418564148 418293724 417981300 417620392 417186203 416652069 416007004 415264130 414458542
983 414458542 413639069 412856522 412150116 411532402 410975342 410408401 409733543 408857536 407726860 406345177
993 406345177 404764252 403051453 401254539 399385033 397425499 395350189 393136444 390752945 388130302
$$ packed form
925D27600288o1454k64969m54750n76210n95894n14908l69453k20719j32637j48315
935D24260979k74773m79202p01866q78792r65042r53102q74405p89528p64694q45566
945D16734009j037140j296616j544914j691627j664658j433449j019325m86527P6256
954D06636009N81780R66491J203385J302833J300698J238899J148071J038094R03587
963D16319847P39441N54886L77808K42271J68457J49116J51291J35270P7400j7433
973D18898354j23139k11067k70424l12424l60908m34189n34134o45065p42874q05588
983D14458542q19473p82547p06406o17714n57060n66941o74858q76007j130676j381683
993D06345177j580925j712799j796914j869506j959534k075310k213745k383499k622643
$$ plain form
1002 388130302 385137558 381591988 377315521 372227631 366442757 360332489 354518700 349783134 346905365
1011 346905365 346463127 348655739 353209190 359408646 366260986 372741089 378038483 381720314 383761635
1020 383761635 384450912 384231491 383550415 382768822 382139435 381824532 381915054 382432785 383320961 384445572
1030 384445572 385621910 386662331 387423668 387833595 387888985 387633324 387132149 386457100 385677757 384855461
1040 384855461 384034576 383233643 382444687 381645622 380819664 379970703 379123764 378310738 377549744 376831932
1050 376831932 376122894 375373116 374529991 373542671 372362213 370942650 369251213 367282143 365066223
1059 365066223 362663803 360139809 357530823 354820442 351936111 348770561 345217209 341203384 336707916
1068 336707916 331755829 326391411 320640030 314472218 307789803 300445919 292301140 283298016 273520374
$$ packed form
1002C88130302k992744l545570m276467n087890n784874o110268n813789m735566k877769
1011C46905365m42238K192612M553451O199456O852340O480103N297394L681831K041321
1020C83761635O89277k19421o81076p81593o29387l14903R0522N17731Q88176J124611
1030C84445572J176338J040421P61337M09927N5390k55661n01175o75049p79343q22296
1040C84855461q20885q00933p88956p99065q25958q48961q46939q13026p60994p17812
1050C76831932p09038p49778q43125r87320j180458j419563j691437j969070k215920
1059C65066223k402420k523994k608986k710381k884331l165550l553352m013825m495468
1068C36707916m952087n364418n751381o167812o682415p343884q144779r003124r777642
$$ plain form
1077 273520374 263205662 252696037 242349968 232459145 223216019 214747505 207186890 200727806
1085 200727806 195614605 192064762 190165920 189813709 190731945 192568398 195011787 197869015 201072521
1094 201072521 204637260 208615780 213089104 218187275 224100513 231034927 239109612 248241692 258092327
1103 258092327 268125343 277767334 286597061 294471569 301526337 308056545 314345741 320530090
1111 320530090 326558418 332253036 337425919 341987572 345997505 349643555 353168678 356782837 360597305
1120 360597305 364601059 368683701 372689476 376477547 379964790 383133240 386005287 388601532 390906677
1129 390906677 392862930 394395103 395454178 396054268 396282043 396271172 396152077 395999527 395802193 395468063
1139 395468063 394864082 393875504 392461853 390688286 388721237 386789360 385125237 383907089 383220863
$$ packed form
1077B73520374j0314712j0509625j0346069r890823r243126q468514p560615o459084
1085B00727806n113201l549843j898842l52211R18236J836453K443389K857228L203506
1094B01072521L564739L978520M473324N098171N913238O934414Q074685R132080R850635
1103B58092327J0033016R641991Q829727P874508P054768O530208O289196O184349
1111C20530090O028328N694618N172883M561653M009933L646050L525123L614159L814468
1120C60597305M003754M082642M005775L788071L487243L168450K872047K596245K305145
1129C90906677J956253J532173J059075O00090K27775j0871j19095j52550j97334l34130
1139C95468063o03981r88578j413651j773567j967049j931877j664123j218148o86226
$$ plain form
1148 383220863 383050957 383297958 383811798 384425278 384980698 385345345 385422363 385157661 384541626 383598862
1158 383598862 382360573 380824089 378918839 376502457 373406372 369524994 364919777 359888725 354959335
1167 354959335 350790863 348008690 347024307 347903557 350327187 353656502 357086372 359844513 361385536
1176 361385536 361530724 360509644 358885994 357376595 356618843 356965752 358387222 360516968 362820320
1185 362820320 364803009 366165161 366839256 366915245 366513748 365686607 364393997 362553139 360111809
1194 360111809 357094193 353590851 349709167 345521011 341039200 336232262 331060333 325504761 319577179
1203 319577179 313306141 306714897 299803734 292544308 284885921 276769276 268142262 258975639 249278450
1212 249278450 239114895 228626862 218062248 207799931 198352413 190320396 184288273 180676117
$$ packed form
1148C83220863j69906K47001N13840O13480N55420L64647P7018k64702o16035r42764
1158C83598862j238289j536484j905250k416382l096085l881378m605217n031052m929390
1167C54959335m168472k782173r84383Q79250K423630L329315L429870K758141J541023
1176C61385536J45188j021080j623650j509399p57752L46909J421470K129746K303352
1185C62820320J982689J362152O74095P5989m01497q27141j292610j840858k441330
1194C60111809l017616l503342l881684m188156m481811m806938n171929n555572n927582
1203C19577179o271038o591244o911163p259426p658387q116645q627014r166623r697189
1212B49278450j0163555j0488033j0564614j0262317r447518q032017o032123l612156
$$ plain form
1220 180676117 179597626 180789127 183658924 187458439 191519814 195467319 199316654 203422813 208302803
1229 208302803 214410477 221954556 230823727 240633202 250856800 260983906 270641098 279643078
1237 279643078 287972412 295713234 302978039 309858341 316411266 322672272 328671722 334435501 339966125
1246 339966125 345219269 350095100 354457779 358177071 361168404 363410034 364927864 365760040 365926933
1255 365926933 365424728 364248123 362424927 360043755 357259407 354279022 351337395 348671112 346491280
1264 346491280 344950867 344106674 343887100 344084663 344388161 344450035 343967018 342740746 340696106 337855606
1274 337855606 334288025 330061760 325222168 319800739 313845100 307453461 300796471 294116058 287698708
1283 287698708 281827431 276727619 272526989 269246502 266830940 265208817 264356499 264339733 265312958
$$ packed form
1220A80676117j078491J191501K869797L799515M061375L947505L849335M106159M879990
1229B08302803O107674P544079Q869171R809475J0223598J0127106R657192R001980
1237B79643078Q329334P740822P264805O880302O552925O261006N999450N763779N530624
1246C39966125N253144M875831M362679L719292K991333K241630J517830Q32176J66893
1255C65926933n02205j176605j823196k381172k784348k980385k941627k666283k179832
1264C46491280j540413q44193k19574J97563L03498O1874m83017j226272k044640k840500
1274C37855606l567581m226265m839592n421429n955639o391639o656990o680413o417350
1283B87698708n871277n099812m200630l280487k415562j622123q52318j6766R73225
$$ plain form
1292 265312958 267476578 271006660 275978069 282302723 289700356 297714825 305782986 313346863 319981098
1301 319981098 325488205 329919243 333504143 336517410 339142113 341394386 343139420 344179955 344361267
1310 344361267 343634453 342054787 339731064 336770706 333259163 329284058 324986420 320605659 316491642
1319 316491642 313075199 310804348 310063210 311093292 313937817 318427200 324214020 330851479 337891197
1328 337891197 344965668 351827660 358336868 364411049 369971848 374918709 379142914 382574348 385233307
1337 385233307 387253418 388856316 390280457 391692276 393123436 394468346 395547447 396205025 396391029
1346 396391029 396181412 395731850 395195084 394655800 394116440 393532524 392860718 392077370 391150932 389986877
1356 389986877 388384476 386042023 382622299 377864380 371714363 364435387 356654396 349302635 343429909
$$ packed form
1292B65312958K163620L530082M971409O324654P397633Q014469Q068161P563877O634235
1301C19981098N507107M431038L584900L013267K624703K252273J745034J040535J81312
1310C44361267p26814j579666k323723k960358l511543l975105m297638m380761m114017
1319C16491642l416443k270851p41138J030082K844525M489383N786820O637459P039718
1328C37891197P074471O861992O509208O074181N560799M946861M224205L431434K658959
1337C85233307K020111J602898J424141J411819J431160J344910J079101O57578J86004
1346C96391029k09617m49562n36766n39284n39360n83916o71806p83348r26438j164055
1356C89986877j602401k342453l419724m757919o150017p278976p780991p351761n872726
$$ plain form
1365 343429909 339921913 339210129 341099930 344812355 349240303 353311462 356290817 357892380 358185883
1374 358185883 357400703 355770187 353501701 350846481 348163414 345881958 344360161 343727074 343826103
1383 343826103 344310341 344836082 345234032 345553741 345966454 346601562 347426453 348240891 348776474 348834686
1393 348834686 348383484 347567444 346638412 345844040 345325241 345063286 344895935 344595909 343975868 342967987
1403 342967987 341635818 340112305 338508415 336854057 335113907 333259201 331333122 329444580 327683182
1412 327683182 326013908 324241714 322094765 319392986 316201439 312867622 309909725 307809505 306820450
1421 306820450 306882839 307678261 308783722 309849224 310724640 311489563 312376823 313619308 315284100
1430 315284100 317177315 318883858 319945526 320093575 319408627 318302765 317321720 316878529 317072163
$$ packed form
1365C43429909l507996p11784J889801L712425M427948M071159K979355J601563K93503
1374C58185883p85180j630516k268486k655220k683067k281456j521797o33087R9029
1383C43826103M84238N25741L97950L19709M12713O35108Q24891Q14438N35583N8212
1393C48834686m51202q16040r29032p94372n18799k61955j67351l00026o20041j007881
1403C42967987j332169j523513j603890j654358j740150j854706j926079j888542j761398
1412C27683182j669274j772194k146949k701779l191547l333817k957897k100220r89055
1421C06820450O2389P95422J105461J065502Q75416P64923Q87260J242485J664792
1430C15284100J893215J706543J061668J48049o84948j105862r81045m43191J93634
$$ plain form
1439 317072163 317688389 318357258 318744907 318659916 318044834 316921730 315382900 313640652 312049809
1448 312049809 310996590 310644112 310677280 310265541 308367290 304277954 298118668 290943203 284343243
1457 284343243 279740124 277762852 278067989 279689560 281681767 283650074 285861454 288908367 293175220
1466 293175220 298461952 303987656 308750153 312006283 313591614 313920269 313701153 313554649 313739281
1475 313739281 314109135 314285126 313914070 312862415 311245823 309294720 307152004 304735699 301766262
1484 301766262 297965736 293334084 288352928 283985081 281432705 281729889 285340862 291945171 300526924
1493 300526924 309756947 318516922 326329193 333471603 340689392 348623161 357247581 365655060 372360764
1502 372360764 376018677 376173515 373613777 370089722 367526703 367163849 369094086 372428551 375926666
$$ packed form
1439C17072163O16226O68869L87649q4991o15082j123104j538830j742248j590843
1448C12049809j053219l52478L3168m11739j898251m089336o159286p175465o599960
1457B84343243m603119j977272L05137J621571J992207J968307K211380L046913M266853
1466B93175220N286732N525704M762497L256130J585331L28655k19116j46504J84632
1475C13739281L69854J75991l71056j051655j616592j951103k142716k416305k969437
1484C01766262l800526m631652m981156m367847k552376K97184L610973O604309Q581753
1493C00526924R230023Q759975P812271P142410P217789P933769Q624420Q407479O705704
1502C72360764L657913J54838k559738l524055k563019l62854J930237L334465L498115
$$ plain form
1511 375926666 378673248 380408058 381388664 381982994 382327843 382273788 381588593 380207977 378330879
1520 378330879 376320572 374531975 373210411 372500839 372483444 373142471 374276886 375475159 376265602
1529 376265602 376406212 376113930 376013222 376754303 378512764 380713692 382218399 381906242 379315491
1538 379315491 374947281 370051842 366037979 363858299 363692398 365032997 367044678 368963470 370363121
1547 370363121 371235466 371916161 372895546 374546623 376839104 379172707 380480309 379648972 376110878
1556 376110878 370293503 363630142 358045692 355138054 355468788 358339539 362161789 365211487 366368065
1565 366368065 365481262 363233871 360636559 358455353 356868210 355497894 353768501 351367416 348549652
1574 348549652 346105690 344994774 345838318 348552666 352338448 356036415 358651924 359750938 359525223
$$ packed form
1511C75926666K746582J734810R80606N94330L44849n4055o85195j380616j877098
1520C78330879k010307j788597j321564p09572j7395O59027J134415J198273P90443
1529C76265602J40610k92282j00708P41081J758461K200928J504707l12157k590751
1538C79315491m368210m895439m013863k179680j65901J340599K011681J918792J399651
1547C70363121Q72345O80695R79385J651077K292481K333603J307602q31337l538094
1556C76110878n817375o663361n584450k907638L30734K870751L822250L049698J156578
1565C66368065q86803k247391k597312k181206j587143j370316j729393k401085k817764
1574C48549652k443962j110916Q43544K714348L785782L697967K615509J099014k25715
$$ plain form
1583 359525223 358535957 357336006 356216736 355196304 354186554 353164978 352220497 351468544 350943718
1592 350943718 350571709 350234337 349851723 349401855 348869591 348196564 347299728 346148758 344819679 343448029
1602 343448029 342102318 340690575 339012756 336952896 334663162 332560005 331075630 330308266 329831161
1611 329831161 328841820 326599197 322880745 318151398 313320618 309237137 306240501 304037170 301941013
1620 301941013 299290257 295773411 291502399 286861763 282285099 278097801 274459877 271352196 268550930
1629 268550930 265605297 261895027 256819553 250069427 241837196 232818108 223957443 216050930 209401970
1638 209401970 203717136 198296776 192424126 185762386 178573112 171659012 166061687 162649632 161780968
1647 161780968 163196316 166200066 170051384 174371872 179349213 185603905 193768673 204002590
$$ packed form
1583C59525223r89266j199951j119270j020432j009750j021576r44481p51953n24826
1592C50943718l72009l37372l82614m49868n32264o73027q96836j150970j329079j371650
1602C43448029j345711j411743j677819k059860k289734k103157j484375p67364m77105
1611C29831161r89341k242623l718452m729347m830780m083481k996636k203331k096157
1620C01941013k650756l516846m271012m640636m576664m187298l637924l107681k801266
1629B68550930k945633l710270n075474o750126q232231r019088q860665p906513o648960
1638B09401970n684834n420360n872650o661740p189274o914100n597325l412055q68664
1647A61780968J415348L003750L851318M320488M977341O254692Q164768J0233917
$$ plain form
1655 204002590 215724392 227744408 238745499 247852592 254963665 260651665 265707474 270612526
1663 270612526 275267906 279131107 281645031 282655602 282537060 281954155 281446857 281139927 280783329
1672 280783329 280082798 279062347 278170586 278018112 278905258 280461864 281671391 281307983 278548546
1681 278548546 273403378 266717358 259750633 253585434 248680782 244777279 241139221 236947765 231621590
1690 231621590 224940243 216982155 207984238 198235130 188048458 177795143 167937183 159013519
1698 159013519 151563005 146003990 142511711 140946016 140870905 141680431 142798929 143878345 144902411
1707 144902411 146138315 147950621 150563602 153889523 157507591 160803413 163196545 164348125 164257126
1716 164257126 163217411 161673679 160058517 158692055 157789631 157554798 158288593 160422897 164422340
$$ packed form
1655B04002590J1721802J2020016J1001091R107093P111073N688000N055809M905052
1663B70612526M655380L863201K513924J010571j18542n82905n07298l06930l56598
1672B80783329p00531j020451q91761j52474Q87146J556606J209527l63408k759437
1681B78548546n145168o686020o966725o165199m904652l903503l638058m191456n326175
1690B31621590o681347p958088q997917r749108j0186672j0253315r857960q923664
1698A59013519p450514n559015l492279j565695p5111Q09526J118498J079416J024066
1707A44902411J235904J812306K612981L325921L618068L295822K393132J151580r0999
1716A64257126j039715j543732j615162j366462r02424k34833P33795K134304L999443
$$ plain form
1725 164422340 170579128 178805218 188557110 198975163 209199696 218709373 227491779 235940781
1733 235940781 244533596 253478508 262547932 271196861 278887062 285408592 290995636 296168423 301408825
1742 301408825 306873512 312315102 317244949 321224518 324113045 326141472 327796440 329599915 331902962
1751 331902962 334783821 338069000 341441307 344573174 347235107 349350395 350994606 352358284 353693810
1760 353693810 355261650 357278023 359853325 362925529 366213531 369239655 371457176 372463608 372211494
1769 372211494 371094398 369831581 369180565 369618034 371156883 373396645 375760612 377771606 379211273
1778 379211273 380108948 380625725 380951042 381278419 381827202 382819252 384364662 386313324 388208008
1787 388208008 389437866 389551773 388557129 386994629 385709114 385424995 386373825 388193817 390154228
$$ packed form
1725A64422340O156788Q226090R751892J0418053J0224533R509677Q782406Q449002
1733B35940781Q592815Q944912R069424Q648929P690201O521530N587044N172787N240402
1742C01408825N464687N441590M929847L979569K888527K028427J654968J803475K303047
1751C31902962K880859L285179L372307L131867K661933K115288J644211J363678J335526
1760C53693810J567840K016373K575302L072204L288002L026124K217521J006432k52114
1769C72211494j117096j262817o51016M37469J538849K239762K363967K010994J439667
1778C79211273Q97675N16777L25317L27377N48783R92050J545410J948662J894684
1787C88208008J229858J13907r94644j562500j285515k84119R48830J819992J960411
$$ plain form
1796 390154228 391559906 392096214 391930962 391552696 391473312 391973038 393006668 394280128 395422630
1805 395422630 396158257 396406326 396287842 396049194 395939941 396099892 396507874 397020798 397478676 397810440
1815 397810440 398069496 398376656 398816757 399370880 399934998 400403671 400742989 400984650 401149445 401176605
1825 401176605 400941772 400368118 399547539 398757477 398332596 398468018 399100418 399966583 400804825 401545525
1835 401545525 402335968 403366013 404624252 405779343 406305199 405789413 404224510 402080460 400099640
1844 400099640 398936119 398857498 399673195 400902328 402051239 402829132 403204727 403315239 403324203 403322830
1854 403322830 403315697 403271217 403187103 403126755 403208427 403548279 404180260 404992485 405721893 406035538 405679817
1865 405679817 404628181 403139458 401674042 400695648 400463829 400930061 401795959 402688484 403342209
$$ packed form
1796C90154228J405678N36308j65252l78266p9384M99726J033630J273460J142502
1805C95422630P35627K48069j18484k38648j09253J59951M07982N12924M57878L31764
1815C97810440K59056L07160M40101N54123N64118M68673L39318K41661J64795K7160
1825D01176605k34833n73654q20579p90062m24881J35422O32400Q66165Q38242P40700
1835D01545525P90443J030045J258239J155091N25856n15786j564903k144050j980820
1844D00099640j163521p8621Q15697J229133J148911P77893L75595J10512Q964j373
1854D03322830p133m4480q4114o0348Q1672L39852O31981Q12225P29408L13645l55721
1865D05679817j051636j488723j465416r78394k31819M66232Q65898Q92525O53725
$$ plain form
1874 403342209 403684654 403796959 403802109 403773117 403715820 403613853 403477478 403345871 403244133 403139381 402944794
1885 402944794 402578087 402031364 401396408 400819778 400418358 400213852 400131607 400060272 399925232 399722366
1895 399722366 399495926 399286385 399095917 398898354 398678627 398460999 398294601 398204460 398151016 398042030
1905 398042030 397801170 397448616 397130203 397058144 397388268 398109665 399020767 399817810 400244408 400217361
1915 400217361 399852676 399383240 399026527 398882751 398918915 399030304 399127884 399190445 399257164 399380074 399576721
1926 399576721 399815826 400038033 400191460 400258026 400260201 400250511 400293350 400441666 400711441 401060753 401387482
1937 401387482 401557770 401462860 401078720 400493050 399879341 399423981 399245377 399347343 399630890 399952927
1947 399952927 400195770 400308990 400310059 400250015 400173721 400097618 400012589 399905090 399778900 399662971 399600563
$$ packed form
1874D03342209L42445J12305N150k8992n7297j01967j36375j31607j01738j04752j94587
1885D02944794l66707n46723o34956n76630m01420k04506q2245p1335j35040k02866
1895C99722366k26440k09541j90468j97563k19727k17628j66398r0141n3444j08986
1905C98042030k40860l52554l18413p2059L30124P21397R11102P97043M26598k7047
1915D00217361l64685m69436l56713j43776L6164J11389R7580O2561O6719J22910J96647
1926C99576721K39105K22207J53427O6566K175r690M2839J48316K69775L49312L26729
1937D01387482J70288r4910l84140n85670o13709m55360j78604J01966K83547L22037
1947C99952927K42843J13220J069o0044p6294p6103q5029j07499j26190j15929o2408
$$ plain form
1958 399600563 399623718 399728317 399863930 399949646 399910088 399716759 399408875 399081726 398844299 398768425 398858795
1969 398858795 399057732 399279747 399453850 399548302 399569626 399542809 399490509 399424286 399347763 399264488 399182854
1980 399182854 399113579 399065971 399043922 399044418 399054451 399049759 398997688 398867722 398648453 398360481 398053169 397784424
1992 397784424 397593918 397485008 397430000 397393074 397356300 397329483 397337074 397391701 397474327 397534294 397512016 397370453
2004 397370453 397118416 396813354 396541939 396387177 396393852 396546707 396770477 396954231 396993713 396834221
2014 396834221 396494522 396058578 395637283 395319824 395139732 395072517 395062523 395059814 395042992 395017548 394996490
2025 394996490 394980164 394952202 394893265 394799690 394692383 394607620 394574356 394594078 394634705 394644775 394577560 394413261
2037 394413261 394167824 393884277 393614235 393397865 393252411 393173447 393144798 393149948 393178215 393221207 393265076
$$ packed form
1958C99600563K3155J04599J35613Q5716l9558j93329l07884l27149k37427p5874R0370
1969C98858795J98937K22015J74103R4452K1324k6817n2300o6223p6523q3275q1634
1980C99182854o9275m7608k2049M96J0033m692n2071j29966k19269k87972l07312k68745
1992C97784424j90506j08910n5008l6926l6774k6817P591N4627Q2626N9967k2278j41563
2004C97370453k52037l05062k71415j54762O675J52855K23770J83754L9482j59492
2014C96834221l39699m35944m21295l17459j80092o7215r994k709j6822k5444k1058
2025C94996490j6326k7962n8937r3575j07307q4763l3264J9722M0627J0070o7215j64299
2037C94413261k45437k83547k70042k16370j45454p8964k8649N150K8267M2992M3869
$$ plain form
2048 393265076 393283577 393241882 393110275 392882004 392583923 392272491 392012367 391848640 391786003 391785927 391785545 391727104
2060 391727104 391585464 391378517 391156578 390976067 390871925 390841904 390850487 390849380 390802269 390700874 390565491
2071 390565491 390430603 390325279 390260506 390228310 390210915 390193214 390171242 390152512 390151482 390183334 390258713 390380135
2083 390380135 390537834 390708122 390854683 390937576 390926323 390813522 390619850 390388298 390168495 389999313
2093 389999313 389898033 389859238 389862213 389880638 389890823 389875298 389824982 389739342 389627419 389506073 389396477
2104 389396477 389318848 389286728 389304314 389365196 389452438 389540253 389596481 389590302 389502945 389338188 389127655 388923225
2116 388923225 388778954 388728485 388769341 388863525 388953705 388988953 388946381 388838425 388703270 388585625 388515205
2127 388515205 388496132 388507271 388513832 388482246 388393211 388248329 388068810 387888184 387740479 387648392 387615356
$$ packed form
2048C93265076J8501m1695j31607k28271k98081l11432k60124j63727o2637p6l82n8441
2060C91727104j41640k06947k21939j80511j04142l0021Q583j107m7111j01395j35383
2071C90565491j34888j05324o4773l2196j7395j7701k1972j8730j030L1852P5379J21422
2083C90380135J57699J70288J46561Q2893j1253j12801j93672k31552k19803j69182
2093C89999313j01280l8795K975J8425J0185j5525n0316q5640j11923j21346j09596
2104C89396477p7629l2120J7586O0882Q7242Q7815N6228o179q7357j64757k10533k04430
2116C88923225j44271n0469M0856R4184R0180L5248m2572j07956j35155j17645p0420
2127C88515205j9073J1139O561l1586q9035j44882j79519j80626j47705r2087l3036
$$ plain form
2138 387615356 387625999 387654037 387675400 387679482 387671814 387667542 387677345 387695656 387698555 387654037 387539597 387357750
2150 387357750 387140007 386935005 386786613 386713142 386698685 386702576 386681175 386611061 386500435 386381950 386291466
2161 386291466 386244545 386225471 386194382 386110306 385956001 385749092 385535316 385365486 385271111 385251503 385278091
2172 385278091 385311546 385320435 385291214 385227928 385143127 385049477 384955444 384864960 384779129 384696655 384613991 384526062
2184 384526062 384429092 384323502 384215012 384111252 384019203 383943329 383887482 383857956 383862381 383903694 383970413
2195 383970413 384032784 384049339 383984299 383828354 383609314 383385201 383220406 383157539 383197937 383302841 383412247
2206 383412247 383472557 383457947 383376350 383258362 383137589 383033333 382943687 382852020 382740707 382604103 382452850
2217 382452850 382307396 382186775 382098351 382035866 381986275 381938248 381888046 381838303 381790466 381739197 381672363
$$ packed form
2138C87615356J0643K8038K1363M082p668m272R803J8311K899m4518j14440j81847
2150C87357750k17743k05002j48392p3471j4457L891k1401p0114j10626j18485r0484
2161C86291466m6921j9074l1089q4076j54305k06909k13776j69830r4375j9608K6588
2172C85278091L3455Q889k9221o3286q4801r3650r4033r0484q5831q2474q2664q7929
2184C84526062r6970j05590j08490j03760r2049p5874n5847k9526M425M1313O6719
2195C83970413O2371J6555o5040j55945k19040k24113j64795o2867M0398J04904J09406
2206C83412247O0310j4610q1597j17988j20773j04256q9646r1667j11313j36604j51253
2217C82452850j45454j20621q8424o2485m9591m8027n0202m9743m7837n1269o6834
$$ plain form
2228 381672363 381577682 381452179 381306534 381162605 381043854 380964966 380926971 380918198 380920181 380914497 380886765 380828819
2240 380828819 380739861 380626869 380504074 380389862 380301781 380250282 380235481 380247765 380272598 380295868 380308266
2251 380308266 380306358 380291328 380267181 380238419 380208893 380179710 380147057 380101089 380027237 379910851 379743729 379529724
2263 379529724 379286728 379042435 378825912 378658562 378548012 378488121 378463745 378457031 378452187 378437195 378403435
2274 378403435 378346977 378272018 378193092 378133583 378117142 378155632 378240547 378344193 378433266 378484421 378495216 378481445
2286 378481445 378463783 378453102 378445663 378428192 378389320 378328018 378252640 378175125 378107147 378062134 378061752 378136482
2298 378136482 378317833 378622475 379038315 379522400 380009537 380428429 380715675 380826416 380745392 380500412
2308 380500412 380174408 379902039 379838104 380101013 380711174 381556625 382409935 382997246 383095894 382619781
$$ packed form
2228C81672363r4681j25503j45645j43929j18751p8888l7995q773J983n684k7732n7946
2240C80828819q8958j12992j22795j14212q8081n1499j4801J2284K4833K3270J2398
2251C80308266j908j5030k4147k8762k9526k9183l2653m5968p3852j16386j67122k14005
2263C79529724k42996k44293k16523j67350j10550n9891k4376o714m844j4992l3760
2274C78403435n6458p4959p8926n9509j6441L8490Q4915J03646Q9073N1155J0795j3771
2286C78481445j7662j0681p439j7471l8872o1302p5378p7515o7978m5013l82P4730
2298C78136482J81351L04642M15840M84085M87137M18892K87246J10741q1024k44980
2308C80500412l26004k72369o3935K62909O10161Q45451Q53310N87311R8648m76113
$$ plain form
2318 382619781 381655846 380435600 379248047 378325424 377748184 377411423 377075462 376484795 375501366 374180832
2328 374180832 372744942 371459770 370492439 369833527 369334259 368822212 368198624 367433014 366455879 365052071
2338 365052071 362892265 359757805 355862465 352053947 349691086 350163612 354246788 361625748 370871124
2347 370871124 379915810 386813965 390410385 390614166 388200684 384312630 379954834 375716400 371778831
2356 371778831 368101578 364617577 361327133 358284683 355546913 353144531 351093636 349414444 348123894
2365 348123894 347203102 346571960 346105461 345690346 345288239 344961624 344843750 345073395 345734901 346834679
2375 346834679 348318214 350104408 352110405 354256935 356459427 358622780 360647964 362448082 363965263
2384 363965263 365179672 366108742 366799088 367313843 367716064 368052635 368342628 368578148 368736725 368802834
$$ packed form
2318C82619781r63935j220246j187553r22623n77240l36761l35961n90667r83429j320534
2328C74180832j435890j285172r67331o58912m99268n12047o23588p65610r77135j403808
2338C65052071k159806l134460l895340l808518k362861M72526M083176P378960R245376
2347C70871124R044686O898155L596420K03781k413482l888054m357796m238434l937569
2356C71778831l677253l484001l290444l042450k737770k402382k050895j679192j290550
2365C48123894r20792o31142m66499m15115m02107l26615j17874K29645O61506J099778
2375C46834679J483535J786194K005997K146530K202492K163353K025184J800118J517181
2384C63965263J214409R29070O90346N14755M02221L36571K89993K35520J58577O6109
$$ plain form
2394 368802834 368785172 368719444 368656273 368640518 368693466 368807106 368951073 369086647 369180717 369215088 369190178
2405 369190178 369123230 369043350 368981819 368961945 368989830 369051971 369120026 369161873 369153862 369088058 368972740 368826599
2417 368826599 368670654 368520584 368384361 368262634 368152390 368050880 367957039 367871857 367795525 367725334 367655563
2428 367655563 367578049 367484436 367366829 367219162 367037430 366822777 366584358 366341019 366118164 365939941
2438 365939941 365820465 365757866 365735970 365731468 365723305 365697250 365647011 365572853 365481453 365389137 365321808 365309029
2450 365309029 365369186 365494881 365645599 365758781 365774536 365662804 365438271 365152626 364870682 364640999
2460 364640999 364480286 364375877 364302063 364237938 364175682 364115219 364054108 363980598 363876915 363729973 363541870
2471 363541870 363330765 363122749 362939377 362788620 362664909 362555542 362449303 362339211 362220116 362085724
$$ packed form
2394C68802834j7662o5728o3171j5755N2948J13640J43967J35574R4070L4371k4910
2405C69190178o6948p9880o1531j9874K7885O2141O8055M1847q011o5804j15318j46141
2417C68826599j55945j50070j36223j21727j10244j01510r3841q5182p6332p0191o9771
2428C67655563p7514r3613j17607j47667j81732k14653k38419k43339k22855j78223
2438C65939941j19476o2599k1896m502q163k6055n0239p4158r1400r2316o7329j2779
2450C65309029O0157J25695J50718J13182J5755j11732k24533k85645k81944k29683
2460C64640999j60713j04409p3814o4125o2256o0463o1111p3510j03683j46942j88103
2471C63541870k11105k08016j83372j50757j23711j09367j06239j10092j19095j34392
$$ plain form
2481 362085724 361928520 361746025 361547089 361352196 361184998 361058121 360963516 360874481 360760765 360606918
2491 360606918 360423698 360242195 360095749 359998207 359935112 359870453 359767303 359607735 359401894 359181366
2501 359181366 358983536 358835182 358745689 358709641 358713646 358742218 358778839 358804512 358798981 358745537 358639030 358490982
2513 358490982 358326912 358176422 358060379 357981491 357925949 357872162 357804222 357719688 357629280 357548485 357487564
2524 357487564 357446060 357413521 357375793 357321663 357245598 357147484 357030563 356900368 356764870 356634140 356517487
2535 356517487 356418571 356333275 356251144 356163292 356070633 355987282 355935707 355935402 355991135 356088448 356198235 356288300
2547 356288300 356335945 356334381 356292000 356226654 356156616 356094398 356042213 355991478 355926628 355831337 355696602 355525970
2559 355525970 355335960 355149384 354986115 354855843 354756203 354677467 354608994 354542580 354471169 354384460 354267120
$$ packed form
2481C62085724j57204j82495j98936j94893j67198j26877r4605q9035j13716j53847
2491C60606918j83220j81503j46446r7542o3095o4659j03150j59568k05841k20528
2501C59181366j97830j48354q9493l6048M005K8572L6621K5673n531n3444j06507j48048
2513C58490982j64070j50490j16043p8888n5542n3787o7940q4534r0408q0795o0921
2524C57487564m1504l2539l7728n4130p6065r8114j16921j30195j35498j30730j16653
2535C56517487r8916q5296q2131q7852r2659q3351n1575l05N5733R7313J09787R0065
2547C56288300M7645j564m2381o5346p0038o2218n2185n0735o4850r5291j34735j70632
2559C55525970j90010j86576j63269j30272r9640p8736o8473o6414p1411q6709j17340
$$ plain form
2570 354267120 354103622 353886452 353625221 353347855 353093796 352899437 352784767 352745209 352754173 352773666 352768669
2581 352768669 352719612 352628593 352516899 352414474 352346420 352321472 352327881 352338638 352324219 352264595 352156487
2592 352156487 352011223 351845894 351675110 351506691 351344795 351195679 351071281 350986557 350952110 350966492
2602 350966492 351012688 351061630 351081047 351044273 350937004 350759468 350525703 350260468 349994545 349758835 349576645
2613 349576645 349457588 349394569 349367180 349350014 349321709 349271812 349201889 349121361 349041481 348970642 348913460 348871918
2625 348871918 348846893 348838577 348844681 348859215 348871651 348869019 348839760 348778152 348687096 348578644 348471146 348383102
2637 348383102 348327637 348306885 348311310 348322639 348319893 348285980 348211708 348096313 347947350 347778244 347607689
2648 347607689 347457314 347347183 347288475 347276192 347286797 347284355 347234116 347118568 346947021 346753616 346583519
$$ packed form
2570C54267120j63498k17170k61231k77366k54059j94359j14670l9558Q964J9493m997
2581C52768669m9057r1019j11694j02425o8054k4948O409J0757j4419n9624j08108
2592C52156487j45264j65329j70784j68419j61896j49116j24398q4724l4447J4382
2602C50966492M6196M8942J9417l6774j07269j77536k33765k65235k65923k35710j82190
2613C49576645j19057o3019k7389j7166k8305m9897o9923q0528p9880p0839n7182m1542
2625C48871918k5025q316O104J4534J2436k632k9259o1608r1056j08452j07498q8044
2637C48383102n5465k0752M425J1329k746l3913p4272j15395j48963j69106j70555
2648C47607689j50375j10131n8708j2283J0605k442n0239j15548j71547j93405j70097
$$ plain form
2659 346583519 346474495 346441803 346474342 346542130 346609726 346649780 346649246 346608734 346536407 346440811 346326675 346194458
2671 346194458 346043472 345876999 345704994 345543365 345409012 345311394 345246429 345195541 345133171 345038910 344907761
2682 344907761 344754105 344605179 344488106 344417572 344389725 344385147 344376984 344340096 344256744 344119339 343931808
2693 343931808 343710442 343483124 343284187 343143959 343075714 343069191 343092766 343107719 343086128 343022118 342931175
2704 342931175 342836571 342753906 342681389 342603226 342502136 342372169 342222672 342071457 341931953 341802444 341666756
2715 341666756 341503792 341301994 341069069 340830116 340617142 340453300 340342102 340266380 340197372 340108528
2725 340108528 339986725 339835358 339667549 339494095 339314003 339113426 338874283 338588028 338265839 337939301
2735 337939301 337648849 337427979 337290001 337225342 337208595 337209473 337201691 337164688 337081375 336937904 336727448
$$ packed form
2659C46583519j09024l2692L2539O7788O7596M0054n34m0512p2327r5596j14136j32217
2671C46194458j50986j66473j72005j61629j34353r7618o4965n0888o2370r4261j31149
2682C44907761j53656j48926j17073p0534k7847m578q163l6888q3352j37405j87531
2693C43931808k21366k27318j98937j40228o8245o523K3575J4953k1591o4010r0943
2704C42931175r4604q2665p2517p8163j01090j29967j49497j51215j39504j29509j35688
2715C41666756j62964k01798k32925k38953k12974j63842j11198p5722o9008q8844
2725C40108528j21803j51367j67809j73454j80092k00577k39143k86255l22189l26538
2735C37939301k90452k20870j37978o4659j6747Q78p782l7003q3313j43471k10456
$$ plain form
2746 336727448 336457214 336152649 335851707 335590897 335389900 335243835 335127792 335011520 334874458 334711876
2756 334711876 334530983 334342690 334154701 333972626 333804474 333661652 333553429 333477669 333414650 333332253
2766 333332253 333200035 333004494 332754745 332474709 332187767 331905937 331629181 331356316 331093941 330857048
2776 330857048 330657692 330490990 330330315 330137596 329882965 329560928 329193497 328818436 328472595 328180847
2786 328180847 327955360 327801399 327718582 327697678 327712555 327720985 327678146 327558022 327369156 327153244 326963158
2797 326963158 326834183 326763840 326714325 326634216 326486282 326264648 325994148 325713921 325459099 325248909
2807 325248909 325086098 324963150 324868088 324787254 324707069 324615059 324504128 324375610 324239044 324107323 323989944
2818 323989944 323889809 323804321 323729820 323665886 323613853 323570824 323523750 323449326 323321571 323124161 322860680
$$ packed form
2746C36727448k70234l04565l00942k60810k00997j46065j16043j16272j37062j62582
2756C34711876j80893j88293j87989j82075j68152j42822j08223p5760o3019q2397
2766C33332253j32218j95541k49749k80036k86942k81830k76756k72865k62375k36893
2776C30857048j99356j66702j60675j92719k54631l22037l67431l75061l45841k91748
2786C28180847k25487j53961q2817k0904J4877Q430m2839j20124j88866k15912j90086
2797C26963158j28975p0343m9515q0109j47934k21634k70500k80227k54822k10190
2807C25248909j62811j22948r5062q0834q0185r2010j10931j28518j36566j31721j17379
2818C23989944j00135q5488p4501o3934n2033m3029m7074p4424j27755j97410k63481
$$ plain form
2829 322860680 322556038 322246933 321966400 321730423 321532173 321348457 321152763 320928955 320677719 320413971
2839 320413971 320156097 319914265 319681778 319435844 319144707 318779678 318325596 317785950 317181301 316542416
2849 316542416 315902081 315288620 314722748 314217205 313776417 313395004 313055439 312728329 312377071 311966457
2859 311966457 311472893 310890293 310229874 309514198 308770161 308025017 307305813 306638355 306042042 305520439
2869 305520439 305053425 304598312 304104481 303535652 302887363 302189083 301487236 300818481 300189114 299573612
2879 299573612 298932343 298237171 297488003 296712074 295945892 295214043 294516926 293834496 293141117 292422562
2889 292422562 291683445 290943069 290223866 289537277 288877277 288221378 287541008 286815376 286043491 285249100
2899 285249100 284474888 283766880 283156261 282646008 282210178 281806545 281395912 280958538 280499458 280039711
$$ packed form
2829C22860680l04642l09105k80533k35977j98250j83716j95694k23808k51236k63748
2839C20413971k57874k41832k32487k45934k91137l65029m54082n39646o04649o38885
2849C16542416o40335o13461n65872n05543m40788l81413l39565l27110l51258m10614
2859C11966457m93564n82600o60419p15676p44037p45144p19204o67458n96313n21603
2869C05520439m67014m55113m93831n68829o48289o98280p01847o68755o29367o15502
2879B99573612o41269o95172p49168p75929p66182p31849o97117o82430o93379p18555
2889B92422562p39117p40376p19203o86589o60000o55899o80370p25632p71885p94391
2899B85249100p74212p08008o10619n10253m35830m03633m10633m37374m59080m59747
$$ plain form
2909 280039711 279600487 279188232 278789787 278378716 277929173 277428818 276884212 276315689 275745411 275185452
2919 275185452 274632130 274071026 273488312 272882404 272267971 271668434 271102200 270571041 270059490 269548054
2929 269548054 269032841 268538074 268113575 267814674 267675781 267693501 267827148 268018303 268215160 268388691
2939 268388691 268532677 268649387 268734035 268767662 268723240 268579845 268333530 268000164 267608109 267187691
2949 267187691 266764679 266360188 265994606 265690022 265468216 265345936 265329666 265415535 265591640 265840530
2959 265840530 266138992 266455193 266747284 266968975 267080879 267063599 266923752 266689053 266392956 266058865
2969 266058865 265691624 265283661 264829063 264337406 263838730 263376198 262993069 262722645 262587147 262604294
2979 262604294 262795029 263182564 263782768 264589615 265564651 266639996 267733936 268772774 269709225
$$ packed form
2909B80039711m39224m12255l98445m11071m49543n00355n44606n68523n70278n59959
2919B75185452n53322n61104n82714o05908o14433n99537n66234n31159n11551n11436
2929B69548054n15213m94767m24499k98901j38893J7720J33647J91155J96857J73531
2939B68388691J43986J16710Q4648L3627m4422j43395k46315l33366l92055m20418
2949B67187691m23012m04491l65582l04584k21806j22280j6270Q5869J76105K48890
2959B65840530K98462L16201K92091K21691J11904j7280j39847k34699k96097l34091
2969B66058865l67241m07963m54598m91657m98676m62532l83129k70424j35498J7147
2979B62604294J90735L87535O00204Q06847R75036J075345J093940J038838R36451
$$ plain form
2988 269709225 270529175 271246948 271893158 272503815 273114834 273760643 274473629 275279350 276189480 277196293
2998 277196293 278274860 279392281 280520649 281642780 282748165 283820152 284825478 285715981 286445103
3007 286445103 286990681 287368984 287628460 287825623 287997093 288144550 288244648 288274670 288237000 288164616
3017 288164616 288103409 288082733 288094292 288094654 288028202 287857361 287580147 287227669 286843452 286461906 286096020
3028 286096020 285739632 285379333 285004940 284613476 284206219 283783283 283340530 282870255 282364655 281818638
3038 281818638 281232262 280610504 279960747 279289341 278596992 277877598 277122192 276327877 275505390 274680176
3048 274680176 273882236 273127670 272404976 271674633 270886574 270007935 269044342 268041763 267067966 266182194
3058 266182194 265410519 264739399 264126892 263522949 262886009 262189388 261420059 260575066 259661350 258698578
$$ packed form
2988B69709225Q19950P17773O46210O10657O11019O45809P12986Q05721R10130J006813
2998B77196293J078567J117421J128368J122131J105385J071987J005326Q90503P29122
3007B86445103N45578L78303K59476J97163J71470J47457J00098L0022l7670p2384
3017B88164616o1207k0676J1559L62o6452j70841k77214l52478l84217l81546l65886
3028B86096020l56388l60299l74393l91464m07257m22936m42753m70275n05600n46017
3038B81818638n86376o21758o49757o71406o92349p19394p55406p94315q22487q25214
3048B74680176p97940p54566p22694p30343p88059q78639r63593j002579r73797q85772
3058B66182194p71675o71120o12507o03943o36940o96621p69329q44993r13716r62772
$$ plain form
3068 258698578 257717419 256752281 255827026 254943466 254078293 253193321 252253685 251244411 250176392 249079533
3078 249079533 247986221 246914978 245863266 244811935 243739529 242637405 241518936 240416508 239368820
3087 239368820 238405132 237534447 236744308 236010571 235310459 234632511 233978786 233358364 232778778 232239227
3097 232239227 231729927 231236706 230746098 230250359 229748592 229247093 228759480 228305397 227906799 227581730
3107 227581730 227336311 227160778 227031708 226921864 226812305 226700745 226600914 226533279 226512299 226539230 226604652
3118 226604652 226698933 226824360 226999931 227254543 227611370 228073235 228618355 229211369 229823246 230449047
3128 230449047 231111832 231848145 232683563 233613052 234597855 235582371 236520634 237397900 238233128 239063663
3138 239063663 239921055 240813103 241721115 242612362 243456955 244239388 244959373 245623512 246236286 246795826
$$ packed form
3068B58698578r81159r65138r25255q83560q65173q84972r39636j009274j068019j096859
3078B49079533j093312j071243j051712j051331j072406j102124j118469j102428j047688
3087B39368820r63688q70685p90139p33737p00112o77948o53725o20422n79586n39551
3097B32239227n09300m93221m90608m95739n01767n01499m87613m54083l98598l25069
3107B27581730k45419j75533j29070j09844j09559j11560r9831o7635k0980K6931O5422
3118B26604652R4281J25427J75571K54612L56827M61865N45120N93014O11877O25801
3128B30449047O62785P36313Q35418R29489R84803R84516R38263Q77266Q35228Q30535
3138B39063663Q57392Q92048R08012Q91247Q44593P82433P19985O64139O12774N59540
$$ plain form
3148 246795826 247295837 247731781 248105240 248425331 248705521 248958626 249192696 249409351 249605160 249774876
3158 249774876 249914665 250021877 250092125 250114269 250069675 249937534 249707222 249390259 249023113 248655987
3168 248655987 248330765 248059139 247813911 247540398 247181377 246703491 246110611 245439205 244740124 244058571
3178 244058571 243421192 242834396 242289524 241771450 241264038 240754318 240234337 239701366 239155483 238595352
3188 238595352 238013744 237396927 236728992 235999565 235210667 234378548 233529339 232691345 231887188 231128426
3198 231128426 230413818 229730453 229057941 228374920 227667389 226933937 226184769 225433311 224684887 223929043
3208 223929043 223141575 222295914 221376419 220385494 219341259 218267937 217187862 216119461 215080318
3217 215080318 214089108 213161602 212301807 211495552 210714264 209929161 209127941 208322868 207543106 206816673
$$ packed form
3148B46795826N00011M35944L73459L20091K80190K53105K34070K16655J95809J69716
3158B49774876J39789J07212P0248K2144m4594j32141k30312l16963l67146l67126
3168B48655987l25222k71626k45228k73513l59021m77886n92880o71406o99081o81553
3178B44058571o37379n86796n44872n18074n07412n09720n19981n32971n45883n60131
3188B38595352n81608o16817o67935p29427p88898q32119q49209q37994q04157p58762
3198B31128426p14608o83365o72512o83021p07531p33452p49168p51458p48424p55844
3208B23929043p87468q45661r19495r90925j044235j073322j080075j068401j039143
3217B15080318r91210r27506q59795q06255p81288p85103q01220q05073p79762p26433
$$ plain form
3227 206816673 206151943 205532055 204924927 204302902 203659744 203016777 202413864 201892891 201481361 201183033
3237 201183033 200978928 200837021 200726318 200629826 200550728 200509472 200532551 200639629 200835762 201113625 201463909
3248 201463909 201887569 202400074 203026371 203789330 204699841 205755253 206944218 208253708 209671116
3257 209671116 211179676 212753963 214360790 215968533 217559052 219134045 220709782 222302818 223915100
3266 223915100 225528889 227114735 228647022 230116634 231532993 232914429 234274273 235611725 236913033
3275 236913033 238162518 239355259 240504494 241637783 242785244 243964405 245170460 246376400 247544651
3284 247544651 248643303 249660530 250608845 251517429 252415752 253317795 254214191 255078220 255880814 256607533
3294 256607533 257267914 257892818 258520889 259180660 259877472 260590591 261282005 261913033 262460670 262925892
$$ packed form
3227B06816673o64730o19888o07128o22025o43158o42967o02913n20973m11530k98328
3237B01183033k04105j41907j10703r6492p9098m1256K3079J07078J96133K77863L50284
3248B01463909M23660N12505O26297P62959R10511J055412J188965J309490J417408
3257B09671116J508560J574287J606827J607743J590519J574993J575737J593036J612282
3266B23915100J613789J585846J532287J469612J416359J381436J359844J337452J301308
3275B36913033J249485J192741J149235J133289J147461J179161J206055J205940J168251
3284B47544651J098652J017227R48315R08584Q98323R02043Q96396Q64029Q02594P26719
3294B56607533O60381O24904O28071O59771O96812P13119O91414O31028N47637M65222
$$ plain form
3304 262925892 263330135 263700275 264051228 264374809 264643440 264826603 264911900 264916878 264885197 264867153 264897289
3315 264897289 264981785 265102177 265231762 265352554 265461826 265566216 265669918 265767078 265844841 265893059 265912418
3326 265912418 265912933 265904675 265887146 265846615 265765896 265638981 265482197 265332527 265233173 265214195 265278893 265403633
3338 265403633 265551395 265690002 265806236 265908031 266012535 266129475 266247921 266335735 266353855 266276970
3348 266276970 266109428 265886135 265656681 265461903 265316219 265205193 265099335 264973640 264820423 264648914
3358 264648914 264474392 264307289 264149837 264001865 263868866 263765297 263709545 263715439 263786335 263915825 264093246
3369 264093246 264308052 264550457 264808540 265067463 265311756 265529346 265713406 265859814 265962791 266014843
3379 266014843 266013126 265967712 265904655 265855923 265841160 265852432 265853443 265798588 265660477 265450230 265216198 265021992
$$ packed form
3304B62925892M04243L70140L50953L23581K68631J83163Q5297M978l1681j8044L0136
3315B64897289Q4496J20392J29585J20792J09272J04390J03702R7160P7763M8218J9359
3326B65912418N15q258j7529m0531q0719j26915j56784j49670r9354j8978O4698J24740
3338B65403633J47762J38607J16234J01795J04504J16940J18446Q7814J8120p6885
3348B66276970j67542k23293k29454j94778j45684j11026j05858j25695j53217j71509
3358B64648914j74522j67103j57452j47972j32999j03569n5752N894P0896J29490J77421
3369B64093246K14806K42405K58083K58923K44293K17590J84060J46408J02977N2052
3379B66014843j717m5414o3057m8732j4763J1272J011n4855j38111k10247k34032j94206
$$ plain form
3391 265021992 264915962 264910526 264980812 265081978 265171452 265224972 265239429 265225506 265197468 265166416 265138340 265115910
3403 265115910 265100441 265093803 265099850 265124493 265174923 265256214 265366611 265493870 265614071 265695915 265708313 265630226
3415 265630226 265459576 265218430 264951839 264718704 264575100 264554729 264654388 264832706 265025005 265169392
3425 265169392 265232639 265223274 265184593 265172272 265227737 265361900 265555267 265772934 265983620 266171627 266335697
3436 266335697 266477222 266587887 266645126 266620922 266500607 266300659 266074276 265899353 265851154 265972137
3446 265972137 266253529 266637535 267039852 267380924 267611713 267724113 267743759 267714081 267680950 267683620 267751770
3457 267751770 267902966 268139172 268442059 268774147 269088192 269343319 269519138 269620743 269671974 269702492
3467 269702492 269736519 269791222 269880867 270019722 270218716 270474319 270759983 271029587 271235275 271350594
$$ packed form
3391B65021992j06030n436P0286J01166Q9474N3520J4457j3923k8038l1052k8076k2430
3403B65115910j5469o638O047K4643N0430Q1291J10397J27259J20201Q1844J2398p8087
3415B65630226j70650k41146k66591k33135j43604k0371R9659J78318J92299J44387
3425B65169392O3247r365l8681j2321N5465J34163J93367K17667K10686J88007J64070
3436B66335697J41525J10665N7239k4204j20315j99948k26383j74923m8199J20983
3446B65972137K81392L84006M02317L41072K30789J12400J9646k9678l3131K670O8150
3457B67751770J51196K36206L02887L32088L14045K55127J75819J01605N1231L0518
3467B69702492L4027N4703Q9645J38855J98994K55603K85664K69604K05688J15319
$$ plain form
3477 271350594 271384792 271376305 271369095 271387329 271424923 271460953 271487331 271529789 271643848 271883373 272262936 272739315
3489 272739315 273227959 273647842 273965778 274210987 274448700 274730263 275051804 275352440 275554638 275621262
3499 275621262 275591240 275567513 275663471 275938816 276365223 276844006 277262287 277555103 277735806 277879829
3509 277879829 278077450 278385925 278806934 279298630 279803905 280275822 280684891 281012459 281242695 281364651
3519 281364651 281383228 281328602 281253242 281215458 281259155 281402111 281638699 281950378 282313957 282701912 283079433
3530 283079433 283410397 283675823 283897934 284147663 284519825 285078869 285803318 286566181 287175694 287464161
3540 287464161 287379303 287024555 286616325 286378479 286430626 286735611 287138214 287468204 287644367 287714863
3550 287714863 287813969 288071556 288542709 289202671 290002937 290929413 292003498 293211231 294411221 295307884
$$ packed form
3477B71350594L4198q487p210J8234L7594L6030K6378M2458J14059K39525L79563M76379
3489B72739315M88644M19883L17936K45209K37713K81563L21541L00636K02198O6624
3499B75621262l0022k3727R5958K75345M26407M78783M18281K92816J80703J44023
3509B77879829J97621L08475M21009M91696N05275M71917M09069L27568K30236J21956
3519B81364651J8577n4626p5360l7784M3697J42956K36588L11679L63579L87955L77521
3530B83079433L30964K65426K22111K49729L72162N59044P24449P62863O09513K88467
3540B87464161q4858l54748m08230k37846N2147L04985M02603L29990J76163P0496
3550B87714863R9106K57587M71153O59962Q00266R26476J074085J207733J199990Q96663
$$ plain form
3560 295307884 295543327 294880390 293375435 291423454 289626980 288546085 288463821 289291992 290658760
3569 290658760 292109909 293304863 294111309 294584827 294889431 295223808 295777664 296692619 297998047
3578 297998047 299537430 300948811 301762028 301606998 300432796 298600502 296763306 295577164 295396500
3587 295396500 296127872 297320747 298429890 299085522 299221401 299017906 298737850 298583393 298653374 298988800
3597 298988800 299626827 300592632 301832542 303152657 304237766 304767857 304573078 303735981 302579784
3606 302579784 301548672 301043854 301286049 302246704 303650570 305041809 305910435 305874367 304876575 303311310
3616 303311310 301970749 301764050 303284111 306420536 310250435 313329449 314295521 312503567 308362331
3625 308362331 303180313 298593178 295867748 295438786 296882877 299281654 301724224 303668709 305026283
$$ packed form
3560B95307884K35443o62937j504955j951981j796474j080895q2264Q28171J366768
3569B90658760J451149J194954Q06446M73518L04604L34377N53856R14955J305428
3578B97998047J539383J411381Q13217j55030j174202j832294j837196j186142j80664
3587B95396500P31372J192875J109143O55632J35879k03495k80056j54457O9981L35426
3597B98988800O38027R65805J239910J320115J085109N30091j94779q37097j156197
3606C02579784j031112n04818K42195R60655J403866J391239Q68626l6068r97792j565265
3616C03311310j340561k06699J520061L136425L829899L079014R66072j791954m141236
3625C08362331n182018m587135k725430m28962J444091K398777K442570J944485J357574
$$ plain form
3634 305026283 306020317 306985588 308234081 309996166 312354889 315126820 317752304 319343987 318989925
3643 318989925 316228466 311432762 305824299 301021214 298321781 298118134 299780121 302071533 303833427
3652 303833427 304528351 304361382 303987179 304061890 304936981 306622467 308929787 311605453 314348812
3661 314348812 316768589 318412895 318936424 318309422 316883907 315209446 313685417 312293243 310625362
3670 310625362 308222427 304998722 301454697 298518238 297111397 297720928 300226040 304036217 308382416
3679 308382416 312542973 315899200 317894325 318055077 316156006 312442093 307718582 303170700 299953499
3688 299953499 298760357 299603786 301910553 304838619 307613297 309717007 310903625 311133862 310542088
3697 310542088 309459267 308415775 308024597 308730278 310532684 312862377 314732304 315139771 313539066
$$ packed form
3634C05026283R94034R65271J248493J762085K358723K771931K625484J591683l54062
3643C18989925k761459m795704n608463m803085k699433k03647J661987K291412J761894
3652C03833427O94924j66969l74203P4711Q75091J685486K307320K675666K743359
3661C14348812K419777J644306N23529o27002j425515j674461j524029j392174j667881
3670C10625362k402935l223705l544025k936459j406841O09531K505112L810177M346199
3679C08382416M160557L356227J995125J60752j899071l713913m723511m547882l217201
3688B99953499j193142Q43429K306767K928066K774678K103710J186618K30237n91774
3697C10542088j082821j043492l91178P05681J802406K329693J869927M07467j600705
$$ plain form
3706 313539066 310143337 305891914 302086449 299870052 299794216 301665344 304708309 307933636 310513744
3715 310513744 312006474 312374172 311857204 310815716 309624081 308633099 308156033 308429279 309533691
3724 309533691 311312790 313341789 314987335 315563183 314554691 311853485 307919426 303771954 300739975
3733 300739975 299992752 302010174 306253643 311268864 315257549 316882439 315882206 313132877 310091667
3742 310091667 307936954 306923828 306351585 305151520 302702312 299331951 296181087 294527378 295020161
3751 295020161 297314205 300308170 302797070 304107800 304344921 304161911 304272366 305029526 306295547
3760 306295547 307601566 308433228 308461075 307631741 306145496 304386196 302834740 301958332 302067242
3769 302067242 303176384 304951286 306800213 308098278 308445187 307826138 306592255 305274639 304333591
$$ packed form
3706C13539066l395729m251423l805465k216397p5836J871128L042965L225327K580108
3715C10513744J492730L67698n16968j041488j191635r90982m77066K73246J104412
3724C09533691J779099K028999J645546N75848j008492k701206l934059m147472l031979
3733C00739975p47223K017422M243469N015221L988685J624890j000233k749329l041210
3742C10091667k154713j013126n72243j200065k449208l370361l150864j653709M92783
3751B95020161K294044K993965K488900J310730K37121j83010J10455P57160J266021
3760C06295547J306019Q31662K7847q29334j486245j759300j551456q76408J08910
3769C02067242J109142J774902J848927J298065L46909o19049j233883j317616r41048
$$ plain form
3778 304333591 303973598 304108372 304476566 304828529 305073204 305306988 305719509 306445789 307466717 308623867
3788 308623867 309732056 310701218 311565590 312389145 313118095 313507729 313213005 312005615 309970589
3797 309970589 307525196 305216789 303426361 302187405 301262836 300432491 299775467 299716339 300766277
3806 300766277 303120441 306396217 309716301 312106380 312959023 312271194 310523567 308318710 306045418
3815 306045418 303790855 301518707 299333229 297597313 296799335 297262001 298908653 301259975 303671799
3824 303671799 305656872 307084961 308145084 309112186 310079651 310829315 310916061 309914494 307684727
3833 307684727 304508724 301019287 297957611 295885506 295011082 295223103 296310520 298213654 301110516
3842 301110516 305227890 310448551 315966473 320280876 321661034 318931808 312185287 302994919 293939133
$$ packed form
3778C04333591l59993J34774L68194L51963K44675K33784M12521P26280J020928J157150
3788C08623867J108189R69162Q64372Q23555P28950L89634k94724j207390k035026
3797C09970589k445393k308407j790428j238956r24569q30345o57024n9128J049938
3806C00766277K354164L275776L320084K390079Q52643o87829j747627k204857k273292
3815C06045418k254563k272148k185478j735916p97978M62666J646652K351322K411824
3824C03671799J985073J428089J060123R67102R67465P49664Q6746j001567k229767
3833C07684727l176003l489437l061676k072105q74424K12021J087417J903134K896862
3842C01110516M117374N220661N517922M314403J380158k729226o746521r190368r055786
$$ plain form
3851 293939133 287610989 285587177 287862396 293004723 298909283 303730831 306536789 307425938 307162476
3860 307162476 306604862 306247978 306072559 305703487 304730949 303008194 300783672 298623505 297175617
3869 297175617 296890583 297829590 299649277 301764317 303600960 304806042 305312176 305252419 304810200
3878 304810200 304117889 303259716 302340355 301524391 300984612 300786190 300809517 300803566 300563564 300119991
3888 300119991 299793186 300044746 301197796 303193188 305537815 307482872 308333817 307725391 305733528
3897 305733528 302801628 299555244 296607609 294426060 293272877 293198929 294070606 295621948 297525368
3906 297525368 299466782 301196423 302541599 303392315 303688545 303432446 302717667 301739693 300757122
3915 300757122 300005798 299608383 299539127 299665871 299847260 300018711 300210819 300489464 300863113 301227474
$$ packed form
3851B93939133o328144k023812K275219N142327N904560M821548K805958Q89149k63462
3860C07162476n57614l56884j75419l69072r72538j722755k224522k160167j447888
3869B97175617k85034R39007J819687K115040J836643J205082N06134n9757m42219
3878C04810200o92311q58173r19361q15964n39779j98422K3327n951k40002m43573
3888C00119991l26805K51560J153050J995392K344627J945057Q50945o08426j991863
3897C05733528k931900l246384k947635k181549j153183p3948Q71677J551342J903420
3906B97525368J941414J729641J345176Q50716K96230k56099p14779r77974r82571
3915C00757122p51324l97415o9256J26744J81389J71451J92108K78645L73649L64361
$$ plain form
3925 301227474 301394272 301194248 300592480 299741344 298931198 298460464 298494701 298991852 299732990 300435276
3935 300435276 300883751 301010590 300890694 300670910 300481606 300378361 300334759 300274868 300120697 299832458
3945 299832458 299430962 298996220 298641338 298466072 298507195 298713856 298969231 299152336 299202461 299142170
3955 299142170 299042187 298956642 298882236 298775845 298613968 298437862 298337021 298379059 298543358 298720093 298781204
3966 298781204 298666039 298411541 298103790 297803345 297516651 297239723 297020187 296957912 297117558 297427101
3976 297427101 297672482 297628975 297240124 296684093 296242905 296061401 296005325 295768261 295162277 294331055
3986 294331055 293653984 293369484 293241215 292636280 291067677 288792305 286839180 286149139 286202660 284104462
3996 284104462 275056915 254381065 220166702 175018101
$$ packed form
3925C01227474J66798k00024o01768q51136q10146m70734L4237M97151P41138P02286
3935C00435276M48475J26839j19896k19784j89304j03245m3602n9891j54171k88239
3945B99832458m01496m34742l54882j75266M1123K06661K55375J83105N0125o0291
3955B99142170r9983q5545p4406j06391j61877j76106j00841M2038J64299J76735O1111
3966B98781204j15165k54498l07751l00445k86694k76928k19536o2275J59646L09543
3976B97427101K45381m3507l88851n56031m41188j81504n6076k37064o05984q31222
3986B94331055o77071k84500j28269o04935j568603k275372j953125o90041N3521k098198
3996B84104462r047547k0675850l4214363m5148601
$$ plain form
4000 175018101
$$ packed form
4000A75018101
##END=$$ End of the data block
