##TITLE=p-cloroacetanilida $$ Begin of the data block
##JCAMP-DX=5.00 $$ ACD/SpecManager v 10.08
##SPECTROMETER/DATA SYSTEM=Alpha
##DATE=25 Jun 2015 13:07:00
##DATA TYPE=INFRARED SPECTRUM
##DATA CLASS=XYDATA
##ORIGIN=
##OWNER=
##NPOINTS=1765
##FIRSTX=399.76428223
##LASTX=3997.64306641
##MAXX=3997.64306641
##MINX=399.76428223
##MAXY=0.89836657
##MINY=0.67212683
##XFACTOR=1.0000000000
##YFACTOR=1.000000000000000e-9
##FIRSTY=0.85992533
##DELTAX=2.03961372
##XUNITS=1/CM
##YUNITS=ARBITRARY UNITS
##XYDATA=(X++(Y..Y))
399.8H59925330k334178Q73864K685070j037061l045619P92325K336383k156854m415393
418.1H53623867O54161K816916j498759l167868K36213J360238k299726l537893j03295
436.5H48083854P7605n174994q099735p283628r308160j1714577m320145J2461603
452.8H14721823K1420777J5038311P094801N571424L203929j974225k678812J337529
469.1H63735557J542627k384185k272368J474261J205385k695203k522587J493811
485.4H59577298J274049k902090l184199M94480J00553m978061p815957p966995r889186
503.8H24709892r585499j504004P616043J1959970J2471258R547115O336212L024757
520.1H64575744j523435k511979R87411J872897j751304k696752P41184J628399j705945
$$ plain form
399.8 859925330 857591152 858465016 861150086 860113025 857067406 857859731 860196114 858039260 853623867
418.1 853623867 854278028 857094944 855596185 852428317 852664530 854024768 851725042 848187149 848083854
436.5 848083854 848161459 842986465 834886730 827603102 818294942 806580365 802260220 814721823
452.8 814721823 836142600 851180911 858275712 863847136 867051065 865076840 862398028 863735557
469.1 863735557 865278184 862893999 860621631 862095892 863301277 860606074 858083487 859577298
485.4 859577298 860851347 857949257 854765058 855259538 855360091 850382030 842566073 834599078 824709892
503.8 824709892 815124393 813620389 821236432 833196402 845667660 855214775 861550987 864575744
520.1 864575744 863052309 860540330 861527741 863400638 861649334 858952582 859693766 861322165 859616220
538.5H59616220k629757N37753J473606j620293k513230P63297J938641j099407k317846
556.8H54148984O49333J953065r33289k311588M70102J994253p14720k391398K12074
575.2H53076816J988351o27041k592683k10523J850068J68979j142740R91464K466500
593.5H55969191j14203k412617o69897O40810k732396n180776N1200O887615N798340
611.9H58237267Q50975M04179K311647J001000j241087L5286K370834J145840j417816
630.2H63698125l59595K322912J461029j243889o70552J855731J292467j307786r49084
648.6H66099358J583337J296103j246869j127064J461088J518011j083612j812279
664.9H66688073m6730J191258m15206p49648J148522J586378r46999j859366M03463
$$ plain form
538.5 859616220 856986463 857524216 858997822 857377529 854864299 855627596 857566237 856466830 854148984
556.8 854148984 854798317 856751382 855818093 853506505 853976607 855970860 855256140 852864742 853076816
575.2 853076816 855065167 854438126 851845443 851634920 853484988 853653967 852511227 853502691 855969191
593.5 855969191 855854988 853442371 852772474 853413284 850680888 845500112 845551312 852438927 858237267
611.9 858237267 859088242 859492421 861804068 862805068 861563981 861599267 863970101 865115941 863698125
630.2 863698125 863338530 865661442 867122471 865878582 865208030 867063761 868356228 867048442 866099358
648.6 866099358 867682695 868978798 867731929 866604865 868065953 869583964 868500352 866688073
664.9 866688073 866641343 867832601 867417395 866667747 867816269 869402647 868455648 866596282 866999745
683.3H66999745J208485j173556k414763o29783N5790k563298m755199m192769m170299
701.6H48364353p207990q961796k210558J0466695J6487360J2192249O379545L049851
717.9H78559709n15819l097057j917422O5386r90867k988637k196431m29273j483023
736.3H65006566l823101l461659j487375j747906l248990k028942J250625K499402
752.6H52958620J728415K610445N075812N253494K919734K037525L328979L127515
768.9H79040539O91116k44379J322448J788438j79768j151681M45128J325070k90334
787.3H82746577j377880l0279R72986m81963j818717p27892L87430r01222k505422
805.6H76263618k010762j477480l449559n896867o348312o536185p156253m223108
$$ plain form
683.3 866999745 868208230 867034674 864619911 863990128 864045918 861482620 856727421 852534652 848364353
701.6 848364353 841156363 832194567 829984009 840450704 856938064 869130313 875509858 878559709
717.9 878559709 878043890 874946833 873029411 873094797 872103930 869115293 866918862 866489589 865006566
736.3 865006566 861183465 857721806 856234431 854486525 851237535 849208593 850459218 852958620
752.6 852958620 854687035 857297480 862373292 867626786 870546520 872584045 875913024 879040539
768.9 879040539 879731655 879487276 880809724 882598162 882418394 881266713 881711841 883036911 882746577
787.3 882746577 881368697 881338418 882311404 881829441 880010724 879282832 879670262 878769040 876263618
805.6 876263618 874252856 872775376 869325817 863428950 857080638 850544453 843388200 839165092
822H39165092Q59260o37770o746888n249619L315091O677627J729131p26998O331206
840.3H44716132J2750625J0987282Q506239Q686363P585645M282773O65962q09490
856.6H97371531J01506N42164o76274j188696R5964P85708n06937j581967p60138R2089
877H94274950o90579j277209N6029J327276M38154q90971l65197O53743m2855j171530
897.4H92311811n33461O70373J77682j018644o74605M76003J85430j015604q76188
915.8H89702797K65121J45615j126409j171589R9957L12448q56996j222610l42191
934.1H85806143l15010j647651j865209l00049J60455q91149j124084m85062n00977
952.5H78837407j838446l138423k913058k561927l613174m686772l638864L23832N272687
$$ plain form
822 839165092 840024352 839386582 832639694 827390075 830705166 837382793 839111924 838384926 844716132
840.3 844716132 857466757 868454039 876960278 885646641 893232286 897515059 898181021 897371531
856.6 897371531 897473037 898015201 897338927 896150231 896246195 897031903 896524966 894942999 894182861 894274950
877 894274950 893584371 892307162 892363191 893690467 894128621 893237650 892872453 893526196 893483341 892311811
897.4 892311811 891778350 892448723 892626405 891607761 890933156 891409159 891594589 890578985 889702797
915.8 889702797 889967918 890113533 888987124 887815535 887915492 888227940 887370944 886148334 885806143
934.1 885806143 885491133 883843482 881978273 881678224 881838679 880947530 879823446 879338384 878837407
952.5 878837407 876998961 873860538 870947480 868385553 864772379 860085607 856446743 856770575 862043262
970.9H62043262P589459O373107L462792L55244j708448j754642r09984j108527k021015
989.2H72321248j998246j319766j719355l143370l750504l490924m823089q072853
1005.5H44003141q066416p31647O368935N229414K096355L149390M900992M646063
1021.8H61596227L824830L188371J820147l96311k146482k565742k480388k370595
1038.2H60470057j110077J417100L025711K355396R32932N65827P55251K76506m20392
1056.5H68268311l19540J40905j68204r85563j225412r23693q85010j327753j767516
1074.9H60806525k055109k876997m289627n623102p699788j1208534j0279775K372742
1091.2H19146335J8014193K0345807J0581732J380920j577616l8326K184093K520979
$$ plain form
970.9 862043262 869632721 876005828 879468620 879823864 878115416 876360774 875450790 874342263 872321248
989.2 872321248 870323002 869003236 867283881 864140511 860390007 856899083 852075994 844003141
1005.5 844003141 835936725 835205078 841574013 846803427 848899782 852049172 856950164 861596227
1021.8 861596227 865421057 868609428 870429575 870033264 867886782 865321040 862840652 860470057
1038.2 860470057 859359980 860777080 863802791 866158187 867091119 867656946 868412197 868688703 868268311
1056.5 868268311 867948771 868089676 867921472 866935909 865710497 864786804 863901794 862574041 860806525
1074.9 860806525 858751416 855874419 851584792 845961690 838261902 827053368 816773593 819146335
1091.2 819146335 837160528 857506335 868088067 869468987 867891371 867853045 870037138 872558117
1107.5H72558117J189470o40511k239526k735197j192928J593888K825141J658797
1123.8H73017251K98024j58727l58224n09441m00484j48833j85370n17011o29365m64261
1144.2H69943559n96225r51827r18388o71148q57950j366496j531481j472891k066850
1162.6H59510303l733993n931675n696238J316309J0193766J0136306L053188r73105
1178.9H67874861O10888K495646J421809k15232q85427r94325p17282n49912q08359
1197.3H68232667j028835q41201o93142r49741j241922j174033j024603j051426r84073
1215.6H59243691o66738n93483j114428j660645j598299j246631j282155j491368j187682
1234H48402262l25382M04537N11467K20359k53797j166225k489566l679157m669785
$$ plain form
1107.5 872558117 873747587 873107076 870867550 868132353 866939425 868533313 871358454 873017251
1123.8 873017251 873315275 873156548 872798324 872288883 871888399 871739566 871554196 871037185 870407820 869943559
1144.2 869943559 869347334 868395507 867477119 866805971 865948021 864581525 863050044 861577153 859510303
1162.6 859510303 855776310 849844635 844148397 845464706 855658472 865794778 868847966 867874861
1178.9 867874861 868485749 870981395 872403204 872187972 871302545 870308220 869590938 869041026 868232667
1197.3 868232667 867203832 866362631 865669489 864719748 863477826 862303793 861279190 860227764 859243691
1215.6 859243691 858576953 857983470 856869042 855208397 853610098 852363467 851081312 849589944 848402262
1234 848402262 848076880 848481417 848992884 849213243 848959446 847793221 845303655 841624498 836954713
1252.3H36954713n887032o922841n577564M89354R821057J5934408J3485253N476117
1268.6H63773465r07421l336430l641068l397167l345192l636717l877759l944576
1285H37687135m384816m755139k271295L276229M916489o18696o312132p942438q030355
1303.3H11564982q315206q368909p358015n027830j336277L742516R377778J3672590
1319.6H07951629J4643252J2233138Q480072N598784M213094L701270L615737L349245
1336H63786221J944661l29554k146423l084421l585458l636956k789975j580059j565397
1354.3H47012639l102183n044759o616115p933557r103239r776532q011222j759827
1370.6G95665205O417095J1663318J0931671O107330N61237l557026n135715n028963
$$ plain form
1252.3 836954713 831067681 824144840 818567276 819056630 828877687 844812095 858297348 863773465
1268.6 863773465 862866044 859529614 855888546 852491379 849146187 845509470 841631711 837687135
1285 837687135 833302319 828547180 826275885 829552114 834468603 833849907 827537775 819595337 811564982
1303.3 811564982 803249776 794880867 787522852 782495022 781158745 784901261 794279039 807951629
1319.6 807951629 822594881 834828019 843308091 848906875 853119969 856821239 860436976 863786221
1336 863786221 865730882 865401328 863254905 860170484 856585026 852948070 850158095 848578036 847012639
1354.3 847012639 843910456 838865697 832249582 824316025 815212786 805436254 797425032 795665205
1370.6 795665205 802082300 813745618 824677289 830784619 831345856 827788830 822653115 817624152
1386.9H17624152m041732k656817j248539J270652N506575J0319651J2710809J1022270
1403.3H50507021P607818M188895J580417r1136j328885k461553l126681k517700j523018
1421.6H52835178j798927k177418k065003k000451j929700k315939l000259k558768
1437.9H34988713j836180k169252k350807j806974o11902N70178O70791l68416j759112
1456.3H25327039j422763n29230j737892l583730l807366l146112l504276l904044
1472.6H03691626k880216k281964l204465m595458n486369n653620n414665l924072
1488.9G70250797M74990O341338J1268675J4422417J3607442J0350168O736875L411591
1505.2H36864293J607835O87718j269281l525734n293190o100416o153405o254613
$$ plain form
1386.9 817624152 813582420 810925603 809677064 810947716 816454291 826773942 839484751 850507021
1403.3 850507021 858114839 862303734 863884151 863793015 862464130 860002577 856875896 854358196 852835178
1421.6 852835178 851036251 848858833 846793830 844793379 842863679 840547740 837547481 834988713
1437.9 834988713 833152533 830983281 828632474 826825500 826213598 826783776 827454567 827086151 825327039
1456.3 825327039 823904276 823375046 821637154 818053424 814246058 811099946 807595670 803691626
1472.6 803691626 800811410 798529446 795324981 790729523 785243154 779589534 774174869 770250797
1488.9 770250797 770725787 777067125 788335800 802758217 816365659 826715827 833452702 836864293
1505.2 836864293 838472128 839159846 837890565 834364831 829071641 822971225 816817820 810563207
1521.6H10563207n202949m427731m446984m094720m050910l410757j803338j508296
1537.9G81617522j154959J826584M236460N359590O488323Q388579J0146261J0596632
1554.2H27504992R186805Q934200J0718703P963240M715145K833366J219749M32611
1570.5H73508811l70383k545119m825353n424679o466209q636296j0565222j1859536
1586.8H22816014j1676728r462536o134689k823352P2836J169682j217723n587876
1603.2G87155628p903278o274044j731634L413260O511747P731796Q050978N891740
1619.5H02846193L035546J551926O58214n67615j499713k108454l239692l755331j810371
1637.8G95110703k21968M2558Q3029Q53061K627731K379954M65572M98533J220822
$$ plain form
1521.6 810563207 805360258 800932527 796485543 792390823 788339913 784929156 783125818 781617522
1537.9 781617522 780462563 782289147 786525607 791885197 798373520 806762099 816908360 827504992
1554.2 827504992 836691797 845625997 856344700 864307940 869023085 871856451 873076200 873508811
1570.5 873508811 873138428 870593309 865767956 860343277 853877068 845240772 834675550 822816014
1586.8 822816014 811139286 801676750 795542061 792718709 792791545 793961227 792743504 787155628
1603.2 787155628 779252350 772978306 771246672 774659932 781171679 788903475 796954453 802846193
1619.5 802846193 805881739 807433665 808091879 807524264 806024551 803916097 800676405 796921074 795110703
1637.8 795110703 794888735 794931293 795014322 795867383 798495114 800875068 801340640 801839173 803059995
1656.2H03059995j70111j390398o65307J617193K607107K163351K232313K349258K285003
1674.5H14088404K888322L274858K948284K797187L903150M639983M699648N413472
1690.9H44653308M792154L559232L246784L243923M238546M305363L341675L231227
1707.2H74612212K846122J850903J019418O81937J314580K418995K344966J684010
1723.5H88773143J237095O81936J80424k22683o6638J059413J098156N96761O98865
1741.9H94036472N38170K3306k22147N3048O72937O40332J57595R775j85609j40249
1762.2H95583630L81112K78711l10600p02560k74658P47085P87317K22385J41204L67164
1782.6H97220790L35932J68801k20001o44565k29180M27366K85804R239J90675M44233
$$ plain form
1656.2 803059995 802889884 801499486 800834179 802451372 805058479 807221830 809454143 811803401 814088404
1674.5 814088404 816976726 820251584 823199868 825997055 829900205 834540188 839239836 844653308
1690.9 844653308 849445462 853004694 856251478 859495401 863733947 868039310 871380985 874612212
1707.2 874612212 877458334 879309237 880328655 881010592 882325172 884744167 887089133 888773143
1723.5 888773143 890010238 890692174 890872598 890649915 890583277 891642690 892740846 893337607 894036472
1741.9 894036472 894574642 894597948 894375801 894428849 895101786 895742118 895899713 895909488 895723879 895583630
1762.2 895583630 895964742 896243453 895932853 895230293 894955635 895702720 896490037 896712422 896853626 897220790
1782.6 897220790 897556722 897725523 897505522 896860957 896631777 897059143 897344947 897354186 897544861 897989094
1803H97989094L35276M2200j78039j64806M1484J42277R4413O199j84893l74914k78830
1825.5H97469461k18451k09093K79605M63426L0637k57015l56376o77407p80582o2883
1845.9H95681322N03063M85420L23713J52290O2346K3663l3200j35898l05891n59867
1866.3H96196961n17606M0173L06785J3173k79069l98517m37617l93093l61323n50806
1886.7H93619061q46625q64565q92282j279115j809776k197981j670838K50161K222002
1905H86530042K641320J884460J091063N21124K6822j85847K324Q1659K1040R7573
1925.4H92711580Q2373l0934q4877q0049q4281j96517l90112m48346k66195j52767
1945.8H91059875k01046j98126j70767j85669j69456r7096m7683j01924k32280k64406
$$ plain form
1803 897989094 898324370 898366570 898188531 898023725 898065209 898207486 898301899 898308098 898123205 897748291 897469461
1825.5 897469461 897251010 897041917 897321522 897784948 897815585 897558570 897202194 896524787 895744205 895681322
1845.9 895681322 896184385 896669805 896993518 897145808 897208154 897231817 897198617 897062719 896756828 896196961
1866.3 896196961 895679355 895719528 896026313 896039486 895760417 895361900 894924283 894531190 894169867 893619061
1886.7 893619061 892772436 891907871 891015589 889736474 887926698 885728717 884057879 884308040 886530042
1905 886530042 889171362 891055822 892146885 892668009 892694831 892508984 892511308 892592967 892614007 892711580
1925.4 892711580 892793953 892763019 892678142 892598093 892513812 892317295 891927183 891478837 891212642 891059875
1945.8 891059875 890858829 890660703 890489936 890304267 890134811 890037715 889990032 889888108 889655828 889391422
1966.2H89391422j31964o9142j67787k49147k52307k22444j61469p5579l1173o9559
1986.6H87960851j44958j70470p6055J9967Q405q881m1664j09732j22309r7155j05620
2009H87112379j55687k04206k51174k86996l23057m03881n55456n03719M5538M59433
2029.4H84933174K97606N2154n4777q1599p9572j22428j62005j41561r6441q6069j07467
2051.9H84351015j06633p7307r1910j58310j76668j18554r2328j44779j55270o8546
2072.3H83160710k4438m5180K861J22607J81496J11997L4988M0293L9577k7358q7083
2094.7H83510470o1094j2160m5716q9169l7432K9266o735q0466o3003j0430m5181j17004
2119.2H82971346j09136p3909j04130j50800j03771M112M4406L0696N2274R2089N5134
$$ plain form
1966.2 889391422 889259458 889190316 889022529 888773382 888521075 888298631 888137162 888061583 888030410 887960851
1986.6 887960851 887815893 887645423 887569368 887589335 887597740 887588859 887547195 887437463 887315154 887217999 887112379
2009 887112379 886956692 886752486 886501312 886214316 885891259 885487378 884931922 884428203 884473741 884933174
2029.4 884933174 885230780 885282934 885228157 885146558 885066986 884944558 884782553 884640992 884544551 884458482 884351015
2051.9 884351015 884244382 884167075 884075165 883916855 883740187 883621633 883529305 883384526 883229256 883160710
2072.3 883160710 883136272 883091092 883093953 883216560 883398056 883510053 883545041 883585334 883624911 883597553 883510470
2094.7 883510470 883449376 883437216 883391500 883302331 883264899 883294165 883287430 883206964 883143961 883133531 883088350 882971346
2119.2 882971346 882862210 882788301 882684171 882533371 882429600 882433712 882478118 882508814 882561088 882653177 882708311
2141.6H82708311n0723j18375j18077j21296j71244j90019j08123j5319M650L7074
2162H81856859J24752J35422J7464l4809N2512R3579K6941l7729l3260k146l4093j03355
2186.5H82062137j01566n8890p7009j20818q1122L0160P7188J2576m2200k5451n0366
2208.9H81624639j40250j62661q6248l4511o6042p2062j669L0220l3915p6950m0710
2231.4H80939841q046m4942j03951j03652p3612r0361j20639q8036m2975o4552q8096
2253.8H80110979m7326k9504r5487j58608j65462j61052j65105j58310j62303j72854
2274.2H78794968j61588j29044l9816P7844R6559M888p9870j00852q6069o2167l6717
2296.6H78278136k9266n5551r4652j30117j76668k52724l23951l35217l12149l46542
$$ plain form
2141.6 882708311 882657588 882539213 882421136 882299840 882128596 881938577 881830454 881815135 881819785 881856859
2162 881856859 881981611 882117033 882134497 882099688 882152200 882245779 882272720 882234991 882201731 882199585 882165492 882062137
2186.5 882062137 881960571 881901681 881824672 881703854 881622732 881652892 881730080 881742656 881700456 881675005 881624639
2208.9 881624639 881484389 881321728 881235480 881200969 881134927 881062865 881061196 881091416 881057501 880980551 880939841
2231.4 880939841 880931795 880886853 880782902 880679250 880605638 880515277 880394638 880306602 880263627 880199075 880110979
2253.8 880110979 880063653 880034149 879938662 879780054 879614592 879453540 879288435 879130125 878967822 878794968
2274.2 878794968 878633380 878504336 878464520 878542364 878638923 878643811 878563941 878463089 878377020 878314853 878278136
2296.6 878278136 878248870 878193319 878098667 877968550 877791882 877539158 877215207 876879990 876567841 876221299
2317H76221299m48525m98295m63426m40955m70698n07772l88443j10865M9114L6300
2337.4H72977734P987K0504J30415M30107N16355Q4400m92871p79509o96660n22911
2357.8H71675551l29018j28507M1961K74063N21361O06120N56827N04493M46022L32951
2378.2H74501824K28703K07305K37942K25723J50323R8228Q8215J0073j32143j60873
2398.6H75455320q4698r4116j39952p1645L4810M0352l4392l5644L6479k444j39237
2421H74964833j64985p7546q0228j77324j89006p7128r060n6684o2883J4364J9610
2443.5H74103963q1777j48893r4771k6882p2062j22070n9068j8478j00195j46270m6670
2465.9H73186827L3736k2531q3685n4419m4286j27613j97590j70827j37746j61469
$$ plain form
2317 876221299 875772774 875274479 874811053 874370098 873899400 873391628 873003185 872892320 872941434 872977734
2337.4 872977734 872985721 873006225 873136640 873566747 874083102 874167502 873674631 872895122 872198462 871675551
2357.8 871675551 871346533 871218026 871259987 871534050 872055411 872661531 873218358 873722851 874168873 874501824
2378.2 874501824 874730527 874937832 875175774 875401497 875551820 875650048 875738263 875748336 875616193 875455320
2398.6 875455320 875370622 875276506 875136554 875064909 875099719 875140071 875105679 875070035 875106514 875104070 874964833
2421 874964833 874799848 874722302 874642074 874464750 874275744 874198616 874189556 874132872 874069989 874084353 874103963
2443.5 874103963 874022186 873873293 873778522 873751640 873679578 873557508 873498440 873479962 873379767 873233497 873186827
2465.9 873186827 873220563 873198032 873114347 873059928 873015642 872888029 872690439 872519612 872381866 872220397
2486.3H72220397j66893j32024j09434j27793j64985j50025p9155l5107m7446k0086
2506.7H71187449O4373M3272q8334j50442j15990j04428j36614r1493M3810R3221Q166
2529.1H70752990q1718j22487j53840k11954k62201k38180j92702k15888k27034r6679
2549.5H68950307R1672J60754J32322J06633P2300j5914j32024j61290n7340M6432
2569.9H69193852O5744O3062P3909O1095n126o1273j4425N0783J729q7977j01983r8050
2594.4H69141340j51932j87993j39356q9347j23739j80602j50204m8518j9431r1434
2614.8H67958784j10865m5776l8326j27256j62482p9155m0650j21534j75297j38402
2635.2H66919041j10925j40607j52528p6413J013l4392q6606l9458J729o8069j32560
$$ plain form
2486.3 872220397 872053504 871921480 871812046 871684253 871519268 871369243 871290088 871254981 871207535 871187449
2506.7 871187449 871251822 871295094 871206760 871056318 870940328 870835900 870699286 870607793 870651603 870744824 870752990
2529.1 870752990 870671272 870548785 870394945 870182991 869920790 869682610 869489908 869274020 869046986 868950307
2549.5 868950307 869041979 869202733 869335055 869441688 869513988 869498074 869366050 869204760 869147420 869193852
2569.9 869193852 869259596 869322658 869396567 869457662 869452536 869391263 869376838 869427621 869429350 869341373 869239390 869141340
2594.4 869141340 868989408 868801415 868662059 868572712 868448973 868268371 868118167 868069649 868050218 867958784
2614.8 867958784 867847919 867802143 867763817 867636561 867474079 867394924 867354274 867232740 867057443 866919041
2635.2 866919041 866808116 866667509 866514981 866438568 866439581 866405189 866318583 866279125 866280854 866212785 866080225
2657.6H66080225m4644O7651L934j28687j14560j4841l4213j24872j08123n0068j18911
2680.1H65412891k58565k50220p3314J8418n3227r8348p4565r3997j72496k09033j29759
2702.5H64017785p4327j70947k42769j47760m1843p4148j43409o7532O7354M5061l3856
2724.9H63133609J0968P4625J1622j10864r9003n305n6386j89901j97529j03832j25825
2747.4H62342179l00646l61443k42889j98125k80500l04341k53916k61724l52561l79742
2767.8H59406292k62200j36912j53125k59220k57611j82391k31564l06427k02477q0228
2788.2H57334137k23517m55082m20928k01881j13249j15454R6142M66645O62506N83589
2808.6H57612908L38912Q3625j33693l20852l61740k90990l29674m67777m82261l63648
$$ plain form
2657.6 866080225 866035581 866103232 866107166 865978479 865863919 865849078 865814865 865689993 865581870 865531802 865412891
2680.1 865412891 865154326 864904106 864830792 864849210 864795983 864697635 864623070 864529073 864356577 864147544 864017785
2702.5 864017785 863943458 863772511 863529742 863381982 863340139 863265991 863122582 863055050 863122404 863167465 863133609
2724.9 863133609 863144577 863219202 863230824 863119960 863020957 863015652 862959266 862769365 862571836 862468004 862342179
2747.4 862342179 862041533 861680090 861437201 861239076 860958576 860654235 860400319 860138595 859786034 859406292
2767.8 859406292 859144092 859007180 858854055 858594835 858337224 858154833 857923269 857616842 857414365 857334137
2788.2 857334137 857110620 856655538 856234610 856032729 855919480 855804026 855900168 856366813 857029319 857612908
2808.6 857612908 857951820 858035445 857901752 857580900 857219160 856928170 856598496 856130719 855648458 855284810
2828.9H55284810l15309l56078k79545o6638j28150n53966p79450o61671o39558p92205
2849.3H50712240p32899l28064O4910J83463J09553L9995P5459J42932K60174N50032
2869.7H51077795Q06570N63383J013k05636j01387j35422l19600m02093l16739k96354
2890.1H50671530m00186m19974l89993m58122m65273k57195l8087n0068k00331k31504
2910.5H47760797j77384l32117o66499q34107p22051m76778k75969j03712Q6307J77086
2930.9H44435573K51889M50373O86407Q22425P97987O21736L66389J22488m6075j16467
2951.3H48392725j93596k95341l30746l43204l50892l63648m44949n59151n88715m39286
2971.7H44483197k41339j89782j02877J33931K07782N3585o6400l8862P7903O0082
$$ plain form
2828.9 855284810 854969501 854613423 854333878 854267240 854139090 853585124 852805674 852144003 851504445 850712240
2849.3 850712240 849979341 849651277 849716187 849899650 850009203 850049198 850124657 850267589 850527763 851077795
2869.7 851077795 851884365 852447748 852448761 852243125 852141738 852006316 851686716 851284623 850967884 850671530
2890.1 850671530 850271344 849851370 849461377 849003255 848537982 848280787 848242700 848192632 847992301 847760797
2910.5 847760797 847583413 847251296 846584797 845750690 845028639 844551861 844275892 844172180 844258487 844435573
2930.9 844435573 844687462 845137835 845824242 846646667 847444654 848066390 848432779 848555267 848509192 848392725
2951.3 848392725 848199129 847903788 847573042 847229838 846878946 846515298 846070349 845511198 844922483 844483197
2971.7 844483197 844241858 844052076 843949199 844083130 844290912 844344497 844278097 844239235 844317138 844377220
2992.1H44377220j32025j33872K9862O0261O8068J65999K67088L18826K83360J14858
3012.5H45419645j47640l77357n17130n62966m71473l96013m92513n10753l41355k46108
3032.9H41356337m22597o39737n29706l51310m93228p84993q95977q11935q18431r58562
3053.3H34649861r84252r05335p96794o01590l71874j70648j13248k34485k67625o8068
3073.7H30135942K36392M49001M56035M19140M09901K14637m2618k04086m67539p20501
3094.1H30886304o63042m53651n42104j027763j493513j645148j675189j632333j016139
3112.4H20737422K0802K35855p20262j856029k238870j605988m76837N10037J180649
3130.8H15786779J601458J806616J725495J323641P69972M49539M35769M73976N41806
$$ plain form
2992.1 844377220 844245195 844111323 844141185 844201446 844269514 844435513 844702601 845021427 845304787 845419645
3012.5 845419645 845272005 844894648 844377518 843814552 843343079 842947066 842454553 841943800 841602445 841356337
3032.9 841356337 840933740 840294003 839764297 839412987 838919759 838134766 837238789 836426854 835608423 834649861
3053.3 834649861 833665609 832760274 831963480 831361890 830990016 830819368 830706120 830471635 830204010 830135942
3073.7 830135942 830372334 830821335 831277370 831696510 832106411 832321048 832278430 832074344 831606805 830886304
3094.1 830886304 830223262 829769611 829227507 828199744 826706231 825061083 823385894 821753561 820737422
3112.4 820737422 820758224 820994079 820273817 818417788 816178918 814572930 814096093 814606130 815786779
3130.8 815786779 817388237 819194853 820920348 822243989 823013961 823463500 823899269 824373245 824915051
3149.2H24915051N02587j0491o47842p86007p17759q97408j180231j313448j350403
3167.5H18514049j518846j770913j890361j949966k063811k130509k085209j964330
3183.8H03140104j838982j675546j321674p71403j79291L37303P46727R69290Q97527
3202.2H00304055O38366M15862K81274J78337J9252k07603m15027o61552r65237j178742
3222.6G98408985j287520j377046j451850j438975j475990j816809k205491k317608
3238.9G85037696k287686k241611k148092k118170k181947k100706j872719j678288
3255.2G68408477j494169j190483p65861l07858J38700N17607O52790K89202k98321
3273.6G65950084o09935o99520p29799p27177p88450r56595j143932j276195j539409
$$ plain form
3149.2 824915051 825417638 825407147 824759305 823973298 823255539 822358131 821177900 819864452 818514049
3167.5 818514049 816995203 815224290 813333929 811383963 809320152 807189643 805104434 803140104
3183.8 803140104 801301122 799625576 798303902 797532499 797353208 797690511 798437238 799406528 800304055
3202.2 800304055 800942421 801358283 801639557 801817894 801837146 801629543 801214516 800552964 799587727 798408985
3222.6 798408985 797121465 795744419 794292569 792853594 791377604 789560795 787355304 785037696
3238.9 785037696 782750010 780508399 778360307 776242137 774060190 771959484 770086765 768408477
3255.2 768408477 766914308 765723825 764957964 764650106 764788806 765306413 765959203 766248405 765950084
3273.6 765950084 765340149 764640629 763910830 763183653 762395203 761438608 760294676 759018481 757479072
3291.9G57479072k080143k592564k786159k540886j799763r23931m64201l71814k11895
3310.3G43707716J05680M43041O42836O78837O30856N24044L37899M410k99632l63887
3330.7G46411800l40521l31759l27290n08785p86006q79705r08137r17911q87990j137674
3351.1G39386022j635909j930237j924276j891196k043664k214313k152026k064168
3367.4G23530233k340436k822340k915084k606630k376080k330124k336025k266586
3383.7G03536928k073229j781702j510799j596510j936197j908303j431763j173913
3400F90124512j576662k016902j818300j410961j266956j268029j342357j376748j196861
3418.4F76850736j002967r44793q04842n04851k65003k66730k32041o616l7074l30389
$$ plain form
3291.9 757479072 755398929 752806365 750020206 747479320 745679557 744755626 744291425 743919611 743707716
3310.3 743707716 743813396 744256437 744899273 745578110 746208966 746733010 747070909 747075319 746775687 746411800
3330.7 746411800 746071279 745739520 745412230 744903445 744117439 743237734 742329597 741411686 740523696 739386022
3351.1 739386022 737750113 735819876 733895600 732004404 729960740 727746427 725594401 723530233
3367.4 723530233 721189797 718367457 715452373 712845743 710469663 708139539 705803514 703536928
3383.7 703536928 701463699 699681997 698171198 696574688 694638491 692730188 691298425 690124512
3400 690124512 688547850 686530948 684712648 683301687 682034731 680766702 679424345 678047597 676850736
3418.4 676850736 675847769 674902976 674098134 673593283 673328280 673061550 672829509 672822893 672785819 672455430
3438.8F72455430l28600L5107L71933N37872O16789O59525P05123P87139R21011J052499
3459.2F77813828J057148J104951J363039J504779J194417P36535P15434J030744J313626
3477.5F87834501J340151J121700J121998J327514J311720J195431J225233J348197
3493.8F97826445J463354J437545J357078J359224J278818J161993J223504J468718
3510.2G08576679J743615J710832J438916J362264J526952J693308J582027J368999
3526.5G21003592J511633J803041J854241J823485J770138J652062J681328J792312
3542.8G34891832J778304J680792J677751J737476J789033J864731J868248J813055
3559.1G49101222J745760J500189J318932J906335K727866K674818K251149K131283
$$ plain form
3438.8 672455430 672126830 672161937 672533870 673071742 673688531 674348056 675053179 675840318 676761329 677813828
3459.2 677813828 678870976 679975927 681338966 682843745 684038162 684774697 685490131 686520875 687834501
3477.5 687834501 689174652 690296352 691418350 692745864 694057584 695253015 696478248 697826445
3493.8 697826445 699289799 700727344 702084422 703443646 704722464 705884457 707107961 708576679
3510.2 708576679 710320294 712031126 713470042 714832306 716359258 718052566 719634593 721003592
3526.5 721003592 722515225 724318266 726172507 727995992 729766130 731418192 733099520 734891832
3542.8 734891832 736670136 738350928 740028679 741766155 743555188 745419919 747288167 749101222
3559.1 749101222 750846982 752347171 753666103 755572438 758300304 760975122 763226271 765357554
3575.4G65357554K220750K389908K504646K291263J869916J983762K641142K699673
3591.7G83958614K360165K433181K671599K640665K492130K219259J794756J780987
3608.1H02351356K142965K260805K206265J959503J851559K352893K461612J626909
3624.4H19213867N91636P01487K173364K554178J861453J362801J171887J079023Q23676
3642.7H31533372J69039m64260J26242J638830J767456R76801R82404J243293P57277
3661.1H38730454K17557q2850o01828p77364j17004p6353j52588Q86917J333654R87947
3681.5H40348542N54800k8134l55363R9302Q83758J077890O91116J98066r5009M6670
3701.9H43421638L84629J45554n14686p41422Q2076R99391P62641M0531l60667l53575
$$ plain form
3575.4 765357554 767578304 769968212 772472858 774764121 776634037 778617799 781258941 783958614
3591.7 783958614 786318779 788751960 791423559 794064224 796556354 798775613 800570369 802351356
3608.1 802351356 804494321 806755126 808961391 810920894 812772453 815125346 817586958 819213867
3624.4 819213867 819805503 820506990 822680354 825234532 827095985 828458786 829630673 830709696 831533372
3642.7 831533372 831702411 831238151 831364393 833003223 834770679 835747480 836729884 837973177 838730454
3661.1 838730454 838948011 838865161 838263333 837485969 837368965 837292612 837140024 838026941 839360595 840348542
3681.5 840348542 840903342 840875208 840519845 840619147 841502905 842580795 843271911 843469977 843374968 843421638
3701.9 843421638 843806267 843951821 843437135 842695713 842777789 843777180 844539821 844580352 844219685 843866110
3722.3H43866110j45435J23202J15395m14670q53300m32908N95748R39191O020j162947
3742.7H42636406r03189J37031j20043q2553R78947J041233L07382M7862L04759J89542
3763.1H44537377k06232k89082j19627K46465M47214J69337k14398k47955j5736P2062
3783.5H44379425J40667J95265O5207j20461m04656o37114o05881n66065j77980K88785
3803.9H42557192J35839L48449O34014L278q21471p91311l68834m05669J63436P73907
3824.3H42228830M26173l3200l03685l50178l08633n27560m50850K32697P06732P19428
3844.6H42339754K98798n58913j580953j648963M30525J641929Q22961k04503o22094
3863H40918541l01659j04785l07858l9756M02927M95195J28210m56929l30150K5212
$$ plain form
3722.3 843866110 843720675 843843877 843959272 843544602 842691302 842258394 842854142 843793333 843799353 842636406
3742.7 842636406 841733217 841870248 841750205 841667652 842646599 843687832 843995214 844043076 844347835 844537377
3763.1 844537377 844331145 844042063 843922436 844168901 844616115 844785452 844571054 844323099 844307363 844379425
3783.5 844379425 844520092 844715357 844780564 844660103 844255447 843618333 843012452 842446387 842268407 842557192
3803.9 842557192 842693031 843041480 843675494 843678772 842857301 842065990 841697156 841291487 841454923 842228830
3824.3 842228830 842655003 842621803 842318118 841967940 841659307 841131747 840680897 840913594 841620326 842339754
3844.6 842339754 842638552 842079639 840498686 838849723 839280248 840922177 841745138 841540635 840918541
3863 840918541 840616882 840512097 840204239 840164483 840567410 841062605 841190815 840733886 840403736 840428948
3883.4H40428948O4493J47402n9366q8215K88844L9041o51121p93219l47256K08914
3903.8H39238465P01368P97629M67062M0948l51309m68970j26958J65105K6822q7916
3924.2H40402246N3763l2187k87115j08719K81393K45333p3910k50995j52468K6762
3944.6H40104103m2260j06692Q1360J42336j1682p5340n663J9014m2558p8380j8298
3967H39965940M8875j967p9155j5020P0393l58o2644K7716M7922j17540j72913j431
3991.5H39709818J04666J9431p9691
3997.6H39754224
$$ plain form
3883.4 840428948 840493441 840640843 840581477 840493262 840782106 840821147 840170026 839376807 839029551 839238465
3903.8 839238465 839939833 840737462 841204524 841245472 840894163 840425193 840298235 840463340 840490162 840402246
3924.2 840402246 840456009 840423822 840136707 840027988 840309381 840554714 840480804 840229809 840077341 840104103
3944.6 840104103 840061843 839955151 840036511 840178847 840167165 840091825 840086162 840105176 840062618 839984238 839965940
3967 839965940 840014815 840012848 839933693 839918673 839989066 839988708 839926064 839953780 840001702 839884162 839711249 839709818
3991.5 839709818 839814484 839833915 839754224
3997.6 839754224
##END=$$ End of the data block
