##TITLE=p-benzoquinona $$ Begin of the data block
##JCAMP-DX=5.00 $$ ACD/SpecManager v 10.08
##SPECTROMETER/DATA SYSTEM=Alpha
##DATE=25 Aug 2016 08:17:10
##DATA TYPE=INFRARED SPECTRUM
##DATA CLASS=XYDATA
##ORIGIN=
##OWNER=
##NPOINTS=1765
##FIRSTX=399.77209473
##LASTX=3997.72216797
##MAXX=3997.72216797
##MINX=399.77209473
##MAXY=1.00000000
##MINY=0.32363236
##XFACTOR=1.0000000000
##YFACTOR=0.000000010000000
##FIRSTY=1.00000000
##DELTAX=2.03965425
##XUNITS=1/CM
##YUNITS=ARBITRARY UNITS
##XYDATA=(X++(Y..Y))
$$ plain form
399.8 100000000 99783254 99291158 98787588 98214293 97657633 97466385 97462803 97233963 96942639 96952099
420.2 96952099 97006226 96956241 96893436 96588528 95994842 95450717 94913012 94038528 92765772 90852910
440.6 90852910 87923968 84925169 83521938 84016538 86009341 89353377 92844301 95006877 95914626
458.9 95914626 96359414 96522111 96435839 96374375 96314466 96049958 95786953 95725870 95683289 95595747 95528042
481.4 95528042 95353359 95025063 94778252 94662637 94465929 94207567 94021118 93756986 93285775 92756456
501.8 92756456 92221272 91481698 90508723 89366072 87690502 85177207 82843977 82136935 82401931
520.1 82401931 81916022 80573165 79618514 79823458 81033796 83423585 86889213 90110129 91911280
538.5 91911280 92344290 92111957 91774446 91451383 91068077 90683389 90369278 90031147 89609629 89227593
$$ packed form
399.8A00000000k16746m92096n03570n73295n56660j91248l582k28840k91324R460
420.2I6952099N4127m9985o2805l04908n93686n44125n37705q74484j272756j912862
440.6I0852910k928942k998799j403231M94600J992803L344036L490924K162576R07749
458.9I5914626M44788J62697q6272o1464n9909k64508k63005o1083m2581q7542o7705
481.4I5528042j74683l28296k46811j15615j96708k58362j86449k64132m71211n29319
501.8I2756456n35184p39574r72975j142651j675570k513295k333230p07042K64996
520.1H2401931m85909j342857r54651K04944J210338K389789L465628L220916J801151
538.5I1911280M33010k32333l37511l23063l83306l84688l14111l38131m21518l82036
$$ plain form
558.9 89227593 88934904 88668352 88457739 88322037 88145024 87896377 87682247 87486541 87232363 86985004
579.3 86985004 86789131 86564356 86324662 86138272 85915935 85572898 85199696 84841478 84404445 83910173
599.7 83910173 83494198 83143008 82801104 82563198 82457751 82374924 82311720 82366079 82543439 82809293
620.1 82809293 83195382 83664089 84087569 84449911 84801352 85051537 85127187 85129857 85105544 84972590 84783375
642.5 84783375 84704196 84700513 84677356 84699708 84678650 84400094 83944207 83497059 83015990 82453406 81921113
664.9 81921113 81308997 80521858 79945266 79486978 78936118 78331381 77833784 77506196 77296656 77253795
685.3 77253795 77472246 77927119 78587085 79490393 80533344 81463426 82253408 83299387 84753811
703.7 84753811 86113417 87042964 87667429 88072115 88341701 88565159 88662809 88586438 88456690 88298523
$$ packed form
558.9H9227593k92689k66552k10613j35702j77013k48647k14130j95706k54178k47359
579.3H6985004j95873k24775k39694j86390k22337l43037l73202l58218m37033m94272
599.7H3910173m15975l51190l41904k37906j05447q2827o3204N4359J77360K65854
620.1H2809293L86089M68707M23480L62342L51441K50185P5650K670k4313j32954j89215
642.5H4783375p9179l683k3157K2352k1058k78556m55887m47148m81069n62584n32293
664.9H1921113o12116p87139n76592m58288n50860o04737m97597l27588k09540m2861
685.3G7253795K18451M54873O59966R03308J042951R30082P89982J045979J454424
703.7H4753811J359606R29547O24465M04686K69586K23458R7650p6371j29748j58167
$$ plain form
724.1 88298523 88032907 87720370 87412500 86988330 86443758 85988015 85634714 85190213 84614772 83916396
744.5 83916396 82899195 81292468 78767592 74797988 69201320 63398921 60056508 60195470 62943816
762.8 62943816 67870080 73967737 79046947 82162410 83879441 84775013 85192037 85434264 85619223
781.2 85619223 85725063 85799736 85868937 85864359 85777897 85659724 85477006 85154951 84656620 83951253 83006692
803.6 83006692 81920266 81085110 80712986 80422270 79944652 79385448 78575033 77045065 74442816
822 74442816 70969260 67638850 65065223 62792718 61745799 64520991 70795733 77300519 82898974
840.3 82898974 87882704 91344017 92894363 93279040 93129784 92730784 92259747 91814685 91332370
858.7 91332370 90670437 89793885 88611221 86627764 83132041 78029025 72952712 71258694 74945581
$$ packed form
724.1H8298523k65616l12537l07870m24170n44572m55743l53301m44501n75441o98376
744.5H3916396j017201j606727k524876l969604n596668n802399l342413J38962K748346
762.8F2943816M926264O097657N079210L115463J717031Q95572M17024K42227J84959
781.2H5619223J05840P4673O9201m578q6462j18173j82718l22055m98331p05367r44561
803.6H3006692j086426q35156l72124k90716m77618n59204q10415j529968k602249
822G4442816l473556l330410k573627k272505j046919K775192O274742O504786N598455
840.3H2898974M983730L461313J550346L84677j49256l99000m71037m45062m82315
858.7I1332370o61933q76552j182664j983457l495723n103016n076313j694018L686887
$$ plain form
877.1 74945581 81795812 88404548 93635660 97227210 99060142 99730593 99919838 99962246 99928278
895.4 99928278 99777901 99585843 99410301 99209481 98979789 98752570 98483402 98123860 97699350 97202551
915.8 97202551 96599859 96015263 95605171 95315880 95049584 94841468 94686991 94474256 94115156 93551582
936.2 93551582 92744339 91825169 90988183 90303940 90038526 90625894 92079091 93831182 95169634
954.6 95169634 95794147 95862591 95625520 95272535 94904083 94519299 94118768 93754172 93432790 93096548
975 93096548 92708004 92249185 91810727 91599101 91568881 91430736 91084772 90640032 90239096 89929312
995.4 89929312 89603025 89156175 88662452 88252079 87644935 86713147 86307740 86925727 87801635 88199419
1015.8 88199419 88112891 87813717 87484026 87164462 86852962 86556101 86279005 86010873 85736752 85453039
$$ packed form
877.1G4945581O850231O608736N231112L591550J832932O70451J89245M2408l3968
895.4I9928278j50377j92058j75542k00820k29692k27219k69168l59542m24510m96799
915.8I7202551o02692n84596m10092k89291k66296k08116j54477k12735l59100n63574
936.2I3551582q07243r19170q36986o84243k65414N87368J453197J752091J338452
954.6I5169634O24513O8444k37071l52985l68452l84784m00531l64596l21382l36242
975I3096548l88544m58819m38458k11626l0220j38145l45964m44740m00936l09784
995.4H9929312l26287m46850m93723m10373o07144r31788m05407O17987Q75908L97784
1015.8H8199419q6528k99174l29691l19564l11500k96861k77096k68132k74121k83713
$$ plain form
1036.1 85453039 85193217 84993380 84834886 84672987 84485984 84284538 84092945 83931810 83780551 83585745
1056.5 83585745 83304018 82934135 82492793 81974185 81335270 80502820 79390627 77891874 76097232
1074.9 76097232 74777961 75013256 76454544 77415061 77115637 76100779 75140947 74113530 71947908
1093.3 71947908 68953735 67095017 66948271 68366694 71921837 76256192 78826040 79194552 78405309
1111.6 78405309 77270567 76192087 75399441 74946433 74726444 74589491 74409008 74119139 73761326
1130 73761326 73445433 73190838 72905588 72517383 72028571 71451050 70792079 70070010 69304550 68519253
1150.4 68519253 67739075 66955173 66116464 65190703 64182603 63190740 62375230 61674297 60834789 59769899
1170.8 59769899 58564514 57281178 55916512 54447341 52868247 51180565 49407518 47647461
$$ packed form
1036.1H5453039k59822j99837j58494j61899j87003k01446j91593j61135j51259j94806
1056.5H3585745k81727l69883m41342n18608o38915q32450j112193j498753j794642
1074.9G6097232j319271K35295J441288R60517k99424j014858r59832j027417k165622
1093.3G1947908k994173j858718j46746J418423L555143M334355K569848L68512p89243
1111.6G8405309j134742j078480p92646m53008k19989j36953j80483k89869l57813
1130G3761326l15893k54595k85250l88205m88812n77521o58971p22069p65460p85297
1150.4F8519253p80178p83902q38709r25761j008100r91863q15510p00933q39508j064890
1170.8E9769899j205385j283336j364666j469171j579094j687682j773047j760057
$$ plain form
1187.1 47647461 46084616 44910669 44212902 43895757 43725690 43447486 42861494 41873214 40527067
1205.4 40527067 39025819 37649950 36609739 36034259 36085400 36861613 38190883 39860621 42024389
1223.8 42024389 44964588 48442522 51673526 53968745 55151260 55369526 54801881 53695840 52545732
1242.2 52545732 52022129 52617598 54276842 56243980 57268596 56346804 54045767 53074574 56101882
1260.5 56101882 62701017 69870842 75276101 78603929 80510926 81600112 82289815 82799417 83125812
1278.9 83125812 83250344 83237809 83122241 82914591 82662928 82382119 82034016 81624687 81183583 80682409
1299.3 80682409 80072308 79338485 78468388 77444595 76284260 74973285 73369157 71197367 68373781
1317.6 68373781 66067410 66283268 68788224 71059150 71693951 71178168 70299774 69462550 68689400
$$ packed form
1187.1D7647461j562845j173947o97767l17145j70067k78204n85992r88280j346147
1205.4D0527067j501248j375869j040211n75480N1141P76213J329270J669738K163768
1223.8D2024389K940199L477934L231004K295219J182515K18266n67645j106041j150108
1242.2E2545732n23603N95469J659244J967138J024616r21792k301037r71193L027308
1260.5E6101882O599135P169825N405259L327828J906997J089186O89703N09602L26395
1278.9H3125812J24532j2535j15568k07650k51663k80809l48103m09329m41104n01174
1299.3H0682409o10101p33823q70097j023793j160335j310975j604128k171790k823586
1317.6F8373781k306371K15858K504956K270926O34801n15783q78394q37224p73150
$$ plain form
1336 68689400 67858279 67029214 66360992 65793955 65149260 64354330 63454634 62509519 61562663 60884619
1356.4 60884619 60784662 60949790 60836631 60668147 61063731 62100685 63398778 64887697 66869050
1374.7 66869050 69167721 71268368 72882956 74004465 74826854 75531369 76123577 76517278 76722598
1393.1 76722598 76861310 77026260 77213418 77356297 77374899 77257240 77013683 76635200 76148075 75567532
1413.5 75567532 74863243 74004489 73061681 72189355 71277457 70252854 69144917 67938745 66813219
1431.8 66813219 65874511 64928502 63925189 62881708 61550337 59901732 58115953 56285298 54434448
1450.2 54434448 52489126 50320816 47658947 45201373 44026440 43337712 42181563 40508136 38905007
1468.6 38905007 37575343 36679721 36706057 37844324 40102091 43534076 47804675 52138454 56099147
$$ packed form
1336F8689400q31121q29065o68222n67037o44695p94930q99696r45115r46856o78044
1356.4F0884619r9957J65128j13159j68484L95584J036954J298093J488919J981353
1374.7F6869050K298671K100647J614588J121509Q22389P04515N92208L93701K05320
1393.1G6722598J38712J64950J87158J42879J8602j17659k43557l78483m87125n80543
1413.5G5567532p04289q58754r42808q72326r11898j024603j107937j206172j125526
1431.8F6813219r38708r46009j003313j043481j331371j648605j785779j830655j850850
1450.2E4434448j945322k168310k661869k457574j174933o88728j156149j673427j603129
1468.6C8905007j329664q95622K6336J138267K257767L431985M270599M333779L960693
$$ plain form
1486.9 56099147 59503937 62038898 63502610 64172208 64414990 64353681 63906425 62915468 60867286
1505.3 60867286 57389188 54137743 51729786 49879763 48896396 49505737 52692574 58760875 65285546
1523.6 65285546 70200723 73526615 75209779 75825810 76128972 76408422 76579762 76861250 77549225
1542 77549225 78479695 79492652 80485868 81413633 82145649 82540888 82529432 82171738 81937987 81923425
1562.4 81923425 81725180 81321669 80813450 80311334 79820967 79123884 78227705 77411181 76449323 74914765
1582.8 74914765 72813106 71033049 70879841 72254115 73710769 74337190 74200583 73597956 72677147
1601.1 72677147 71530420 70219421 68753958 67131108 65408027 63536227 61153543 58314633
1617.5 58314633 55979788 53736824 50410855 45918992 40668982 35609016 32470924 32363236 36292383
$$ packed form
1486.9E6099147L404790K534961J463712O69598K42782o1309m47256r90957k048182
1505.3F0867286l478098l251445k407957j850023r83367O09341L186837O068301O524671
1523.6F5285546M915177L325892J683164O16031L03162K79450J71340K81488O87975
1542G7549225R30470J012957R93216R27765P32016L95239j1456l57694k33751j4562
1562.4H1923425j98245m03511n08219n02116m90367o97083q96179q16524r61858j534558
1582.8G4914765k101659j780057j53208J374274J456654O26421j36607o02627r20809
1601.1G2677147j146727j310999j465463j622850j723081j871800k382684k838910
1617.5E8314633k334845k242964l325969m491863n250010n059966l138092j07688L929147
$$ plain form
1635.8 36292383 42777634 49395528 55719590 61270595 66347671 70722938 73500794 75723213
1652.1 75723213 78434157 80589777 82152355 83540690 84927684 86296904 87359309 88169920 88926589
1670.5 88926589 89525670 89921963 90259731 90480065 90440673 90086859 89692557 89672261 89858788 90052468
1690.9 90052468 90081769 89859599 89565563 89400995 89421797 89510810 89513886 89559627 89703900 89842600 89938700
1713.3 89938700 90013301 90189415 90509146 90788347 90995419 91293353 91772091 92363095 92900074 93452221
1733.7 93452221 94125718 94671547 95110631 95570523 96011609 96362150 96613508 96860725 97161019 97378176
1754.1 97378176 97466934 97540158 97639716 97807670 98028249 98140860 98092848 97952837 97847855 97866815 97893173
1776.5 97893173 97847337 97780675 97734207 97715271 97737432 97746104 97719485 97809684 98029000 98195457 98292893
$$ packed form
1635.8C6292383O485251O617894O324062N551005N077076M375267K777856K222419
1652.1G5723213K710944K155620J562578J388335J386994J369220J062405Q10611P56669
1670.5H8926589N99081L96293L37768K20334l9392l53814l94302k0296J86527J93680
1690.9I0052468K9301k22170k94036j64568K0802Q9013L076M5741J44273J38700R6100
1713.3H9938700P4601J76114L19731K79201K07072K97934M78738N91004N36979N52147
1733.7I3452221O73497N45829M39084M59892M41086L50541K51358K47217L00294K17157
1754.1I7378176Q8758P3224R9558J67954K20579J12611m8012j40011j04982J8960K6358
1776.5I7893173m5836o6662m6468j8936K2161Q672k6619R0199K19316J66457R7436
$$ plain form
1799 98292893 98441213 98673058 98908675 99102169 99254656 99401814 99571985 99728441 99831039 99885356
1819.4 99885356 99891305 99870598 99821031 99758303 99677825 99622381 99551135 99416274 99277973 99155807 98987842
1841.8 98987842 98779160 98607296 98396111 98025864 97512877 97029841 96801043 96818107 96871591 96837586
1862.2 96837586 96710449 96453166 96073067 95777571 95696718 95718235 95815605 96123374 96673471 97297740
1882.6 97297740 97796732 98081571 98189509 98227412 98234975 98195255 98132265 98067009 97995025 97911781 97820431
1905 97820431 97722054 97620434 97520739 97409123 97254342 97061270 96891373 96767592 96701819 96713412 96748012
1927.5 96748012 96752924 96727526 96688396 96648031 96599537 96525180 96435630 96374452 96339297 96293241 96230769 96155840
1952 96155840 96071821 95983714 95883083 95753860 95588356 95406437 95279413 95247674 95227122 95130950 94964975
$$ packed form
1799I8292893J48320K31845K35617J93494J52487J47158J70171J56456J02598N4317
1819.4I9885356N949k0707m9567o2728q0478n5444p1246j34861j38301j22166j67965
1841.8I8987842k08682j71864k11185l70247n12987m83036k28798J7064N3484l4005
1862.2I6837586j27137k57283l80099k95496q0853K1517R7370L07769N50097O24269
1882.6I7297740M98992K84839J07938L7903P563l9720o2990o5256p1984q3244r1350
1905I7820431r8377j01620r9695j11616j54781j93072j69897j23781o5773J1593L4600
1927.5I6748012M912k5398l9130m0365m8494p4357q9550o1178l5155m6056o2472p4929
1952I6155840q4019q8107j00631j29223j65504j81919j27024l1739k0552r6172j65975
$$ plain form
1974.4 94964975 94762170 94584358 94535094 94623989 94723350 94738173 94681972 94595474 94509071 94431186 94347149
1996.8 94347149 94257003 94173861 94106460 94054568 94009006 93965840 93930334 93901080 93868935 93841183 93823230 93794918
2021.3 93794918 93742061 93699706 93718439 93766445 93783176 93770671 93749225 93738252 93753678 93785328 93809581 93816513
2045.8 93816513 93808073 93784302 93750310 93716037 93678737 93633628 93593472 93559510 93515331 93466443 93428004 93393308
2070.3 93393308 93356961 93331182 93318272 93300259 93271881 93243515 93209070 93161410 93115002 93080807 93049926 93023545
2094.7 93023545 93014544 93014562 93005431 92986768 92963105 92929238 92888141 92852169 92824757 92807913 92810690 92827988 92841035
2121.3 92841035 92848212 92861933 92875719 92872822 92854881 92827326 92793304 92766750 92753339 92735028 92699623 92663497
2145.7 92663497 92638540 92608279 92565519 92523080 92477119 92418092 92361265 92321539 92285281 92239547 92197895 92174494
$$ packed form
1974.4I4964975k02805j77812m9264Q8895R9361J4823n6201q6498q6403p7885q4037
1996.8I4347149r0146q3142o7401n1892m5562m3166l5506k9254l2145k7752j7953k8312
2021.3I3794918n2857m2355J8733M8006J6731j2505k1446j0973J5426L1650K4253O932
2045.8I3816513q440k3771l3992l4273l7300m5109m0156l3962m4179m8888l8439l4696
2070.3I3393308l6347k5779j2910j8013k8378k8366l4445m7660m6408l4195l0881k6381
2094.7I3023545r001J8r131j8663k3663l3867m1097l5972k7412j6844K777J7298J3047
2121.3I2841035P177J3721J3786k897j7941k7555l4022k6554j3411j8311l5405l6126
2145.7I2663497k4957l0261m2760m2439m5961n9027n6827l9726l6258m5734m1652k3401
$$ plain form
2170.2 92174494 92158002 92139322 92128342 92119384 92098856 92073923 92051870 92026401 92000788 91979408 91950428 91908854
2194.7 91908854 91868550 91835803 91800195 91761184 91726285 91688073 91638780 91588587 91542751 91492629 91440493 91395694
2219.1 91395694 91350931 91295892 91240650 91192788 91144913 91098797 91061980 91025418 90979302 90931684 90887344 90835601
2243.6 90835601 90775585 90717030 90655917 90590000 90530807 90477508 90415883 90349501 90296495 90256000 90213984 90170968
2268.1 90170968 90133125 90093559 90046978 90001792 89961636 89919919 89878231 89838469 89787793 89722663 89656222 89591277
2292.6 89591277 89521849 89450783 89381421 89307952 89231640 89158869 89082658 88996512 88907301 88821357 88735563 88645369
2317 88645369 88551855 88457650 88365972 88282281 88197738 88094747 87985343 87893301 87808460 87708509 87598991
2339.5 87598991 87502056 87424761 87380093 87366450 87322861 87207210 87050366 86910176 86800551 86709857 86643159
$$ packed form
2170.2I2174494j6492j8680j0980q958k0528k4933k2053k5469k5613k1380k8980m1574
2194.7I1908854m0304l2747l5608l9011l4899l8212m9293n0193m5836n0122n2136m4799
2219.1I1395694m4763n5039n5242m7862m7875m6116l6817l6562m6116m7618m4340n1743
2243.6I0835601o0016n8555o1113o5917n9193n3299o1625o6382n3006m0495m2016m3016
2268.1I0170968l7843l9566m6581m5186m0156m1717m1688l9762n0676o5130o6441o4945
2292.6H9591277o9428p1066o9362p3469p6312p2771p6211q6146q9211q5944q5794r0194
2317H8645369r3514r4205r1678q3691q4543j02991j09404r2042q4841r9951j09518
2339.5H7598991r6935p7295m4668j3643m3589j15651j56844j40190j09625r0694o6698
$$ plain form
2361.9 86643159 86607522 86596698 86612654 86652589 86696577 86733693 86771429 86809427 86840165 86860955 86867374 86849940
2386.4 86849940 86804134 86735839 86652017 86555791 86450446 86339587 86223698 86105525 85993111 85888517
2406.8 85888517 85784930 85680324 85575235 85467136 85359663 85262406 85171270 85071069 84962487 84853280
2427.2 84853280 84741020 84621131 84494215 84363222 84228951 84092647 83958477 83828253 83702821 83584332
2447.6 83584332 83472592 83369470 83280349 83209497 83154684 83108294 83067006 83033490 83007121 82984251 82963103
2470 82963103 82940686 82915658 82888496 82857478 82821256 82784921 82755911 82738292 82735956 82754302 82795990 82858193
2494.5 82858193 82931900 83005702 83075511 83143133 83204848 83249432 83270371 83270699 83254051 83221823 83176231 83121014
2519 83121014 83058494 82987732 82905370 82808518 82697541 82576478 82446676 82307506 82159615 81999475 81824410
$$ packed form
2361.9H6643159l5637j0824J5956L9935M3988L7116L7736L7998L0738K0790O419j7434
2386.4H6849940m5806o8295q3822r6226j05345j10859j15889j18173j12414j04594
2406.8H5888517j03587j04606j05089j08099j07473r7257r1136j00201j08582j09207
2427.2H4853280j12260j19889j26916j30993j34271j36304j34170j30224j25432j18489
2447.6H3584332j11740j03122q9121p0852n4813m6390m1288l3516k6369k2870k1148
2470H2963103k2417k5028k7162l1018l6222l6335k9010j7619k336J8346M1688O2203
2494.5H2858193P3707P3802O9809O7622O1715M4584K0939L28j6648l2228m5592n5217
2519H3121014o2520p0762q2362r6852j10977j21063j29802j39170j47891j60140j75065
$$ plain form
2541.4 81824410 81642437 81462753 81283557 81098485 80910599 80726898 80547899 80377847 80224657 80086201
2561.8 80086201 79958296 79844964 79745519 79651850 79562122 79471189 79369247 79262334 79163671 79076540 78999829
2584.2 78999829 78934795 78886038 78855747 78843045 78851455 78880876 78924805 78979695 79044890 79117823 79194808 79276049
2608.7 79276049 79360121 79442501 79528129 79626763 79734343 79839694 79940665 80033445 80112749 80184072 80253541
2631.1 80253541 80321819 80387545 80448842 80498534 80528945 80546886 80561048 80564010 80545056 80508256 80460501 80395901
2655.6 80395901 80308634 80201805 80077469 79934949 79777515 79606402 79419905 79224133 79025972 78824031
2676 78824031 78615695 78403914 78194714 77994198 77811390 77650410 77504557 77368796 77249128 77148873
2696.4 77148873 77060682 76984644 76927114 76884091 76847410 76811945 76776391 76746261 76727229 76722175 76730347 76748288
$$ packed form
2541.4H1824410j81973j79684j79196j85072j87886j83701j78999j70052j53190j38456
2561.8H0086201j27905j13332r9445r3669q9728r0933j01942j06913r8663q7131p6711
2584.2G8999829o5034m8757l0291j2702Q410K9421M3929N4890O5195P2933P6985Q1241
2608.7G9276049Q4072Q2380Q5628R8634J07580J05351J00971R2780P9304P1323O9469
2631.1H0253541O8278O5726O1297M9692L0411J7941J4162K962j8954l6800m7755o4600
2655.6H0395901q7267j06829j24336j42520j57434j71113j86497j95772j98161k01941
2676G8824031k08336k11781k09200k00516j82808j60980j45853j35761j19668j00255
2696.4G7148873q8191p6038n7530m3023l6681l5465l5554l0130j9032n054Q172J7941
$$ plain form
2720.9 76748288 76774573 76803112 76821929 76824361 76816660 76807809 76799309 76795757 76801980 76816827 76847708 76904696 76981509
2747.4 76981509 77066827 77160949 77265197 77370280 77468973 77562112 77648240 77726185 77798724 77861130 77902943
2769.8 77902943 77927506 77943617 77942455 77917421 77882200 77847439 77811879 77774292 77729559 77663416 77568787 77455062
2794.3 77455062 77330989 77187210 77013248 76820081 76617259 76400149 76170313 75935239 75701278 75475574
2814.7 75475574 75262815 75058401 74853623 74651605 74468660 74320537 74210131 74128306 74063832 74008828
2835.1 74008828 73961687 73912841 73848486 73774374 73700982 73625416 73544782 73468512 73408777 73369390 73348045 73341316
2859.6 73341316 73343527 73350435 73360956 73370540 73375225 73374110 73358846 73319083 73262841 73203081 73136812 73055577 72957820
2886.1 72957820 72847396 72726339 72595125 72461051 72329640 72197092 72064906 71938056 71818447 71710223
$$ packed form
2720.9G6748288K6285K8539J8817K432p701q851q500l552O223J4847L0881N6988P6813
2747.4G6981509Q5318R4122J04248J05083R8693R3139Q6128P7945P2539O2406M1813
2769.8G7902943K4563J6111j162k5034l5221l4761l5560l7587m4733o6143r4629j13725
2794.3G7455062j24073j43779j73962j93167k02822k17110k29836k35074k33961k25704
2814.7G5475574k12759k04414k04778k02018j82945j48123j10406q1825o4474n5004
2835.1G4008828m7141m8846o4355p4112p3392p5566q0634p6270n9735l9387k1345o729
2859.6G3341316K211O908J0521R584M685j115j5264l9763n6242n9760o6269q1235r7757
2886.1G2957820j10424j21057j31214j34074j31411j32548j32186j26850j19609j08224
$$ plain form
2906.5 71710223 71618533 71542758 71471334 71398824 71337080 71290320 71241599 71177280 71100920 71018726 70934308 70852625
2931 70852625 70770311 70677584 70570993 70450753 70312870 70156944 69993901 69835883 69691086 69561267
2951.3 69561267 69442683 69330639 69222999 69120997 69013220 68881786 68729252 68567568 68399990 68231159
2971.7 68231159 68066859 67905611 67745304 67590898 67452359 67344677 67282903 67256957 67228490 67160213
2992.1 67160213 67037737 66867733 66658986 66416180 66148013 65863025 65565008 65256578 64937425 64601320
3012.5 64601320 64237410 63829124 63352519 62785089 62104642 61287838 60358208 59468675 58906579 58930027
3032.9 58930027 59544468 60435653 61151147 61432511 61334807 61009067 60550660 60018808 59435135 58802509
3053.3 58802509 58199269 57827353 57842302 58141363 58424765 58458763 58259326 58054066 58054513 58210009 58296043
$$ packed form
2906.5G1710223r1690p5775p1424p2510o1744m6760m8721o4319p6360q2194q4418q1683
2931G0852625q2314r2727j06591j20240j37883j55926j63043j58018j44797j29819
2951.3F9561267j18584j12044j07640j02002j07777j31434j52534j61684j67578j68831
2971.7F8231159j64300j61248j60307j54406j38539j07682o1774k5946k8467o8277
2992.1F7160213j22476j70004k08747k42806k68167k84988k98017l08430l19153l36105
3012.5F4601320l63910m08286m76605n67430o80447q16804r29630q89533n62096K3448
3032.9E8930027O14441Q91185P15494K81364r7704l25740m58407n31852n83673o32626
3053.3E8802509o03240l71916J4949K99061K83402L3998j99437k05260M47J55496Q6034
$$ plain form
3075.8 58296043 58211458 58008569 57759327 57497299 57226306 56957746 56706738 56470412 56256604 56084007
3096.2 56084007 55944788 55805868 55642569 55459648 55267644 55050910 54788995 54508144 54240900 53971463
3116.6 53971463 53684688 53382409 53066868 52759457 52480912 52218509 51949358 51677626 51434356 51237726
3136.9 51237726 51063371 50874144 50664562 50441110 50203735 49963948 49726528 49474502 49201915 48929179
3157.3 48929179 48671231 48427981 48190084 47943622 47688302 47432044 47175330 46913719 46644828 46367410
3177.7 46367410 46083483 45794159 45500916 45209914 44923198 44637194 44346523 44045302 43732974 43419617
3198.1 43419617 43111545 42805901 42504111 42211154 41932580 41687220 41492933 41348663 41248628 41188514
3218.5 41188514 41165188 41171005 41194755 41228929 41263264 41293240 41326103 41365632 41428769 41543719 41712058
$$ packed form
3075.8E8296043q4585k02889k49242k62028k70993k68560k51008k36326k13808j72597
3096.2E6084007j39219j38920j63299j82921j92004k16734k61915k80851k67244k69437
3116.6E3971463k86775l02279l15541l07411k78545k62403k69151k71732k43270j96630
3136.9E1237726j74355j89227k09582k23452k37375k39787k37420k52026k72587k72736
3157.3D8929179k57948k43250k37897k46462k55320k56258k56714k61611k68891k77418
3177.7D6367410k83927k89324k93243k91002k86716k86004k90671l01221l12328l13357
3198.1D3419617l08072l05644l01790k92957k78574k45360j94287j44270j00035o0114
3218.5D1188514k3326N817K3750L4174L4335K9976L2863L9529O3137J14950J68339
$$ plain form
3241 41712058 41915739 42146343 42405236 42680809 42958799 43239450 43524835 43814430 44111934 44420761
3261.4 44420761 44736272 45052069 45363352 45667678 45962894 46248779 46534023 46820483 47099474 47371945
3281.8 47371945 47642881 47904503 48148507 48379567 48589990 48763424 48904812 49027547 49144354 49272758
3302.1 49272758 49415737 49540347 49619943 49668223 49716547 49786618 49872601 49968490 50079572 50206882 50344104
3324.6 50344104 50471044 50582170 50698423 50829989 50980711 51148212 51298469 51408815 51496142 51573420
3345 51573420 51654762 51749873 51811814 51806051 51776129 51760292 51744735 51702964 51636946 51575685 51517546 51422292
3369.5 51422292 51271749 51109987 50993478 50923222 50878841 50856674 50869471 50928682 51039374 51201570 51368511
3391.9 51368511 51492947 51616883 51807213 52036995 52220351 52356410 52519262 52720875 52926356 53123915
$$ packed form
3241D1712058K03681K30604K58893K75573K77990K80651K85385K89595K97504L08827
3261.4D4420761L15511L15797L11283L04326K95216K85885K85244K86460K78991K72471
3281.8D7371945K70936K61622K44004K31060K10423J73434J41388J22735J16807J28404
3302.1D9272758J42979J24610P9596M8280M8324P0071Q5983R5889J11082J27310J37222
3324.6E0344104J26940J11126J16253J31566J50722J67501J50257J10346Q7327P7278
3345E1573420Q1342R5111O1941n763k9922j5837j5557m1771o6018o1261n8139r5254
3369.5E1422292j50543j61762j16509p0256m4381k2167J2797N9211J10692J62196J66941
3391.9E1368511J24436J23936J90330K29782J83356J36059J62852K01613K05481J97559
$$ plain form
3412.3 53123915 53310347 53492236 53688645 53902751 54128474 54368585 54629540 54907721 55181348 55457264
3432.7 55457264 55752903 56037223 56287694 56540412 56829023 57145500 57478940 57824254 58172840 58520776
3453.1 58520776 58875471 59244788 59623718 59996355 60370511 60776198 61203754 61596638 61931980 62263042
3473.5 62263042 62632817 63030118 63412869 63761979 64117777 64503181 64889014 65260178 65633726 66016662
3493.9 66016662 66407025 66794497 67171210 67546839 67916602 68269289 68624741 69012940 69432628 69843537
3514.3 69843537 70222980 70595860 70979244 71375525 71771204 72152323 72548592 72982305 73430562 73876023
3534.7 73876023 74311650 74735183 75164497 75598776 76020086 76429945 76843953 77264369 77695739 78141272
3555.1 78141272 78584397 79018873 79438019 79807007 80142206 80569226 81115115 81643784 82107836 82558018
$$ packed form
3412.3E3123915J86432J81889J96409K14106K25723K40111K60955K78181K73627K75916
3432.7E5457264K95639K84320K50471K52718K88611L16477L33440L45314L48586L47936
3453.1E8520776L54695L69317L78930L72637L74156M05687M27556L92884L35342L31062
3473.5F2263042L69775L97301L82751L49110L55798L85404L85833L71164L73548L82936
3493.9F6016662L90363L87472L76713L75629L69763L52687L55452L88199M19688M10909
3514.3F9843537L79443L72880L83384L96281L95679L81119L96269M33713M48257M45461
3534.7G3876023M35627M23533M29314M34279M21310M09859M14008M20416M31370M45533
3555.1G8141272M43125M34476M19146L68988L35199M27020N45889N28669M64052M50182
$$ plain form
3575.4 82558018 83022267 83496356 83966619 84398502 84776896 85193360 85713297 86221462 86670697 87132144
3595.8 87132144 87624913 88117307 88604021 89058059 89440519 89815128 90246141 90699333 91156256 91580313
3616.2 91580313 91984046 92476189 92994279 93380016 93602592 93851393 94337827 94870847 95312554 95700276
3636.6 95700276 96045935 96359527 96632832 96806681 96875960 97030735 97434211 97855467 98128724 98383564
3657 98383564 98676020 98897910 99027091 99083710 99031705 98926711 98919386 98906237 98852003 98976493 99212003
3679.5 99212003 99407750 99527764 99536133 99450499 99405777 99507159 99659437 99748164 99774218 99733013 99715334
3701.9 99715334 99777484 99814582 99734157 99595320 99584019 99744844 99881798 99891424 99822563 99761373 99745989
3724.3 99745989 99769968 99791634 99726701 99559093 99428135 99483138 99640536 99671900 99496680 99342090 99380767
$$ packed form
3575.4H2558018M64249M74089M70263M31883L78394M16464N19937N08165M49235M61447
3595.8H7132144M92769M92394M86714M54038L82460L74609M31013M53192M56923M24057
3616.2I1580313M03733M92143N18090L85737K22576K48801M86434N33020M41707L87722
3636.6I5700276L45659L13592K73305J73849O9279J54775M03476M21256K73257K54840
3657I8383564K92456K21890J29181N6619n2005j04994p325j3149n4234J24490K35510
3679.5I9212003J95747J20014Q369q5634m4722J01382J52278Q8727K6054m1205j7679
3701.9I9715334O2150L7098q0425j38837j1301J60825J36954R626o8861o1190j5384
3724.3I9745989K3979K1666o4933j67608j30958N5003J57398L1364j75220j54590L8677
$$ plain form
3746.8 99380767 99373424 99325830 99451888 99623203 99678761 99678993 99724436 99758416 99733829 99697679 99676424 99711543
3771.2 99711543 99788064 99813354 99760717 99703813 99705416 99717391 99716246 99732625 99755025 99752122 99691099 99587935
3795.7 99587935 99491441 99374670 99303734 99348044 99382418 99434352 99538398 99558526 99440628 99310505 99258167
3818.2 99258167 99207455 99247712 99383348 99457407 99467129 99437594 99392217 99343765 99259281 99206960 99266869 99379981
3842.6 99379981 99497569 99574113 99523443 99286038 99003476 99061209 99326855 99464202 99441457 99353355 99314177
3865.1 99314177 99292904 99227190 99219537 99296677 99386275 99416637 99349391 99300528 99301755 99306381 99353743 99384868
3889.5 99384868 99394381 99460375 99504071 99433666 99306130 99226213 99252546 99388170 99536914 99616492 99636364
3912 99636364 99610418 99555504 99538130 99579144 99613631 99625272 99650931 99667662 99656445 99666262 99717766 99759287
$$ packed form
3746.8I9380767p343m7594J26058J71315N5558K32M5443L3980k4587l6150k1255L5119
3771.2I9711543P6521K5290n2637n6904J603J1975j145J6379K2400k903o1023j03164
3795.7I9587935r6494j16771p0936M4310L4374N1934J04046K0128j17898j30123n2338
3818.2I9258167n0712M0257J35636P4059R722k9535m5377m8452q4484n2321N9909J13112
3842.6I9379981J17588P6544n0670k37405k82562N7733K65646J37347k2745q8102l9178
3865.1I9314177k1273o5714p653P7140Q9598L0362o7246m8863J227M626M7362L1125
3889.5I9384868R513O5994M3696p0405j27536p9917K6333J35624J48744P9578J9872
3912I9636364k5946n4914j7374M1014L4487J1641K5659J6731j1217R817N1504M1521
$$ plain form
3936.5 99759287 99752569 99717492 99704361 99729180 99749982 99762583 99797177 99838442 99862027 99872118 99874210 99869239
3960.9 99869239 99871916 99886179 99896258 99904686 99916053 99916798 99918318 99935210 99949855 99955916 99960601 99957126 99947035
3987.4 99947035 99944466 99949276 99957871 99976629 100000000
3997.6 100000000
$$ packed form
3936.5I9759287o718l5077j3131K4819K0802J2601L4594M1265K3585J0091K092m971
3960.9I9869239K677J4263J0079Q428J1367P45J520J6892J4645O061M685l475j0091
3987.4I9947035k569M810Q595J8758K3371
3997.6A00000000
##END=$$ End of the data block
