##TITLE=p-aminofenol - Julia $$ Begin of the data block
##JCAMP-DX=5.00 $$ ACD/SpecManager v 10.08
##SPECTROMETER/DATA SYSTEM=Alpha
##DATE=12 Nov 2014 09:25:08
##DATA TYPE=INFRARED SPECTRUM
##DATA CLASS=XYDATA
##ORIGIN=
##OWNER=
##NPOINTS=1765
##FIRSTX=399.76428223
##LASTX=3997.64306641
##MAXX=3997.64306641
##MINX=399.76428223
##MAXY=0.85430878
##MINY=0.37119669
##XFACTOR=1.0000000000
##YFACTOR=1.000000000000000e-9
##FIRSTY=0.82035929
##DELTAX=2.03961372
##XUNITS=1/CM
##YUNITS=ARBITRARY UNITS
##XYDATA=(X++(Y..Y))
399.8 820359290 818258107 817495525 816822410 814961255 812044621 810246468 811412096 814464271 816280961
418.1 816280961 814056635 810538292 808656514 808093846 807810962 807360232 807169735 808206737 810444295
436.5 810444295 812327802 812806249 812073052 811228096 811108410 810949326 809451759 806555331 803577840
454.8 803577840 801431477 799632192 796206236 788617194 776453733 762543261 749368250 739246547
471.2 739246547 739991069 756047964 777673900 792469442 795693398 788897276 776402473 764087975
487.5 764087975 757246614 759175301 767968833 777359366 783369422 786246657 787008464 784493983 774438500
505.8 774438500 747265816 700015903 665682375 680703640 718865871 724992454 683781803 633333981
522.1 633333981 633788049 695906699 761844099 795009673 807078063 812661469 816694438 819179356
538.5 819179356 819329798 817953825 817068398 817773044 818985879 818770707 816922307 815254688 815236747
556.8 815236747 816397905 816838682 815515161 813599706 813035250 814114869 815215290 814719737 812881112
575.2 812881112 811562598 812010527 813321233 813558877 812269092 810916960 811033726 812314212 813112140
593.5 813112140 812352240 810763180 810072243 810873210 812051535 812077940 810737014 809323430 809199691
611.9 809199691 810096443 810595691 809980392 809080303 809134722 810281336 811482072 811536729 810404301 809053183
632.3 809053183 808352232 807855189 806118667 802062631 793162644 777004480 767547250 782224298
648.6 782224298 805709839 815889597 816207767 815479636 815529525 815432191 814361095 812626302 810806990
667 810806990 810079873 810658336 810655296 809515178 807953596 806924820 806651950 806297839 805116951 803271115
687.3 803271115 801646352 800652981 799849689 798085511 794551551 789182603 779016554 759819448
703.7 759819448 747732460 764433861 791093528 801231742 800120056 797750294 794884086 790975749
720 790975749 786588430 782586694 778916657 774605930 768619895 760631323 750819921 738995373 723865628
738.3 723865628 703645706 675963163 635855258 577348709 508699417 471158743 508828163
752.6 508828163 604870737 699076831 760200262 793577731 810370862 817495286 819608152 819798231
768.9 819798231 819354415 818187535 815836787 812475681 808922768 806008637 803694606 801063001 797357857
787.3 797357857 792941749 788673818 784840465 780867159 775861561 769554138 762325466 754425049
803.6 754425049 745396852 733542502 714581013 683930695 649044037 630473018 629885256 617647171
819.9 617647171 570659220 504045844 467851102 502099872 585464478 662424088 707265258
834.2 707265258 727516294 734418213 732949257 725719571 718493104 719149113 729388058 743096471
850.5 743096471 754106879 760440290 762670040 762171209 760234535 757619143 754315078 750004172
866.8 750004172 744742215 739094555 733633816 728477895 723348856 718031943 712954819 708852470
883.2 708852470 706044793 704137266 702473521 700711370 699113071 698163211 697936773 698107362 698278666
901.5 698278666 698379219 698403537 697980523 696132720 691595316 683150768 669712365 652434349 642875135
919.9 642875135 656682789 685882628 706264675 711054504 707864940 701368093 692376435 680805802
936.2 680805802 666496396 648700833 626502335 604039431 593089819 598684788 608110249 606884062
952.5 606884062 593429983 573078334 550046980 526666284 504602373 485506207 471029103
966.8 471029103 462396234 460076272 463842988 473387629 488793403 510464311 538263202 570859671
983.1 570859671 605889142 640695155 672908425 700765014 723538756 741466343 755264878
997.4 755264878 764841497 768297672 764116943 747856796 708565295 666066587 671658874 722240806
1013.7 722240806 766445160 786796749 795337141 800152898 803350568 805271447 806220591 806889772
1030 806889772 807970762 809455752 810855448 811751366 812339962 813017964 813971341 814818978 815146029
1048.4 815146029 814976990 814729273 814748585 814862549 814643264 813801110 812510610 811094701 809782565
1066.7 809782565 808273137 806083918 803011060 799243689 794887245 789262295 780692399 766370416
1083 766370416 742010057 701429248 643088281 586257756 568961203 606589854 669871628 722246170
1099.4 722246170 753086388 768687963 775771081 777984440 777010918 773381650 766918838 758522332
1115.7 758522332 751820326 751237392 757177770 765317559 771198153 773302853 772574008 770280361 767065704
1134 767065704 762755990 756730676 748221755 736893713 723238349 709059358 698028922 694609225
1150.3 694609225 701134324 714952528 729995012 740625143 743675292 736574113 711831927 665211260
1166.7 665211260 634868264 669555843 735524535 769954145 772481859 766585588 760128081 753683507
1183 753683507 746881366 739597023 731942236 723899722 715025425 704749048 692480683 677884340
1199.3 677884340 660570920 640238762 617086470 592703879 570394754 554772913 548893452
1213.6 548893452 550589204 555142820 559931517 562822342 559985161 549607217 533937216 515756667
1229.9 515756667 494431823 467860252 439933121 423857510 434689701 476569295 536574960
1244.2 536574960 591110826 617435992 600653410 545049727 487927586 479257107 531098545
1258.4 531098545 609263122 677154660 723581314 753625870 774910450 792436540 807574391
1272.7 807574391 820032477 829825103 837381005 843219101 847792804 851246595 853448510 854308784
1289 854308784 854077518 853183210 851826549 849977493 847631216 844879210 841780365 838301063 834257782
1307.4 834257782 829487622 823968589 818205357 813869536 813046515 815694630 818764925 819348216 817029357
1325.8 817029357 812894762 807998002 803153217 798783004 794582725 790208936 786758304 785661459
1342.1 785661459 786154330 786304355 785054207 782491684 779012322 774841070 769976199 764527500 758291543
1360.4 758291543 750704467 742079318 732972741 722660959 711022854 697798908 682188332 665575147
1376.7 665575147 648843884 632068396 617177665 607049525 604304671 610712290 624909401 645914912
1393.1 645914912 672225535 698210776 721809328 742277205 758937418 772659004 782539189
1407.3 782539189 789001524 793309510 795680761 796251059 794991672 791489184 787033319 782033801
1423.7 782033801 775865853 768597007 759654403 749637723 739774585 727888167 713719130 701708376
1440 701708376 691809356 683654964 676885426 669646859 661288381 652278662 641718924 623572111
1456.3 623572111 594733357 567605972 542256832 512852907 483360380 459844559 438473821
1470.6 438473821 416292906 402381063 403350115 417248100 442685813 476127625 510792255 543284059
1486.9 543284059 571613431 592063725 603399217 607876003 603316724 585882187 559599936 529634118
1503.2 529634118 486844808 418698877 371943682 371196687 406960458 469154477 538515151 594362497
1519.5 594362497 642219663 683831394 713718593 735005677 749010026 759918571 770833671
1533.8 770833671 780368567 789609969 802196681 813133359 819132805 823262155 826682687 829621792
1550.1 829621792 831778765 833319366 834666491 835590839 834287107 832305491 830330789 828130066
1566.4 828130066 825388014 821723580 818091035 814195156 808292449 801935315 796222508 789600790
1582.8 789600790 781363010 771429360 760389388 749262869 739316106 731321990 725900829 723414481
1599.1 723414481 722823977 720743775 712075889 692501962 662645161 631858230 611135840 605524778
1615.4 605524778 616097391 633496284 651100397 668704510 682550251 692347467 700074553 706882119 715570152
1633.7 715570152 728586435 740877211 749642432 757289529 764430165 771688640 777962029 781957746
1650.1 781957746 786075652 790094078 791666090 793138683 795424402 797700405 798908770 799360216
1666.4 799360216 799631000 799445510 798967481 798549652 798076451 797809780 798048973 798572183 798431635 797628284
1686.8 797628284 797076881 796823442 797037423 797837615 798798501 799415648 799541295 799446285 799387097 799112916
1707.2 799112916 798670530 798307121 798059225 797824442 797175467 796129107 795357168 794847846 794443905
1725.5 794443905 794366419 794784069 795572937 796312809 796455383 796439767 796689570 797186375 797995210 799220383
1745.9 799220383 800686955 801864803 802466393 802929223 803489864 803925514 804230869 804532766 804900348
1764.3 804900348 805507660 806245446 806800306 806931913 806718707 806598306 806654155 806605995 806338966 806054711
1784.7 806054711 805928707 806054652 806204379 805862725 805168748 804678202 804378033 803911328 803135991 802328110
1805.1 802328110 801729918 801285505 800722718 799922884 799082458 798356891 797805905 797479153 797303855 797068954
1825.5 797068954 796808720 796583593 796287656 796072185 795963883 795773923 795547664 795427203 795143127 794372320
1845.9 794372320 793324113 792122781 790672243 788833678 786335886 782622099 777331054 771701813
1862.2 771701813 768918216 771520853 779031157 787544250 793724358 797678292 800117552 801505685
1878.5 801505685 802292645 802785158 803111494 803325653 803456366 803418696 803213298 802878797 802384377 801833928
1898.9 801833928 801371217 800975680 800537288 799989939 799354255 798698008 798081994 797473609 796723425 796001792
1919.3 796001792 795850813 796326995 796894133 797102630 796888947 796489537 796222448 796241343 796457708 796690822
1939.7 796690822 796818495 796808839 796777546 796770275 796675801 796467721 796266735 796175718 796211183 796277285 796223104
1962.1 796223104 796011209 795674860 795187652 794520080 793651342 792516172 791142642 789658844 788090885
1980.5 788090885 786306739 784265816 782187581 780508697 779731154 780205548 781876981 784243941 786723018
1998.8 786723018 788914144 790558159 791476488 791725278 791557610 791237235 790992975 790978611 791158736
2017.2 791158736 791327000 791305125 791020274 790464044 789678693 788765550 787856817 787028491 786284685 785596073
2037.6 785596073 784907997 784189582 783478320 782809496 782148302 781452358 780754387 780126870 779609025 779177427
2058 779177427 778812051 778554440 778400064 778277576 778194129 778199852 778282046 778405845 778532088 778616905 778653145
2080.4 778653145 778667390 778683662 778721690 778794289 778898537 779045701 779251337 779489040 779684007 779737949
2100.8 779737949 779600859 779313087 778935432 778503716 778033018 777537823 777061462 776648521 776341438 776176631
2121.2 776176631 776106656 776031971 775896430 775691569 775441408 775169671 774881423 774578691 774266839 773952484
2141.6 773952484 773645639 773339152 772996545 772596240 772158802 771706820 771249056 770793974 770351231 769936979
2162 769936979 769550443 769178689 768812835 768449247 768063605 767577171 766949058 766314566 765883505 765622139
2182.4 765622139 765280485 764750600 764113188 763453782 762799203 762127995 761432171 760727525 760027289 759340286
2202.8 759340286 758626997 757858336 757071674 756307721 755567014 754851699 754193902 753626764 753172994 752850711
2223.2 752850711 752653003 752525151 752375305 752143502 751829565 751408041 750828922 750109673 749297738 748433650
2243.6 748433650 747592330 746863008 746290982 745821297 745327771 744736075 744041860 743244112 742353082 741524875
2264 741524875 741016269 740833104 740663111 740260303 739647329 738949955 738230884 737476826 736657739 735796392
2284.4 735796392 734931350 734039545 733103454 732126772 731098890 730018973 728870392 727644563 726392388
2302.7 726392388 725186825 724076211 723098874 722218812 721350610 720480144 719574511 718547642 717404962
2321.1 717404962 716245770 715129316 714028656 712922215 711905658 711037159 710171223 709178269 707989991
2339.5 707989991 706550658 704995513 703574002 702328801 700957119 699231744 697433054 696109831
2355.8 696109831 695467055 695388913 695594966 695860207 696113646 696308553 696375728 696305752 696100116 695704460
2376.2 695704460 695100963 694341242 693468869 692507923 691451311 690247655 688867629 687385559 685898960
2394.5 685898960 684428275 682961464 681464791 679932773 678424954 677015305 675723851 674461365
2410.8 674461365 673127234 671760917 670473516 669260263 668012500 666648448 665144026 663542390
2427.2 663542390 661940396 660396814 658894062 657378256 655797541 654125869 652378738 650573075
2443.5 650573075 648681104 646688342 644634902 642578363 640536249 638482213 636366487 634170115
2459.8 634170115 631940544 629712641 627462685 625195980 623004436 620984495 619170666 617574632
2476.1 617574632 616215289 615092695 614200234 613535106 613054752 612618148 612068653 611479044 611237645
2494.5 611237645 611821353 613455832 615939558 618680358 621039629 622712612 623754025 624334812 624414980
2512.8 624414980 623733997 622189522 620092332 618113041 616951108 616878629 617561340 618271351 618294716
2531.2 618294716 617227137 615011990 611859083 608170986 604375899 600732207 597347200 594251752
2547.5 594251752 591401696 588743806 586257160 583922625 581725180 579647720 577686548 575837076
2563.8 575837076 574064434 572342277 570640266 568968356 567397356 565987706 564788759 563784003
2580.1 563784003 562803686 561684191 560489357 559471428 558861256 558770359 559267581 560437918 562382638
2598.5 562382638 565130115 568532586 572358072 576467097 580892920 585789621 591211796 596959412
2614.8 596959412 602653384 607901692 612471402 616271675 619183242 621072292 621940970 621975839 621495187
2633.2 621495187 620835483 620279133 620061338 620373845 621373713 623092294 625310183 627566218 629293442
2651.5 629293442 630050182 629644156 628045142 625296772 621498406 616824389 611533344 605918586 600258946
2669.9 600258946 594774485 589645207 585145712 581645191 579402685 578504503 579000175 580920875 584208608
2688.2 584208608 588697374 594070673 599884093 605754614 611511588 617116094 622426927 627111197
2704.5 627111197 630829990 633394539 634784997 635141969 634708047 633751392 632602036 631678224 631371856
2722.9 631371856 631945550 633412480 635536492 637949288 640179396 641830206 642704844 642764211 642201960
2741.2 642201960 641404808 640735567 640388012 640428066 640940011 642011702 643619597 645657837 648080945
2759.6 648080945 650923848 654137492 657487512 660615504 663143575 664703369 665026307 664111674 662219584
2778 662219584 659687936 656741500 653431356 649780095 645843625 641580582 636941195 632031679 627030015
2796.3 627030015 622040629 617164671 612646341 608706534 605476022 603105605 601642787 601078629
2812.6 601078629 601508021 602999330 605518103 608935595 612986922 617372751 621983171 626945317
2828.9 626945317 632377505 638159573 643982887 649529636 654479861 658668816 662213385 665172100
2845.3 665172100 667388082 668752015 669417262 669603646 669326365 668521106 667159557 665265262 662979960
2863.6 662979960 660433233 657585740 654389799 650900006 647075236 642873883 638500214 634205699
2879.9 634205699 630146146 626526415 623644829 621730328 620763958 620497942 620522678 620320678 619472921
2898.3 619472921 617821097 615376711 612283170 608850896 605457962 602393091 599763393 597601712
2914.6 597601712 596072853 595459104 595976293 597694278 600519359 604241967 608649611 613501012 618431032
2933 618431032 622996151 626827359 629715502 631563842 632328033 632017195 630729318 628664315 626112163
2951.3 626112163 623410702 620799303 618445039 616609633 615627050 615788996 617230535 619861424 623394251
2969.7 623394251 627428174 631416798 634667218 636603713 636964440 635790825 633444846 630523205
2986 630523205 627536833 624731898 622171819 619875371 617898285 616218746 614752829 613556921 612759709
3004.4 612759709 612474620 612779856 613496661 614095211 614106894 613557816 612808049 612052739 611087501 609529614
3024.7 609529614 607068539 603946149 602091014 604738176 612644196 622211576 629541695 633880794
3041.1 633880794 636354804 638158143 640321195 643400669 646867692 649717808 651729345 653376520
3057.4 653376520 654880524 655963004 656382024 656552970 657388210 659358263 662023842 664582968 666646302
3075.7 666646302 668191612 669177175 669695914 669970989 670027912 669845879 669437051 668782115 668128312 667879164
3096.1 667879164 668223917 669054627 670162976 671537220 673199236 674867094 676205277 677384734 678711653
3114.5 678711653 679955304 680781543 681144357 681138515 681049347 681140661 681336880 681436300 681437969 681491435 681633770
3136.9 681633770 681623757 681191385 680463791 679680169 678829074 677898407 676811457 675229311 673052192
3155.3 673052192 670597315 668033242 665281951 662297428 659162700 656030953 653051734 650366366
3171.6 650366366 648102701 646433055 645521402 645396650 645980716 647170424 648786843 650560141 652231634
3189.9 652231634 653620183 654632986 655296147 655767381 656292498 657129109 658331037 659677625 660857141
3208.3 660857141 661624670 661895216 661696017 661073208 660118639 658964515 657711983 656410575 655086994
3226.7 655086994 653765678 652456343 651140630 649691164 647965133 645985603 643787742 641303599
3243 641303599 638459682 635166883 631311059 626877308 621916175 616348147 609984934 602777481 594752669
3261.3 594752669 585794091 575819254 564938962 553206146 540546715 527355254 514699101 503839195
3277.7 503839195 496032804 492456466 494057566 501328826 514090300 531404674 551530898 572425365
3294 572425365 592518151 610850751 626909792 640550077 651647270 659934461 665418029 668461204
3310.3 668461204 669442594 668528438 665651321 660679042 653431356 643630624 630757332 613931894
3326.6 613931894 592429161 566140532 535762846 503508687 473541588 451023757 440477461
3340.9 440477461 444442183 462589681 491712391 526127756 559211135 586533427 607166409
3355.2 607166409 622046053 632383525 639232337 643553734 646263421 647801697 648081005 647165418
3371.5 647165418 645707309 644473016 643709183 643216908 642678976 641916692 640949011 639941514 639076233
3389.8 639076233 638131797 636755109 635215163 634033144 633132398 631956458 630466223 629225314 628377497
3408.2 628377497 627632201 626837790 625935435 624951482 624030054 623180449 622359097 621690869 621258438 620963633
3428.6 620963633 620676875 620538831 620732486 620971978 620992959 621052206 621422529 622066796 622789502 623409569
3449 623409569 623982370 624633312 625396311 626347423 627486467 628583431 629592478 630798936 632218540
3467.3 632218540 633434653 634259939 635005474 635930002 637074411 638278246 639291942 640243828 641341805
3485.7 641341805 642452121 643520415 644716918 646062851 647396684 648659766 650026798 651552856
3502 651552856 652948081 654107034 655334830 656808615 658437073 660015881 661441922 662837327 664354682
3520.4 664354682 666072190 667765021 669211805 670574009 671978593 673442066 675053775 676702023
3536.7 676702023 678203702 679762363 681542039 683297098 684719980 685960174 687317848 688752055
3553 688752055 690218031 691872358 693746865 695653856 697483122 699398756 701520562 703502417 705261767
3571.3 705261767 707144856 709231317 711385727 713613868 715965986 718411684 720875561 723179519
3587.7 723179519 725177944 727091432 729246318 731610537 733967364 736222208 738325417 740348756
3604 740348756 742491126 744803071 746987760 748951077 750821054 752589822 754476964 756413281 757914484
3622.3 757914484 759146214 760550976 762359619 763990521 765017807 765924990 766858280 767826319 768908024
3640.7 768908024 770003319 771100819 772421360 773900986 774706483 774737716 774844229 775345385 775799394
3659 775799394 775983572 776061893 776228070 776522815 776846647 777014136 776944280 776722491 776364446 776139557
3679.4 776139557 776311040 776819110 777557611 778493941 779028058 778659940 778128088 777957678 778091788 778382003
3699.8 778382003 778681397 778857470 779026687 779343724 779663980 779726624 779503703 779242814 779102266 779050827
3720.2 779050827 779003084 778897226 778768301 778698325 778832316 779277146 779710948 779737473 779464185 779099166
3740.6 779099166 778833628 778874755 778906941 778705597 778531849 778342724 778083324 777888954 777738631 777522326
3761 777522326 777268529 777108014 777004421 776845515 776548624 776180208 775994360 776076615 776206315 776086390
3781.4 776086390 775802195 775607228 775525331 775473475 775394619 775307059 775285006 775254488 775140941 774977028 774660289
3803.9 774660289 774351001 774236500 774158835 774094343 774182439 774497092 774765491 774791837 774644375 774376333
3824.3 774376333 774183273 774094045 774067640 774172008 774339557 774498522 774546564 774274588 773813367 773415506
3844.6 773415506 773129642 772956192 772855520 772752821 772594571 772320569 772060096 771988034 772038639 771948814
3865 771948814 771655023 771421790 771282017 770987093 770644307 770392179 770286858 770325840 770286322 770087659
3885.4 770087659 769722104 769326627 769114316 769020796 768977225 769067883 769215941 769238710 769129574 768889487
3905.8 768889487 768532813 768229127 768063307 767998934 768029392 768057287 767946243 767745912 767556548 767400742
3926.2 767400742 767297029 767257750 767210305 767075837 766899109 766767800 766689122 766593874 766438067 766293406
3946.6 766293406 766214669 766118407 765931189 765707314 765537262 765426815 765339136 765253723 765130460 764945090
3967 764945090 764780819 764687300 764578700 764431477 764298975 764171541 764041781 763915420 763747633 763545871
3987.4 763545871 763361156 763212979 763096035 762986124 762898624
3997.6 762898624
##END=$$ End of the data block
