##TITLE=$$ Begin of the data block
##JCAMP-DX=5.00 $$ ACD/SpecManager v 10.08
##SPECTROMETER/DATA SYSTEM=16PC
##DATE=18 Jun 2013 14:58:44
##DATA TYPE=INFRARED SPECTRUM
##DATA CLASS=XYDATA
##ORIGIN=
##OWNER=
##NPOINTS=3601
##FIRSTX=400.00000000
##LASTX=4000.00000000
##MAXX=4000.00000000
##MINX=400.00000000
##MAXY=80.25382996
##MINY=16.83738518
##XFACTOR=1.0000000000
##YFACTOR=0.000000100000000
##FIRSTY=44.46869659
##DELTAX=1.00000000
##XUNITS=1/CM
##YUNITS=TRANSMITTANCE
##XYDATA=(X++(Y..Y))
400D44686966J06740646Q5258217N7140618L0432052J1211395J619950j06583K089157
$$ 444686966 551427612 636685829 693826447 724258499 735469894 737089844 736983261 739072418
408G39072418M398117M804688L403320J537323N12924P25174J606751K224121J990814
$$ 739072418 743470535 748275223 751678543 753215866 753728790 754453964 756060715 758284836 760275650
417G60275650J005402j39084q42743q97141n40237j91498j06964k22626k62069q40
$$ 760275650 761281052 761141968 760299225 759402084 758861847 758670349 758563385 758340759 758078690 758077850
427G58077850N37949J092758J357880J202698P55920L03116Q6365J52511L48663M50592
$$ 758077850 758615799 759708557 761066437 762269135 763025055 763328171 763414536 763567047 763915710 764366302
437G64366302L16697m0894m99649r41391j332626j727677k195129k743607l302002
$$ 764366302 764682999 764642105 764142456 763201065 761868439 760140762 757945633 755202026 751900024
446G51900024l767929m076385m234009m291153m277878m161606l859787l302536k502059
$$ 751900024 748132095 744055710 739821701 735530548 731252670 727091064 723231277 719928741 717426682
455G17426682j568528o71463M1504N07584P66067R21250J086960J341705J713257K184753
$$ 717426682 715858154 715186691 715228195 715735779 716501846 717423096 718510056 719851761 721565018 723749771
465G23749771K707214L204117L580780L746109L648529L311081K836380K375260K061691
$$ 723749771 726456985 729661102 733241882 736987991 740636520 743947601 746783981 749159241 751220932
474G51220932J956635K026748K174607K295379K329865K278213K176972K055893J911163
$$ 751220932 753177567 755204315 757378922 759674301 762004166 764282379 766459351 768515244 770426407
483G70426407J712341J430054J071625O85653L44391J01013l6392j09558j84326l13187
$$ 770426407 772138748 773568802 774640427 775326080 775670471 775771484 775735092 775625534 775441208 775128021
493G75128021n06744p36389r59397j162185j390686j746598k344589l240509m361725
$$ 775128021 774621277 773884888 772925491 771763306 770372620 768626022 766281433 763040924 758679199
502G58679199n485611o284332o441727n790634m410934k627945q98361L69491R80530
$$ 758679199 753193588 746909256 740467529 734676895 730265961 727638016 726739655 727109146 728089676
511G28089676J012573P46842N01175M60510N97915P19529O09207J68609n21087j259079
$$ 728089676 729102249 729849091 730350266 730810776 731408691 732128220 732737427 732906036 732384949 731125870
521G31125870j859665k272949k610321l055344l707504m459153m986114m868393l789062
$$ 731125870 729266205 726993256 724382935 721327591 717620087 713160934 708174820 703306427 699517365
530F99517365j712189J058121L962936O383743P858505Q224259P627411O418457M983444
$$ 699517365 697805176 698863297 702826233 709209976 717068481 725292740 732920151 739338608 744322052
539G44322052L597946K361908J232681J23749r89380k020111k790298l115311k895813
$$ 744322052 747919998 750281906 751514587 751638336 750648956 748628845 745838547 742723236 739827423
548G39827423k172623j115341M5700J101685J919784K450638K693634K659531K358704
$$ 739827423 737654800 736539459 736585159 737686844 739606628 742057266 744750900 747410431 749769135
557G49769135J821746J134720M50745m4098k01874J5106N05982J068420J488648J633835
$$ 749769135 751590881 752725601 753176346 753132248 752930374 752945480 753451462 754519882 756008530 757642365
567G57642365J503295J206208Q88443O50177M99954L71094J81427j05286m50134p64542
$$ 757642365 759145660 760351868 761240311 761890488 762390442 762761536 762942963 762837677 762387543 761623001
577G61623001r67178j036530j028595j047363j187439j486511j911392k385712k839661
$$ 761623001 760655823 759619293 758590698 757543335 756355896 754869385 752957993 750572281 747732620
586G47732620l245468l618927l978577m294662m458771m306259l688583k565613j069183
$$ 747732620 744487152 740868225 736889648 732594986 728136215 723829956 720141373 717575760 716506577
595G16506577N05065J786576K467041K426758J790084Q79975R2697k51007j4420P35321
$$ 716506577 717011642 718798218 721265259 723692017 725482101 726362076 726454773 726203766 726189346 726924667
605G26924667J785126K878494L804398M439087M738312M706039M372330L792877L059463
$$ 726924667 728709793 731588287 735392685 739831772 744570084 749276123 753648453 757441330 760500793
614G60500793K297440J638107J171189R08661P88345P15179O17142M79202L23944J56403
$$ 760500793 762798233 764436340 765607529 766516190 767304535 768019714 768636856 769116058 769440002 769596405
624G69596405q2626n13535j243439k259216l357849m169388m294967l492508j827012
$$ 769596405 769513779 769000244 767756805 765497589 762139740 757970352 753675385 750182877 748355865
633G48355865L10212K334289L688736M065094L500824K329254J005631r0027p83844
$$ 748355865 748666077 751000366 754689102 758754196 762255020 764584274 765589905 765499878 764716034
642G64716034j118088j266708j409912j644059j964798k307968k618408k892227l176727
$$ 764716034 763597946 762331238 760921326 759277267 757312469 755004501 752386093 749493866 746317139
651G46317139l533631l986587m486695m905471n062180m777985l939361k555771p89642
$$ 746317139 742783508 738796921 734310226 729404755 724342575 719564590 715625229 713069458 712279816
660G12279816J062317K642364L643646L918610L538208K766800J953964J389923J190338
$$ 712279816 713342133 715984497 719628143 723546753 727084961 729851761 731805725 733195648 734385986
669G34385986J265793J386185J311951R15374K40784n26733j157608j482850j457290
$$ 734385986 735651779 737037964 738349915 739265289 739506073 738979340 737821732 736338882 734881592
678G34881592j153870p05261k31400K06528O07300R97314J390305J763534K062836
$$ 734881592 733727722 733022461 732791061 732997589 733604889 734602203 735992508 737756042 739818878
687G39818878K226639K216186K032395J715393J329422R42688O09894L61480K06833
$$ 739818878 742045517 744261703 746294098 748009491 749338913 750281601 750891495 751252975 751459808
696G51459808J38245J45493K19955L55301N39169P41272R09119R79996R03320O70471
$$ 751459808 751598053 751743546 751963501 752318802 752857971 753599243 754508362 755488358 756391678 757062149
706G57062149L28064l4027l20129m74854n09949m99649n37643o86035r38416j224747
$$ 757062149 757390213 757356186 757036057 756561203 756051254 755551605 755013962 754327927 753389511 752164764
716G52164764j454467j571656j590728j589966j662140j854782k131958k382965k476197
$$ 752164764 750710297 749138641 747547913 745957947 744295807 742441025 740309067 737926102 735449905
725G35449905k325897j941299j424942r28421n83268m50363n04608o63757q39462r81369
$$ 735449905 733124008 731182709 729757767 728829346 728246078 727795715 727291107 726627350 725787888 724806519
735G24806519j094895j225815j428299j734924k143402k626877l147507l671875m168090
$$ 724806519 723711624 722485809 721057510 719322586 717179184 714552307 711404800 707732925 703564835
744G03564835m596787m899444n004807m849243m411545l738251k952041k225418j735459
$$ 703564835 698968048 694068604 689063797 684214554 679803009 676064758 673112717 670887299 669151840
753F69151840j605072j862488k426986l133087l781281m200287m296570m079666l649597
$$ 669151840 667546768 665684280 663257294 660124207 656342926 652142639 647846069 643766403 640116806
762F40116806l157959k757378k556495k598267k863731l295136l825683m402581m996109
$$ 640116806 636958847 634201469 631644974 629046707 626182976 622887840 619062157 614659576 609663467
771F09663467n596923o205788o817513p407302p913857q231544q217125p725830o674729
$$ 609663467 604066544 597860756 591043243 583635941 575722084 567490540 559273415 551547585 544872856
780E44872856n117454l290825j594200m84658l07998j128655k642631m229203n144691
$$ 544872856 539755402 536464577 534870377 534385719 534077721 532949066 530306435 526077232 520932541
789E20932541m790306k941780J57089L884354P471389J0276680J1979981J2626800
$$ 520932541 516142235 513200455 513357544 517241898 524713287 534989967 546969948 559596748
797E59596748J2522316J2045479J1481667J0940246J0383377R716492Q880081P894669
$$ 559596748 572119064 584164543 595646210 606586456 616969833 626686325 635566406 643461075
805F43461075O843033N819854M886933M062881L343811K734452K259063J948395J809692
$$ 643461075 650304108 656123962 661010895 665073776 668417587 671152039 673411102 675359497 677169189
814F77169189J802674J847915J854401J760254J554260J266403R39942N94864K16675
$$ 677169189 678971863 680819778 682674179 684434433 685988693 687255096 688195038 688789902 689006577
823F89006577k30561p69806j381073j992416k504959k829285k924652k811890k559204
$$ 689006577 688776016 688006210 686625137 684632721 682127762 679298477 676373825 673561935 671002731
832F71002731k250366j949539j683273j440812j188736q86001m97131P324O46438J425171
$$ 671002731 668752365 666802826 665119553 663678741 662490005 661604004 661106873 661114197 661760635 663185806
842F63185806K323151L287811M238358N082016N743484O189118O438827O552048O598968
$$ 663185806 665508957 668796768 673035126 678117142 683860626 690049744 696488571 703040619 709639587
851G09639587O623764O619492O525726O247254N690765M804688L609848K214126Q00934
$$ 709639587 716263351 722882843 729408569 735655823 741346588 746151276 749761124 751975250 752776184
860G52776184m04892j188660j408767j043091k09808Q55865J864548K558288K785874
$$ 752776184 752371292 751182632 749773865 748730774 748520966 749376831 751241379 753799667 756585541
869G56585541K545089J969986J274262O75278L24020K74048M87213Q70361J320267
$$ 756585541 759130630 761100616 762374878 763050156 763374176 763648224 764135437 765005798 766326065
878G66326065J755982K132186K430039K643051K765656K787246K700806K512283K245484
$$ 766326065 768082047 770214233 772644272 775287323 778052979 780840225 783541031 786053314 788298798
887G88298798J941146J646653J399765J218033J091461R92279Q88443P61490O16073
$$ 788298798 790239944 791886597 793286362 794504395 795595856 796588135 797476578 798238068 798854141
896G98854141M77524L75748L28674L28140L43933L39814K94723K15225J31302P9499
$$ 798854141 799331665 799707413 800036087 800364227 800708160 801047974 801342697 801557922 801689224 801768723
906H01768723P8582J19553J67847J85012J49613O8970k6703j01700j37711j39084j29623
$$ 801768723 801847305 801966858 802134705 802319717 802469330 802538300 802511597 802409897 802272186 802133102 802003479
917H02003479j34811j66397k18506k76108l27301l72238m20761m81263n47714n98068
$$ 802003479 801868668 801702271 801483765 801207657 800880356 800508118 800087357 799606094 799058380 798460312
927G98460312o02112n40161m17862k67868j39465p6523r8953j95923l34778m79965
$$ 798460312 797858200 797318039 796900177 796632309 796492844 796416321 796317368 796121445 795786667 795306702
937G95306702o10810p31125q64257j038742j273423j568451j905441k258453k599411
$$ 795306702 794695892 793964767 793100510 792061768 790788345 789219894 787314453 785056000 782456589
946G82456589k903366l142929l282242l273163l065415k621154j940461j070098j04065
$$ 782456589 779553223 776410294 773128052 769854889 766789474 764168320 762227859 761157761 761053696
955G61053696Q38852J645507K239762K595596K736511K715378K591629K412033K205658
$$ 761053696 761892548 763538055 765777817 768373413 771109924 773825302 776416931 778828964 781034622
964G81034622J984711J755676J522827J291733J064682Q42667O25305M16794K28119
$$ 781034622 783019333 784775009 786297836 787589569 788654251 789496918 790122223 790539017 790767136
973G90767136P4157l4256r8419j36337j76315k43912l48969m80117o11039p15103p81250
$$ 790767136 790841293 790807037 790708618 790572281 790395966 790152054 789803085 789322968 788711929 787996826 787215576
984G87215576q20999q62198r32693j045609j190491j339950j468430j566772j651001
$$ 787215576 786394577 785532379 784599686 783554077 782363586 781023636 779555206 777988434 776337433
993G76337433j753845j905518k116165k368393k625351k854156l042984l208619l380584
$$ 776337433 774583588 772678070 770561905 768193512 765568161 762714005 759671021 756462402 753081818
1002G53081818l573914l763962l883590l843308l578262l088532k459106j839371j394195
$$ 753081818 749507904 745743942 741860352 738017044 734438782 731350250 728891144 727051773 725657578
1011G25657578j244278j429673j905136k574692l333129m101029m827499n479050o026916
$$ 725657578 724413300 722983627 721078491 718503799 715170670 711069641 706242142 700763092 694736176
1020F94736176o456223o795883p144852p660599q491439r665223j0990028j2030373
$$ 694736176 688279953 681484070 674339218 666678619 658187180 648521957 637531929 625501556
1028F25501556j2201194j0965805q066559l682251J566086O783752J1081314J3851128
$$ 625501556 613300362 602334557 594267998 590585747 592151833 598935585 610016899 623868027
1036F23868027J4928474J4578362J3331451J1753006J0252380R003525P981644P073746
$$ 623868027 638796501 653374863 666706314 678459320 688711700 697715225 705696869 712770615
1044G12770615O182785N283279M408493L604431K887879K237320J617736J011277M34036
$$ 712770615 718953400 724236679 728645172 732249603 735137482 737374802 738992538 740003815 740437851
1053G40437851p7896m97055q30002j120606j428451j798554k241134k733765l241195
$$ 740437851 740359955 739862900 739032898 737912292 736483841 734685287 732444153 729710388 726469193
1062G26469193l741913m243622m780045n395584o127243o992187p992020r120789j0377960
$$ 726469193 722727280 718483658 713703613 708308029 702180786 695188599 687196579 678075790 667697830
1071F67697830j1773910j3326340j5050583j6943207j8965530k1031036k2999306k4686661
$$ 667697830 655923920 642597580 627546997 610603790 591638260 570607224 547607918 522921257
1079E22921257k5885086k6396446k6065140k4807015k2627372j9625702j5993118j2001915
$$ 522921257 497036171 470639725 444574585 419767570 397140198 377514496 361521378 349519463
1087C49519463p978325m260636j134834J240349K890625M044113N080910O424103Q397407
$$ 349519463 341541138 337280502 336145668 337386017 340276642 344320755 349401665 355825768 364223175
1096C64223175J1100044J4342537J7670212K0468674K2116089K2142677K0354042J6896515
$$ 364223175 375323219 389665756 407335968 427804642 449920731 472063408 492417450 509313965
1104E09313965J2254906P181549K567901p30133k080040j231003J606217N794487J0425224
$$ 509313965 521568871 528750420 531318321 530588188 528508148 527277145 528883362 534677849 545103073
1113E45103073J4549103J7417679J8651962J8292580J6719284J4490699J2161332J0144195
$$ 545103073 559652176 577069855 595721817 614014397 630733681 645224380 657385712 667529907
1121F67529907Q647843P690048P153931O860122O626053O303711N803299N097732M218903
$$ 667529907 676177750 683867798 691021729 697881851 704507904 710811615 716614914 721712646 725931549
1130G25931549L239822K247544J312332M66461k99606j023712j744309k473678l179169
$$ 725931549 729171371 731418915 732731247 733197708 732898102 731874390 730130081 727656403 724477234
1139G24477234l782120m170151m223556l849335l015823j779022k89307J231460K537385
$$ 724477234 720695114 716524963 712301407 708452072 705436249 703657227 703367920 704599380 707136765
1148G07136765L422393L771210L583145K956314K042923R98764n1193j028671j898804
$$ 707136765 710559158 714330368 717913513 720869827 722912750 723911514 723860321 722831650 720932846
1157G20932846k666244l378983m128723n036087o210251p690735r407425j1187286
$$ 720932846 718266602 714887619 710758896 705722809 699512558 691821823 682414398 671227112
1165F71227112j2820053j4157944j5190353j6036721j6846809j7648888j8228187j8127251
$$ 671227112 658407059 644249115 629058762 613022041 596175232 578526344 560298157 542170906
1173E42170906j6787758j3792572r093818l112107L351097R357338J4125061J7245369
$$ 542170906 525383148 511590576 502496758 499384651 502735748 512093086 526218147 543463516
1181E43463516J8733826J8920364J8247109J7081909J5627670J3940850J2021560R902954
$$ 543463516 562197342 581117706 599364815 616446724 632074394 646015244 658036804 667939758
1189F67939758P690811N539170L589935J921845N32074o41861j684342k670822l656845
$$ 667939758 675630569 681169739 684759674 686681519 687213593 686571732 684887390 682216568 678559723
1198F78559723m683838n790482p012252q375092r888382j1543579j3324623j5220566
$$ 678559723 673875885 668085403 661073151 652698059 642809677 631266098 617941475 602720909
1206F02720909j7232475j9364319k1605454k3904800k6157379k8203163k9839211l0848884
$$ 602720909 585488434 566124115 544518661 520613861 494456482 466253319 436414108 405565224
1214D05565224l1031494l0234948k8386631k5512638k1743412j7302646j2471123p542725
$$ 405565224 374533730 344298782 315912151 290399513 268656101 251353455 238882332 231339607
1222B31339607k774887J647453N624791R133472J2196808J4850998J7116737J8983155
$$ 231339607 228564720 230212173 235836964 244970436 257167244 272018242 289134979 308118134
1230C08118134K0408058K1329422K1683616K1426659K0549202J9089088J7130852J4800339
$$ 308118134 328526192 349855614 371539230 392965889 413515091 432604179 449735031 464535370
1238D64535370J2250252R643592P141800M897843L053856J734466J027146R42115J366654
$$ 464535370 476785622 486429214 493571014 498468857 501522713 503257179 504284325 505226440 506593094
1247E06593094K032814K536545K425537J352386p52945l566589o376190q251152q333740
$$ 506593094 508625908 511162453 513587990 514940376 514187431 510620842 504244652 495993500 487659760
1256D87659760o162682j895409L672257R313278J3738518J5983658J5671730J3052330
$$ 487659760 481497078 479601669 483273926 492587204 506325722 522309380 537981110 551033440
1264E51033440Q827781L857575j124802n671768r619598j2964707j5708732j7755471
$$ 551033440 559861221 563718796 562593994 556922226 547302628 534337921 518629189 500873718
1272E00873718j8904800j8930168j7690125j5217590j1752968p715454l624382Q77
$$ 500873718 481968918 463038750 445348625 430131035 418378067 410662613 407038231 407039108
1280D07039108K748337M402771M999466M821625M327736M024620M318733N400352P198983
$$ 407039108 409787445 414190216 419189682 424011307 428339043 432363663 436682396 442082748 449281731
1289D49281731R427566J1687851J3589058J4834137J5248947J4767494J3401719J1226921
$$ 449281731 458709297 470397148 483986206 498820343 514069290 528836784 542238503 553465424
1297E53465424Q390235N123368J741104j395722l943138n639267o349830o079979m958153
$$ 553465424 561855659 566979027 568720131 567324409 563381271 557742004 551392174 545312195 540354042
1306E40354042l208885j120911R89952K826538M175377M962998N283851N369606N498352
$$ 540354042 537145157 536024246 537014198 539840736 544016113 548979111 554262962 559632568 565130920
1315E65130920N876694O545906P357788Q038216Q307304P998581P123146N851136M431762
$$ 565130920 571007614 577553520 584911308 592949524 601256828 609255409 616378555 622229691 626661453
1324F26661453L095360J992111J185417O89927N17921O99768J264000K194939L397865
$$ 626661453 629756813 631748924 632934341 633624268 634142189 634841957 636105957 638300896 641698761
1333F41698761M700165N888748O774597P243195P281570O962052O404647N734406N053253
$$ 641698761 646398926 652287674 659062271 666305466 673587036 680549088 686953735 692688141 697741394
1342F97741394M430771L909531L511886L238907L066711K940903K782211K510605K073288
$$ 697741394 702172165 706081696 709593582 712832489 715899200 718840103 721622314 724132919 726206207
1351G26206207J471863P62329K1362p09152j479721k449035l836670n810776q351898
$$ 726206207 727678070 728440399 728461761 727752609 726272888 723823853 719987183 714176407 705824509
1360G05824509j1158066j3649216j5107193j4906311j2761268q878594l942451J073494
$$ 705824509 694666443 681017227 665910034 651003723 638242455 629363861 625421410 626494904
1368F26494904N198478P743836Q465614P557449N504227K877655J68686k286606m290390
$$ 626494904 631693382 639437218 647902832 655460281 660964508 663842163 664010849 661724243 657433853
1377F57433853n725098o509628o600036o024170m910012l474846j964836n77049N95780
$$ 657433853 651708755 645199127 638599091 632574921 627664909 624190063 622225227 621648178 622243958
1386F22243958J566505K402801L156014L812599M293862M496459M351120L857575L085327
$$ 622243958 623810463 626213264 629369278 633181877 637475739 641972198 646323318 650180893 653266220
1395F53266220K141190J127395J17798q46939j743545k552414l251648l822098m250488
$$ 653266220 655407410 656534805 656652603 655805664 654062119 651509705 648258057 644435959 640185471
1404F40185471m524727m621010m494438m088288l362770k339325j130905N6610R68514
$$ 640185471 635660744 631039734 626545296 622457008 619094238 616754913 615624008 615680618 616649132
1413F16649132J376686J158943L52783q45833k137909l214607l852806l978462l670616
$$ 616649132 618025818 619184761 619537544 618691711 616553802 613339195 609486389 605507927 601837311
1422F01837311l109741k495423j965980j561470j242867r51118o79131n06172n78461
$$ 601837311 598727570 596232147 594266167 592704697 591461830 590510712 589831581 589325409 588746948
1431E88746948j039657j943093l190841m535447n642547o196404o004638n063553l569946
$$ 588746948 587707291 585764198 582573357 578037910 572395363 566198959 560194321 555130768 551560822
1440E51560822j874123l92914M93393N40886k87018j798935l620872n302620o459465
$$ 551560822 549686699 549293785 549787178 550328064 550041046 548242111 544621239 539318619 532859154
1449E32859154o898041o670609o032676n314827m767800m454231m238205l875236l151779
$$ 532859154 525961113 519290504 513257828 507943001 503175201 498720970 494482765 490607529 487455750
1458D87455750j999779n27725J042823K491532L697815M673385N512085O303826P058754
$$ 487455750 485455971 484928246 485971069 488462601 492160416 496833801 502345886 508649712 515708466
1467E15708466P692031Q073311Q105660P788276P225609O581459O003189N563012N240402
$$ 515708466 523400497 531473808 539579468 547367744 554593353 561174812 567178001 572741013 577981415
1476E77981415M955635M630813M238282L820877L462448L239441L174171L224869L314247
$$ 577981415 582937050 587567863 591806145 595627022 599089470 602328911 605503082 608727951 612042198
1485F12042198L383751L437805L544998L789902M198303M678231N024528M992600M416351
$$ 612042198 615425949 618863754 622408752 626198654 630396957 635075188 640099716 645092316 649508667
1494F49508667L299103J828460K89460j081772k226792l304901m613037o438980q910065
$$ 649508667 652807770 654636230 654925690 653843918 651617126 648312225 643699188 637260208 628350143
1503F28350143j1930046j5212173j8375435k1027374k2784310k3240165k1943741j8464661
$$ 628350143 616420097 601207924 582832489 561805115 539020805 515780640 493836899 475372238
1511D75372238j2564277m418679N235176J5139199K3782844K9819641L2471085L1747208
$$ 475372238 462807961 458389282 463624458 478763657 502546501 532366142 564837227 596584435
1519E96584435K8393058K3590927J8554917J4184189J0895919Q665085P201767O162796
$$ 596584435 624977493 648568420 667123337 681307526 692203445 700868530 708070297 714233093
1527G14233093N303116M527283L855667L353577L063201K963028K962342K922668K699509
$$ 714233093 719536209 724063492 727919159 731272736 734335937 737298965 740261307 743183975 745883484
1536G45883484K193756J400681M31594n06973j180420j418457j192550o35911P096
$$ 745883484 748077240 749477921 749909515 749402542 748222122 746803665 745611115 744975204 744982300
1545G44982300M89807O76880O04172M53872M45557P04193J163254J574936J616592
$$ 744982300 745472107 746148987 746753159 747207031 747652588 748356781 749520035 751094971 752711563
1554G52711563J060410q4000j531677k816620l489456l320542k413177j162796p9498
$$ 752711563 753771973 753687973 752156296 749339676 745850220 742529678 740116501 738953705 738874207
1563G38874207M41589K85339l57818j121445j664505j842270j754761j663437j833114
$$ 738874207 739315796 739601135 739243317 738121872 736457367 734615097 732860336 731196899 729363785
1572G29363785k398224l324356m469681n687180o889495q023529q985520r543838r354554
$$ 729363785 726965561 723641205 719171524 713484344 706594849 698571320 689585800 680041962 670687408
1581F70687408q090133n630951k211380J574631M936828P159958P855835P083664N283585
$$ 670687408 662597275 656966324 654754944 656329575 661266403 668426361 676282196 683365860 688649445
1590F88649445L068084R79386o81305j884003k782745l573914m387588n251313o126480
$$ 688649445 691717529 692696915 692015610 690131607 687348862 683774948 679387360 674136047 668009567
1599F68009567o967544p761002q521881r256859r930916j0459365j0733147j0660095
$$ 668009567 661042023 653281021 644759140 635502281 625571365 615112000 604378853 593718758
1607E93718758j0193863r335480q114510o563377m713745k616577l74260J834755L767280
$$ 593718758 583524895 574189415 566074905 559511528 554797783 552181206 551806946 553641701 557408981
1616E57408981N161858N808601N612946M629326L046798J138077q09669k558899l962517
$$ 557408981 562570839 568379440 573992386 578621712 581668510 582806587 581996918 579438019 575475502
1625E75475502m978828n661583o139908o584511p170753q033600r226151j0691032
$$ 575475502 570496674 564835091 558695183 552110672 544939919 536906319 527680168 516989136
1633E16989136j2265549j3723793j4850273j5520859j5752487j5700874j5593453j5629043
$$ 516989136 504723587 490999794 476149521 460628662 444876175 429175301 413581848 397952805
1641C97952805j5880471j6248588j6487084j6290474j5401210j3689404j1176243p990513
$$ 397952805 382072334 365823746 349336662 333046188 317644978 303955574 292779331 284788818
1649B84788818m301529k61516M005222Q367195J2636795J6544533J9766808K2004547
$$ 284788818 280487289 280225773 284230995 292598190 305234985 321779518 341546326 363550873
1657C63550873K3072281K2960472K1829910J9953194J7620773J5073662J2475700R935570
$$ 363550873 386623154 409583626 431413536 451366730 468987503 484061165 496536865 506472435
1665E06472435P544632N400009L589134K157326J077919K59934m05236r84764j469765
$$ 506472435 514017067 519417076 523006210 525163536 526241455 526501389 526096153 525111389 523641624
1674E23641624j792221j890640j781692j596985j548653j840172k566719l659973m914207
$$ 523641624 521849403 519958763 518177071 516580086 515031433 513191261 510624542 506964569 502050362
1683E02050362o082878o999741p661057q228798q958778j0086403j1730919j3855438
$$ 502050362 495967484 488967743 481306686 473077888 464119110 454032707 442301788 428446350
1691D28446350j6291580j8803024k1150895k3130493k4573784k5335807k5287171k4330330
$$ 428446350 412154770 393351746 372200851 349070358 324496574 299160767 273873596 249543266
1699B49543266k2430134j9643173j6119423j2068634p705936l202114J329136N797634
$$ 249543266 227113132 207469959 191350536 179281902 171575966 168373852 169702988 175500622
1707A75500622J0069370J3901615J6923638J8688106J8789139J7007275J3426494Q471279
$$ 175500622 185569992 199471607 216395245 235083351 253872490 270879765 284306259 292777538
1715B92777538K842617k628631p160816j0175438j1377392j0755635q518066n006905
$$ 292777538 295620155 292991524 285830708 275655270 264277878 253522243 245004177 239997272
1723B39997272o22425M222584R128437J3727112J7709732K0860558K3084640K4412003
$$ 239997272 239374847 243597431 252725868 266452980 284162712 305023270 328107910 352519913
1731C52519913K4966888K4917603K4422722K3597526K2515564K1233521J9820098J8371315
$$ 352519913 377486801 402404404 426827126 450424652 472940216 494173737 513993835 532365150
1739E32365150J6995316J5778313J4749489J3867492J3037644J2157211J1163979J0068511
$$ 532365150 549360466 565138779 579888268 593755760 606793404 618950615 630114594 640183105
1747F40183105Q952942P936325P125702O572953O256485O093826N974884N802078N517960
$$ 640183105 649136047 657072372 664198074 670771027 677027512 683121338 689096222 694898300 700416260
1756G00416260N118408M642944M159851L742295L449783L309250L305282L376542L430328
$$ 700416260 705534668 710177612 714337463 718079758 721529541 724838791 728144073 731520615 734950943
1765G34950943L367538L118592K673721K093659J493988J006774P32117P05567Q85238
$$ 734950943 738318481 741437073 744110794 746204453 747698441 748705215 749437332 750142899 751028137
1774G51028137J172867J450348J618042J625900J480789J242371R99069Q44193Q41446
$$ 751028137 752201004 753651352 755269394 756895294 758376083 759618454 760617523 761461716 762303162
1783G62303162J000747J265335J525498J654587J563339J246719P97043L74680J38015
$$ 762303162 763303909 764569244 766094742 767749329 769312668 770559387 771356430 771731110 771869125
1792G71869125J70975M40292Q07190J094132J168594J006165O96640L94516K38113
$$ 771869125 772040100 772480392 773287582 774381714 775550308 776556473 777253113 777647629 777885742
1801G77885742K83280M84390P26471Q89664R05838P84988N95169M20227L18146K99988
$$ 777885742 778169022 778653412 779379883 780269547 781175385 781960373 782555542 782975769 783293915 783593903
1811G83593903L39126L93982M33273M48761M50058M55323M77752N20859N76019O24695
$$ 783593903 783933029 784327011 784760284 785209045 785659103 786114426 786592178 787113037 787689056 788313751
1821G88313751O42472O06155N03998L43322J54648j5869j27106j58309j21232n0201
$$ 788313751 788956223 789562378 790066376 790409698 790564346 790548477 790421371 790263062 790141830 790091629
1831G90091629K1133Q1101J49231K58484M25262O21262P72095P86895O07453K50778
$$ 790091629 790112762 790193863 790343094 790601578 791026840 791648102 792420197 793207092 793814545 794065323
1841G94065323j85089n56259p38297o84814m46854j47095Q5526J76086J33438L1662
$$ 794065323 793880234 793323975 792585678 791900864 791454010 791306915 791392441 791568527 791701965 791733627
1851G91733627m4555m8447L738N6534N9815J0376m0055j7624J22376L54462N87005
$$ 791733627 791689072 791640625 791644363 791700897 791760712 791771088 791731033 791713409 791835785 792190247 792777252
1862G92777252O99387O09436L15933r4757m88205p45621q13522p20139n47027l82385
$$ 792777252 793476639 794086075 794402008 794307251 793819046 793073425 792259903 791539764 790992737 790610352
1872G90610352k77253k30789k06909j67313r7274j2970N4779Q3313P3929M8522L3493
$$ 790610352 790333099 790102310 789895401 789728088 789630814 789617844 789672623 789755936 789829865 789878387 789911880
1883G89911880L9216N2948M6920j373r2087j97525k74048k85644k21863j07422J1368
$$ 789911880 789951096 790004044 790050964 790049591 789957504 789759979 789485931 789200287 788978424 788871002 788882370
1894G88882370Q8043R9564N8441O180q469M6082J65023L08381M18090M47388L84216
$$ 788882370 788970413 789069977 789128418 789134598 789126129 789172211 789337234 789645615 790063705 790511093 790895309
1905G90895309K58790J32522O5384Q8196J85089K99911L65067L33710K04315J8844
$$ 790895309 791154099 791286621 791352005 791440201 791625290 791925201 792290268 792623978 792828293 792847137
1915G92847137j57470k69852k99301k65198k11410j75324j69296j73569j55487r0103
$$ 792847137 792689667 792419815 792120514 791855316 791643906 791468582 791299286 791125717 790970230 790880127
1925G90880127J8768J39008K27661K53296K16064J47248R3078Q9951J45035K33764
$$ 790880127 790898895 791037903 791265564 791518860 791734924 791882172 791975250 792065201 792210236 792444000
1935G92444000L11585L36685K91061J86539N8746n0659j12381j19858q7738m2572q392
$$ 792444000 792755585 793092270 793383331 793569870 793628616 793577957 793465576 793345718 793257980 793215408 793207016
1946G93207016L891j602j1749j3352j144J9378L6240L8376K4109K289j0605K29L8147
$$ 793207016 793210907 793209305 793197556 793184204 793183060 793202438 793238678 793277054 793301163 793303452 793292847 793293076 793331223
1959G93331223R2544J41220J61057J38626P7972Q39o4163r2621p6370k5711L5935Q2778
$$ 793331223 793423767 793564987 793726044 793864670 793942642 793943481 793879318 793786697 793710327 793684616 793720551 793803329
1971G93803329R9259Q6059N7297L2501K5406L6850N6992O9961O5537M5471K2507J1978
$$ 793803329 793902588 793988647 794045944 794078445 794103851 794140701 794197693 794267654 794333191 794378662 794401169 794413147
1983G94413147K2964M8295O7672N7144J831r2392j97677k76871l00522k60391j78146
$$ 794413147 794436111 794484406 794552078 794609222 794611053 794518661 794320984 794044113 793743591 793483200 793305054
1994G93305054r2011m1122m3564q9722j47018j78833j65024j12000m9362j2130j9684
$$ 793305054 793213043 793171921 793128357 793038635 792891617 792712784 792547760 792435760 792386398 792374268 792354584
2005G92354584o5232j17874j41067j13068m0970M3259R7580R6283M0741l8986j00556
$$ 792354584 792289352 792171478 792030411 791917343 791876373 791919632 792017212 792113495 792154236 792115250 792014694
2016G92014694j12915p1792j755N8746P9422N3787L052l8528m3869r308M3640P9651
$$ 792014694 791901779 791829987 791828232 791886978 791966400 792020187 792023239 791984711 791940842 791931534 791975174 792054825
2028G92054825P1869J8387n7221j16730j32064j00098m6616j2054k8839j01853k06222
$$ 792054825 792126694 792145081 792087860 791971130 791839066 791738968 791692352 791680298 791651459 791549606 791343384
2039G91343384k98691l43704l30582k81067k34909k27661k69928l42483m06647m28238
$$ 791343384 791044693 790700989 790370407 790089340 789854431 789626770 789356842 789014359 788607712 788179474
2049G88179474l94516l22800k46887j97601j83106j85241j71280j15281j5564J01624
$$ 788179474 787784958 787462158 787215271 787017670 786834564 786649323 786478043 786362762 786347198 786448822
2059G86448822J94397K29416J99432J29700O2866L8147O9657J39846K11487K48184
$$ 786448822 786643219 786872635 787072067 787201767 787264633 787302780 787372437 787512283 787723770 787971954
2069G87971954K35443J87684J38778J22147J50680K10801K68783K92740K68555K09884
$$ 787971954 788207397 788395081 788533859 788656006 788806686 789017487 789286270 789579010 789847565 790057449
2079G90057449J48697J17340J29319J71966K14539K25601J91727J24893N6076J6937
$$ 790057449 790206146 790323486 790452805 790624771 790839310 791064911 791256638 791381531 791437607 791454544
2089G91454544K2659O2485J07727J28021J08109N7144J907k8915k0218K0218O6910
$$ 791454544 791477203 791539688 791647415 791775436 791883545 791940689 791942596 791913681 791893463 791913681 791980591
2100G91980591R3689Q6059N0888R995j1826k975L0289O6604Q4152P1793L5629n188
$$ 791980591 792074280 792160339 792211227 792221222 792209396 792206421 792236710 792303314 792387466 792459259 792494888 792489700
2112G92489700l0288k9908p858J9150L4637L1357J3657m425j0681m58J9455L5934L9444
$$ 792489700 792459412 792429504 792421646 792440796 792475433 792506790 792520447 792516022 792505341 792504883 792524338 792560272 792599716
2125G92599716K8305J0681J53M578K2735M4174N5161M8599K7390L738p934n35K1973
$$ 792599716 792628021 792638702 792638855 792643433 792666168 792710342 792765503 792814102 792841492 792845230 792837296 792836761 792858734
2138G92858734M6005N7526N0125K8992P706P62J2589L5934N5924N8288L9063P248k1286
$$ 792858734 792904739 792962265 793012390 793041382 793049088 793049850 793062439 793098373 793154297 793212585 793251648 793258896 793237610
2151G93237610l1510j9683N264K7466L3416K0676k441k0523k3117j0529N798J0758
$$ 793237610 793206100 793186417 793191681 793219147 793252563 793273239 793270798 793250275 793227158 793216629 793222427 793233185
2163G93233185m730l7461p2098r0637q2702n1499j2817J4114J7472P62k1667l1815
$$ 793233185 793228455 793190994 793118896 793028259 792945557 792894058 792881241 792895355 792912827 792913589 792891922 792860107
2175G92860107j8081J4572M9515O8512O0348K9755n036k3880j4877J7090N4092P4158
$$ 792860107 792842026 792856598 792906113 792974625 793034973 793064728 793059692 793035812 793020935 793038025 793092117 793166275
2187G93166275O3553K6550j9684n2566n8518m0359j4954l814j8921n5542r5978j17722
$$ 793166275 793229828 793256378 793236694 793184128 793125610 793085251 793070297 793066483 793047562 792992020 792896042 792778320
2199G92778320j09558p6217l7919j6937k5253n6915r1935j08337r4604n8518k0981
$$ 792778320 792668762 792592545 792554626 792537689 792512436 792455521 792363586 792255249 792160645 792102127 792081146
2210G92081146m120j7776n3787r0104j04446q7967n0125j4038k441k4491p0114j15890
$$ 792081146 792077026 792059250 792005463 791915359 791810913 791722946 791672821 791658783 791656342 791631851 791561737 791445847
2222G91445847j39084j30463r9945o9428o0348q0261j17798j49918j55182j26342p5760
$$ 791445847 791306763 791176300 791076355 791006927 790946579 790866318 790748520 790598602 790443420 790317078 790241318
2233G90241318k6322p63p095l4332o1264o7902m8218j3656J5106K1362J297l0746n3787
$$ 790241318 790214996 790214233 790207138 790172806 790111542 790043640 789995422 789981766 789996872 790018234 790019531 789988785 789934998
2246G89934998n2109k5254J0453L1509K2278j5793o3858r5978r5062o1111j4267J9455
$$ 789934998 789882889 789857635 789868088 789899597 789921875 789906082 789842224 789746246 789651184 789590073 789575806 789595261
2258G89595261K0599j1749n9815r7732j06278q3236m4098j3352r460l5706p7209j12076
$$ 789595261 789615860 789604111 789544296 789446564 789340286 789257050 789212952 789199600 789190140 789154434 789077225 788965149
2270G88965149j22833j07727p9499n8746n8060p5073r1629q4839m2190K8610J00555
$$ 788965149 788842316 788734589 788655090 788596344 788538284 788463211 788371582 788286743 788244553 788273163 788373718
2281G88373718J40610J28021O5460k0217r1706j20697j01929n6381j6098p629l7079
$$ 788373718 788514328 788642349 788707809 788687592 788595886 788475189 788373260 788316879 788300781 788293152 788256073
2292G88256073q7814j31913j46942j27945q9721n4551l9901m8981o9733q6670r1400
$$ 788256073 788168259 788036346 787889404 787761459 787671738 787617187 787577286 787528305 787458572 787371902 787280502
2303G87280502q8882r6130j29166j92032k71072l35770l51944k99377j83259l9291
$$ 787280502 787191620 787095490 786966324 786774292 786503220 786167450 785815506 785516129 785332870 785293579
2313G85293579P3547R6055p248k25754n01938p47299q80280q63113p21817n37415m05426
$$ 785293579 785367126 785463181 785455933 785230179 784728241 783980942 783100662 782237549 781515732 780978317 780572891
2324G80572891l90167m92172o49414p73468p99103p15485n66940m18777l18909k77863
$$ 780572891 780182724 779690552 779041138 778267670 777468567 776753082 776186142 775767365 775448456 775170593
2334G75170593k83355l33176m59976p16095j118622j591263j939697j906052j282806
$$ 775170593 774887238 774554062 774094086 773377991 772259369 770668106 768728409 766822357 765539551
2343G65539551m0207J604080L224793M335556M575576L857804K398681O23398j006546
$$ 765539551 765499344 767103424 770328217 774663773 779239349 783097153 785495834 786119232 785112686
2352G85112686k165298k747803k854767k691421k452851k246399k084579j923065j720505
$$ 785112686 782947388 780199585 777344818 774653397 772200546 769954147 767869568 765946503 764225998
2361G64225998j469116j192856r25217o81076m54864k30942j526K24762M29916O02799
$$ 764225998 762756882 761564026 760638809 759957733 759502869 759271927 759270401 759495163 759925079 760527878
2371G60527878P49130Q89664J048050J231842J428451J609574J744842J815415J816787
$$ 760527878 761277008 762166672 763214722 764446564 765875015 767484589 769229431 771044846 772861633
2380G72861633J755448J640472J479035J278839J052093Q19626O05698M31366L04107
$$ 772861633 774617081 776257553 777736588 779015427 780067520 780887146 781492844 781924210 782228317
2389G82228317K18048J56098J02386M9210N34l4638m8523m2343k6321j4038j5793l1815
$$ 782228317 782446365 782602463 782704849 782754059 782754593 782719955 782671432 782629089 782602768 782588730 782572937 782541122
2401G82541122n4550p0724p1182n5924l3188j7395k0675m5090q2016j14975j28555
$$ 782541122 782486572 782415848 782344666 782288742 782255554 782238159 782217484 782172394 782090378 781975403 781846848
2412G81846848j15509q2856m7989k9449l7460o7292j00326j15891j01318n9509q774
$$ 781846848 781731339 781648483 781600494 781571045 781533585 781466293 781365967 781250076 781148758 781089249 781080475
2423G81080475K9754M2878L3874J8311J5564L4713O8512R6894R9792O9046J4496l9596
$$ 781080475 781110229 781153107 781186981 781205292 781220856 781255569 781324081 781420975 781520767 781589813 781604309 781564713
2435G81564713o9809o5537l6316m959M807j7777o3782j09405j31149j17035p6371l0822
$$ 781564713 781494904 781429367 781393051 781388092 781392899 781375122 781311340 781201935 781070786 780953751 780877380 780846558
2447G80846558n417j2665m5853q4305j03225r0409n1574o943J8768J1521k5101p2632
$$ 780846558 780841141 780828476 780782623 780698318 780595093 780504684 780453110 780446167 780464935 780476456 780451355 780378723
2459G80378723j07574j15586r9182p4692o2942p7744j15280j58920j87912j89209j66168
$$ 780378723 780271149 780155563 780056381 779981689 779918747 779841003 779725723 779566803 779378891 779189682 779023514
2470G79023514j35346j17721j25046j54419j88522k06909j97449j63040j20926r1400
$$ 779023514 778888168 778770447 778645401 778490982 778302460 778095551 777898102 777735062 777614136 777522736
2480G77522736q7891j09024j38702j58463j54724j29624r7885p6904p9727j03302j33057
$$ 777522736 777434845 777325821 777187119 777028656 776873932 776744308 776646423 776569519 776489792 776386490 776253433
2491G76253433j49536j39007j01624n0964o714J5945J2818p096k7923l6316k6779o638
$$ 776253433 776103897 775964890 775863266 775812302 775805588 775821533 775834351 775827255 775799332 775763016 775736237 775729599
2503G75729599J2894J9531R689j1978l6316n4092o2409o4315o7368p7362r5673j17798
$$ 775729599 775742493 775762024 775771713 775759735 775723419 775669327 775606918 775542603 775475235 775397873 775302200 775184402
2515G75184402j36718j47400j48773j44654j40838j40686j44883j48391j46179j34354
$$ 775184402 775047684 774900284 774751511 774606857 774466019 774325333 774180450 774032059 773885880 773751526
2525G73751526j13220q6747o0882m0207k7161k0828j8692j8082j7929j8081j9760k3728
$$ 773751526 773638306 773551559 773490677 773450470 773423309 773402481 773383789 773365707 773347778 773329697 773309937 773286209
2537G73286209l0594m0741n5084p4158r8266j26496j55944j81962k00576k08817k05459
$$ 773286209 773255615 773214874 773159790 773085632 772987366 772860870 772704926 772522964 772322388 772113571 771908112
2548G71908112j91727j67694j34583r2239m0970J5564P0953J16349J44043J50833J40304
$$ 771908112 771716385 771548691 771414108 771321869 771280899 771296463 771367416 771483765 771627808 771778641 771918945
2559G71918945J20697J01853R0179Q6136Q3313P4081N4093K3956q468l4638m8981n3253
$$ 771918945 772039642 772141495 772231674 772317810 772401123 772475204 772529297 772553253 772544785 772510147 772461166 772407913
2571G72407913n5008o2637q1711j08566j34277j48011j43051j21918r3765p2708o6528
$$ 772407913 772352905 772290268 772208557 772099991 771965714 771817703 771674652 771552734 771458969 771386261 771319733
2582G71319733p7362r8191j19095j32370j36642j36719j39847j50146j65176j76697
$$ 771319733 771242371 771144180 771025085 770892715 770756073 770619354 770479507 770329361 770164185 769987488
2592G69987488j76926j61896j36718j11695r9182j04217j23062j43586j52740j43280
$$ 769987488 769810562 769648666 769511948 769400253 769301071 769196854 769073792 768930206 768777466 768634186
2602G68634186j18714r1323p5913q0414j02920j30616j48162j46103j25962r9411q2321
$$ 768634186 768515472 768424149 768348236 768267822 768164902 768034286 767886124 767740021 767614059 767514648 767432327
2613G67432327q3923j02615j24817j35346j22909q9951m9820j9455j1520k5788n0964
$$ 767432327 767348404 767245789 767120972 766985626 766862717 766772766 766722946 766703491 766691971 766666183 766615219
2624G66615219p0267p2784n7373l4790j8768j8540l2120m9057n5236m3412j7395Q698
$$ 766615219 766544952 766472168 766414795 766380005 766361237 766342697 766310577 766261520 766206284 766162872 766145477 766154175
2636G66154175K0675R919j8158m9286o6757o1493l7461q087J0071R384p019k4872k8610
$$ 766154175 766174850 766184769 766166611 766117325 766050568 765989075 765951614 765943527 765953598 765962982 765955963 765931091 765902481
2649G65902481j0300K5101O2256Q3618Q0032N4398K1133k975p706M959K2660L0136
$$ 765902481 765892181 765917282 765979538 766063156 766143188 766197586 766218719 766215744 766208038 766212997 766235657 766265793
2661G66265793J9531p019l6926n5237n4779l9673k2812k0141l9673p6752j18561j46637
$$ 766265793 766285324 766278305 766241379 766186142 766131363 766091690 766068878 766048737 766009064 765932312 765813751 765667114
2673G65667114j51977j36338j11541r4223r3613j09863j32447j48086j48697j34964
$$ 765667114 765515137 765378799 765267258 765173035 765079422 764969559 764837112 764689026 764540329 764405365
2683G64405365j17111j05286j06201j16196j24664j22604j06659q3618o6987o8893
$$ 764405365 764288254 764182968 764076767 763960571 763835907 763713303 763606644 763523026 763456039 763387146
2693G63387146r1782j28479j62658j79673j74942j54724j35040j30157j46637j78299
$$ 763387146 763295364 763166885 763004227 762824554 762649612 762494888 762359848 762229691 762083054 761904755
2703G61904755k11335k31475k33918k23922k14081k16751k35138k62680k86179k95029
$$ 761904755 761693420 761461945 761228027 761004105 760790024 760573273 760338135 760075455 759789276 759494247
2713G59494247k87628k72522k63138k69699k92434l20053l37067l32794l06778k71836
$$ 759494247 759206619 758934097 758670959 758401260 758108826 757788773 757451706 757118912 756812134 756540298
2723G56540298k44445k38648k55890k87399l17764l35160l37524l32794l32947l45612
$$ 756540298 756295853 756057205 755801315 755513916 755196152 754860992 754523468 754190674 753857727 753512115
2733G53512115l69491l92990m03366l91617l60031l19672k84881k64893k58713k58026
$$ 753512115 753142624 752749634 752346268 751954651 751594620 751274948 750990067 750725174 750466461 750208435
2743G50208435k50931k32849k07214j85776j80511j95771k26669k58560k78473k79770
$$ 750208435 749957504 749724655 749517441 749331665 749151154 748955383 748728714 748470154 748191681 747911911
2753G47911911k67944k56501k59018k80685l14560l45611l58277l46451l17916k88849
$$ 747911911 747643967 747387466 747128448 746847763 746533203 746187592 745829315 745482864 745164948 744876099
2763G44876099k77710k92969l30200l73764m07257m20685m18091m11835m16260m37927
$$ 744876099 744598389 744305420 743975220 743601456 743194199 742773514 742355423 741943588 741527328 741089401
2773G41089401m71191n01938n15671n05371m77371m45557m25491m23584m35410m48227
$$ 741089401 740618210 740116272 739600601 739095230 738617859 738172302 737746811 737323227 736887817 736439590
2783G36439590m48989m33426m07563l85437l79333l92990m18015m40139m45176m30298
$$ 736439590 735990601 735557175 735149612 734764175 734384842 733991852 733573837 733133698 732688522 732258224
2793G32258224m03518l81470l78265l98255m33349m66080m81186m72259m45862m17786
$$ 732258224 731854706 731473236 731094971 730696716 730263367 729797287 729316101 728843842 728397980 727980194
2803G27980194m02298m06570m24195m42810m49371m40369m22439m09851m14353m38843
$$ 727980194 727577896 727171326 726747131 726304321 725854950 725414581 724992142 724582291 724167938 723729095
2813G23729095m76455n15061n46493n72968o09131o73370p83310r48410j170807j453171
$$ 723729095 723252640 722737579 722191086 721618118 721008987 720335617 719552307 718603897 717433090 715979919
2823G15979919j802063k226867k729340l284530l826981m249802m424896m235992l622895
$$ 715979919 714177856 711950989 709221649 705937119 702110138 697860336 693435440 689199448 685576553
2832F85576553k608871j306839J03531J421814K475281L158111L447189L391419L083801
$$ 685576553 682967682 681660843 681764374 683186188 685661469 688819580 692266769 695658188 698741989
2841F98741989K628937K117844J614608J156922P61337M32129J66931m3640k11868
$$ 698741989 701370926 703488770 705103378 706260300 707021637 707453766 707620697 707577057 707365189
2850G07365189l51410m74320n87387o90994p82471q60367r26513r88922j056519j135330
$$ 707365189 707013779 706539459 705952072 705261078 704478607 703618240 702691727 701702805 700646286 699510956
2860F99510956j225510j320648j411285j489335j551971j601181j641083j675720j706161
$$ 699510956 698285446 696964798 695553513 694064178 692512207 690911026 689269943 687594223 685888062
2869F85888062j730652j747208j754837j755142j752091j749115j750641j757812j775055
$$ 685888062 684157410 682410202 680655365 678900223 677148132 675399017 673648376 671890564 670115509
2878F70115509j804581j850891j916351k001190k101517k210999k324066k435684k544632
$$ 670115509 668310928 666460037 664543686 662542496 660440979 658229980 655905914 653470230 650925598
2887F50925598k651062k753525k847519k924499k975006k989540k965431k905694k820205
$$ 650925598 648274536 645521011 642673492 639748993 636773987 633784447 630819016 627913322 625093117
2896F25093117k721253k620506k525787k439270k358055k276421k187157k084961j964645
$$ 625093117 622371864 619751358 617225571 614786301 612428246 610151825 607964668 605879707 603915062
2905F03915062j825256j667405j496200j320954j155624j018448r28840r03435r51462
$$ 603915062 602089806 600422401 598926201 597605247 596449623 595431175 594502335 593598900 592647438
2914E92647438j072960j256485j483803j732444j983490k222100k438163k623291k765275
$$ 592647438 591574478 590317993 588834190 587101746 585118256 582896156 580457993 577834702 575069427
2923E75069427k847785k849656k751960k544022k231178j835213j393585r48830n42030
$$ 575069427 572221642 569371986 566620026 564076004 561844826 560009613 558616028 557667198 557125168
2932E57125168k02522N5542K32925L40576L94936M09469L93982L49884K74659J61590
$$ 557125168 556922646 556978188 557211113 557551689 557946625 558356094 558750076 559099960 559374619 559536209
2942E59536209N913j94550m35371p07245r94682j279183j538620j747131j874733j886406
$$ 559536209 559542122 559347572 558912201 558204956 557210274 555931091 554392471 552645340 550770607 548884201
2952E48884201j748199j433983r36928k79579M82178J264419J971436K514801K837181
$$ 548884201 547136002 545702019 544765091 544485512 544967690 546232109 548203545 550718346 553555527
2961E53555527K921829K793846K508659K132225J723595J323242R51195O11992L03764
$$ 553555527 556477356 559271202 561779861 563912086 565635681 566958923 567910118 568522110 568825874
2970E68825874K6131k17934m22744n83153o96030p59811p71828p24754o07834m09050
$$ 568825874 568852005 568634071 568211327 567628174 566932144 566172333 565400505 564675751 564067917 563658867
2980E63658867j23596K40860O58798J089096J482201J791687J985855K057151K022591
$$ 563658867 563535271 563776131 564434929 565524025 567006226 568797913 570783768 572840919 574863510
2989E74863510J919594J794395J689377J634331J639175J696015J785545J883125J969872
$$ 574863510 576783104 578577499 580266876 581901207 583540382 585236397 587021942 588905067 590874939
2998E90874939K034035K076454K105675K136535K182198K251739K344017K448540K546005
$$ 590874939 592908974 594985428 597091103 599227638 601409836 603661575 606005592 608454132 611000137
3007F11000137K612915K629013K581635K470131K305183K105255J890679J676101J469727
$$ 611000137 613613052 616242065 618823700 621293831 623599014 625704269 627594948 629271049 630740776
3016F30740776J271324J077118Q84476O94656N13306L47404K01378P3395m3831j60484
$$ 630740776 632012100 633089218 633973694 634668350 635181656 635529060 635730438 635803833 635760002 635599518
3026F35599518k84119m16336n51414o79894p92541q85353r59473j020966j075134j126060
$$ 635599518 635315399 634899063 634347649 633667755 632875214 631989861 631030388 630009422 628934288 627808228
3036F27808228j172600j213990j250000j285285j326409j380462j449700j530304j614227
$$ 627808228 626635628 625421638 624171638 622886353 621559944 620179482 618729782 617199478 615585251
3045F15585251j692505j761246j823120j887283j963082k055244k159119k261467k345314
$$ 615585251 613892746 612131500 610308380 608421097 606458015 604402771 602243652 599982185 597636871
3054E97636871k396011k409096k390747k355919k323646k308045k316169k346116k391548
$$ 597636871 595240860 592831764 590441017 588085098 585761452 583453407 581137238 578791122 576399574
3063E76399574k443809k497597k551079k604294k656707k705841k747460k777366k793656
$$ 576399574 573955765 571458168 568907089 566302795 563646088 560940247 558192787 555415421 552621765
3072E52621765k797699k792778k782211k768059k750664k729568k706375k684021k666283
$$ 552621765 549824066 547031288 544249077 541481018 538730354 536000786 533294411 530610390 527944107
3081E27944107k655258k649155k643890k634621k619400k599907k581291k567024k555275
$$ 527944107 525288849 522639694 519995804 517361183 514741783 512141876 509560585 506993561 504438286
3090E04438286k538719k505722k447815k363320k259483k148972k043609j947975j857338
$$ 504438286 501899567 499393845 496946030 494582710 492323227 490174255 488130646 486182671 484325333
3099D84325333j761132j648178j514969j365432j210442j060982r22661p92350o60744
$$ 484325333 482564201 480916023 479401054 478035622 476825180 475764198 474841537 474049187 473388443
3108D73388443n16853l53928j71165K5177K25486M20227O01540P66029R12552J043892
$$ 473388443 472871590 472517662 472346497 472371674 472597160 473017387 473618927 474384956 475297508 476341400
3118D76341400J165314J285057J412811J556854J718941J893807K067413K222328K343445
$$ 476341400 477506714 478791771 480204582 481761436 483480377 485374184 487441597 489663925 492007370
3127D92007370K424240K468529K488975K500039K511062K522774K527428K513542K473335
$$ 492007370 494431610 496900139 499389114 501889153 504400215 506922989 509450417 511963959 514437294
3136E14437294K405510K316704K217636K117538K022019J932144J846962J766357J691552
$$ 514437294 516842804 519159508 521377144 523494682 525516701 527448845 529295807 531062164 532753716
3145E32753716J623344J559563J493606J416168J318245J197358J057853R11637P70835
$$ 532753716 534377060 535936623 537430229 538846397 540164642 541362000 542419853 543331490 544102325
3154E44102325O44379N33295M32167L32107K26632J13601m120j21917k36245l47480
$$ 544102325 544746704 545279999 545712166 546044273 546270905 546384506 546380386 546258469 546022224 545674744
3164E45674744m57154n67970o78253p84111q78029r54666j010323j047592j071205
$$ 545674744 545217590 544649620 543971367 543187256 542309227 541354561 540344238 539296646 538225441
3173E38225441j087227j099357j108704j114311j115189j112747j110993j116066j132888
$$ 538225441 537138214 536038857 534930153 533815842 532700653 531587906 530476913 529360847 528227959
3182E28227959j162567j202240j245270j286392j322518j356697j395874j447830j516953
$$ 528227959 527065392 525863152 524617882 523331490 522008972 520652275 519256401 517808571 516291618
3191E16291618j601143j692771j780854j855354j912460j953278j984405k012558k041932
$$ 516291618 514690475 512997704 511216850 509361496 507449036 505495758 503511353 501498795 499456863
3200D99456863k073211k103882k131195k154694k177238k202912k235489k275047k318382
$$ 499456863 497383652 495279770 493148575 490993881 488816643 486613731 484378242 482103195 479784813
3209D79784813k360039k394790k421990k443542k463608k485352k507286k524414k529411
$$ 479784813 477424774 475029984 472607994 470164452 467700844 465215492 462708206 460183792 457654381
3218D57654381k517662k488480k447319k401695k356758k313042k264633k203102k122269
$$ 457654381 455136719 452648239 450200920 447799225 445442467 443129425 440864792 438661690 436539421
3227D36539421k022056j908722j792794j682472j580276j482239j380577j267586j140175
$$ 436539421 434517365 432608643 430815849 429133377 427553101 426070862 424690285 423422699 422282524
3236D22282524r99756q51288o97975n39856l72772j92223N227K18277M42581O72912
$$ 422282524 421282768 420431480 419733505 419193649 418820877 418628654 418633881 418852158 419294739 419967651
3246D19967651R04961J138802J375923J619034J867790K119941K370797K616310K854118
$$ 419967651 420872612 422011414 423387337 425006371 426874161 428994102 431364899 433981209 436835327
3255D36835327L084259L307038L522644L728332L919792M092942M245071M376526M489364
$$ 436835327 439919586 443226624 446749268 450477600 454397392 458490334 462735405 467111931 471601295
3264D71601295M584275M658584M706612M719543M692193M624710M525375M408874M290619
$$ 471601295 476185570 480844154 485550766 490270309 494962502 499587212 504112587 508521461 512812080
3273E12812080M181672M084892L995285L903999L802872L689690L567886L444748L327141
$$ 512812080 516993752 521078644 525073929 528977928 532780800 536470490 540038376 543483124 546810265
3282E46810265L217468L113899L012123K908440K802543K697411K597237K504730K419281
$$ 546810265 550027733 553141632 556153755 559062195 561864738 564562149 567159386 569664116 572083397
3291E72083397K336845K252884K164231K070961J975746J883049J794624J710548J627274
$$ 572083397 574420242 576673126 578837357 580908318 582884064 584767113 586561737 588272285 589899559
3300E89899559J539841J445045J341629J231995J120567J012535R11484Q18939P34215
$$ 589899559 591439400 592884445 594226074 595458069 596578636 597591171 598502655 599321594 600055809
3309F00055809O55861N82237N13802M51507L97454L52630L16849K88353K64931K45208
$$ 600055809 600711670 601293907 601807709 602259216 602656670 603009300 603326149 603614502 603879433 604124641
3319F04124641K28157K13471K00958J89629J77459J63270J46026J25389J03379Q0642
$$ 604124641 604352798 604566269 604767227 604956856 605134315 605297585 605443611 605569000 605672379 605753021
3329F05753021N8289L6850J6823l82j2398j7547j4878o103M692J2436J3504O828n111
$$ 605753021 605811310 605848160 605864983 605864601 605852203 605834656 605819778 605813675 605818367 605830803 605844307 605851135 605846024
3342F05846024j8158k8878l7040m5967o2676r3002j39389k00157k67792l34015l92456
$$ 605846024 605827866 605798988 605761948 605715981 605653305 605560303 605420914 605220757 604952965 604618950 604226494
3353F04226494m41246m83132n21354n56984n85137n96428n79872n29251m46625l42369
$$ 604226494 603785248 603302116 602780762 602223778 601638641 601042213 600462341 599933090 599486465 599144096
3363E99144096k32620j30882m5929K1629P5455J19476J54305J76620J81961J68763
$$ 599144096 598911476 598780594 598734665 598756294 598831749 598951225 599105530 599282150 599464111 599632874
3373E99632874J40762J05018O9886L8795J1521j6785n0201q8692j27335j58767j76354
$$ 599632874 599773636 599878654 599948540 599987335 599998856 599982071 599931870 599843178 599715843 599557076 599380722
3384E99380722j79939j74256j67808j69258j81427k01378k21558k32963k29187k09503
$$ 599380722 599200783 599026527 598858719 598689461 598508034 598306656 598085098 597852135 597622948 597413445
3394E97413445j77079j38740r9983o3172k7656R155M8942Q8807J22489J41144J40038
$$ 597413445 597236366 597097626 596997643 596934471 596906815 596915970 596964912 597053719 597176208 597317352 597457390
3405E97457390J20048R0065O4202N3978O4277Q9226J14250J23253J05782O2256L395
$$ 597457390 597577438 597667503 597731705 597785683 597849960 597939186 598053436 598176689 598282471 598344727 598348122
3416E98348122n3215r2736j06163r5024o7215l2768l43K6245M7149O3515P6790Q6861
$$ 598348122 598294907 598202171 598096008 598000984 597933769 597901001 597900658 597926903 597974052 598037567 598114357 598201218
3428E98201218R3231R7275J01852J12190J34011J70326K19917K76299L28369L64342
$$ 598201218 598294449 598391724 598493576 598605766 598739777 598910103 599130020 599406319 599734688 600099030
3438F00099030L75137L58353L20663K74734K37237K21900K35520K76451L35045L98140
$$ 600099030 600474167 600832520 601153183 601427917 601665154 601887054 602122574 602399025 602734070 603132210
3448F03132210M53758M93927N16624N23606N19752N10063M98467M87289M77372M68406
$$ 603132210 603585968 604079895 604596519 605120125 605639877 606149940 606648407 607135696 607613068 608081474
3458F08081474M59786M51507M44870M42849M48570M63981M86603N10445N27000N29824
$$ 608081474 608541260 608992767 609437637 609880486 610329056 610793037 611279640 611790085 612317085 612846909
3468F12846909N18722N01213M90189M96521N23109N62134N96542O09932N93872N52597
$$ 612846909 613365631 613866844 614357033 614853554 615376663 615938797 616535339 617145271 617739143 618291740
3478F18291740N03502M65737M52728M66804M97437N30014N52750N60875N58052N52063
$$ 618291740 618795242 619260979 619713707 620180511 620677948 621207962 621760712 622321587 622879639 623431702
3488F23431702N49431N55725N72280N99671O35528O73523P01714P05872O76002O13251
$$ 623431702 623981133 624536858 625109138 625708809 626344337 627017860 627719574 628425446 629101448 629714699
3498F29714699N33218M60930M20265M21372M54559M96635N23453TN04303M87137M93393
$$ 629714699 630247917 630708847 631129112 631550484 632005043 632501678 633025131 633548584 634052887 634540024 635033417
3509F35033417N32341N95703O64787P19986P53517P68357P74040P77588P76443P61337
$$ 635033417 635565758 636161461 636826248 637546234 638299751 639068108 639842148 640619736 641396179 642157516
3519F42157516P21665O53763N64575M70886L94440L55301L66821M29764N29556O37589
$$ 642157516 642879181 643532944 644097519 644568405 644962845 645318146 645684967 646114731 646644287 647281876
3529F47281876P20749P53021P32040O83518O52237O78863P74536R08203J017151J037979
$$ 647281876 648002625 648755646 649487686 650171204 650823441 651502304 652276840 653185043 654202194 655240173
3539F55240173R41849P52030N36499L71093L03803L33023M15344M97208N43976N58166
$$ 655240173 656182022 656934052 657470551 657841644 658145447 658478470 658893814 659391022 659934998 660493164
3549F60493164N65109N93033O52695P37610Q37707R53369J095734J265564J431808
$$ 660493164 661058273 661651306 662304001 663041611 663879318 664832687 665928421 667193985 668625793
3558F68625793J522751J451493J160278O66809P9498m33273p06482o46591k73895K88848
$$ 668625793 670148544 671600037 672760315 673427124 673506622 673073349 672366867 671720276 671446381 671735229
3568F71735229Q62046J281204J454239J385879J167603R36508Q22220R00421J162796
$$ 671735229 672597275 673878479 675332718 676718597 677886200 678822708 679644928 680545349 681708145
3577F81708145J515961J812057J903687J704025J229859O04324J7013l49884l91388
$$ 681708145 683224106 685036163 686939850 688643875 689873734 690478058 690495071 690145187 689753799
3586F89753799j20925L41720Q21762J162644J279983J183167R54666P08771N47485
$$ 689753799 689632874 689974594 690796356 691959000 693238983 694422150 695376816 696085587 696633072
3595F96633072N29480O64825R17969J225739J509399J692505J714325J546631J209488
$$ 696633072 697162552 697827377 698745346 699971085 701480484 703172989 704887314 706433945 707643433
3604G07643433P74994L58734R1629P5226L33633P84988J250763J512223J403656R02099
$$ 707643433 708418427 708777161 708868790 708944016 709277649 710062637 711313400 712825623 714229279 715131378
3614G15131378J71280m78134p12662l33328O04095J774064K695999K933197K291259
$$ 715131378 715302658 714824524 714111862 713778534 714382629 716156693 718852692 721785889 724077148
3623G24077148R18198p46155k144775k828674k624131j677093l66364Q63800J675034
$$ 724077148 724995346 724249191 722104416 719275742 716651611 714974518 714608154 715471954 717146988
3632G17146988J936493J740036J331634J002961R78012J332321J956787K589798K902603
$$ 717146988 719083481 720823517 722155151 723158112 724136124 725468445 727425232 730015030 732917633
3641G32917633K627258J678009K15302j383133k651978l217086k946549k004394p79114
$$ 732917633 735544891 737222900 737438202 736055069 733403091 730186005 727239456 725235062 724455948
3650G24455948K83661Q63342Q81653N07583N3940j71203L051N56107J304245J989899
$$ 724455948 724739609 725602951 726484604 726992187 727046127 726874924 726877975 727434082 728738327 730728226
3660G30728226K389145K389450K016525J407242P42416J72196k41776n37262q17871
$$ 730728226 733117371 735506821 737523346 738930588 739673004 739845200 739603424 739066162 738248291
3669G38248291j184921j666565k182160k559738k601547k170563j258087j297J350250
$$ 738248291 737063370 735396805 733214645 730654907 728053360 725882797 724624710 724623413 725973663
3678G25973663K505493L209839L304673K759475J676789K72979j159515k310867k926789
$$ 725973663 728479156 731688995 734993668 737753143 739429932 739702911 738543396 736232529 733305740
3687G33305740k876739k196808j084747J57699J214752J846543J951294J578903R00497
$$ 733305740 730429001 728232193 727147446 727305145 728519897 730366440 732317734 733896637 734797134
3696G34797134J56174m12674o22482l99628J89133R38949J556015J752320J357651
$$ 734797134 734953308 734540634 733918152 733518524 733707657 734646606 736202621 737954941 739312592
3705G39312592M07943q38775j982499k623291k524032j705780m40750Q56018J792679
$$ 739312592 739720535 738881760 736899261 734275970 731751938 730046158 729605408 730461426 732254105
3714G32254105K142257J903000J263199M95148j60752n64346o85120n55496k24228
$$ 732254105 734396362 736299362 737562561 738057709 737896957 737332611 736647491 736091995 735867767
3723G35867767K59705Q26416J344452J618957J446762P25174m42810j719131k621231
$$ 735867767 736127472 736953888 738298340 739917297 741364059 742089233 741646423 739927292 737306061
3732G37306061k719727j852035k43225J547165K850265L185425K479477J091385l75061
$$ 737306061 734586334 732734299 732491074 734038239 736888504 740073929 742553406 743644791 743269730
3741G43269730j376038j688766j480561j169204j143876j526641k100754k451935k224960
$$ 743269730 741893692 740204926 738724365 737555161 736411285 734884644 732783890 730331955 728106995
3750G28106995j348954r3765J069565J716843J688156J148681M75998M3869L0899L52249
$$ 728106995 726758041 726664276 727733841 729450684 731138840 732287521 732763519 732807388 732838287 733190536
3760G33190536P38144Q96759O69709J00174o03180j173325j401214j210862o74514
$$ 733190536 733928680 734825439 735495148 735595322 734992142 733818817 732417603 731206741 730532227
3769G30532227K8228O73600J068878J109695Q09860K93122k54822o58188q17184p37763
$$ 730532227 730560455 731234055 732302933 733412628 734222488 734515610 734260788 733602600 732785416 732047653
3779G32047653n12848k62375p1334M3182J20773K16065L57132N33065P11442Q66241
$$ 732047653 731534805 731272430 731201096 731244278 731365051 731581116 731938248 732471313 733182755 734048996
3789G34048996R89838J079712J110839J027375P65457L01056l08152r29107j405945
$$ 734048996 735038834 736118546 737229385 738256760 739022217 739323273 739015121 738086014 736680069
3798G36680069j637039j624298j459198j253128j053925q11539m16031K04239R97086
$$ 736680069 735043030 733418732 731959534 730706406 729652481 728840942 728424911 728629150 729626236
3807G29626236J769257K260971K273101J773835R18045l1967q34046j368103j650085
$$ 729626236 731395493 733656464 735929565 737703400 738621445 738589478 737755432 736387329 734737244
3816G34737244j765976j775360j655655j331024p52945K1057Q17871J424026J697693
$$ 734737244 732971268 731195908 729540253 728209229 727456284 727477341 728295212 729719238 731416931
3825G31416931J644669J405792J158752R96933Q69370O19736J07269o74210j555938
$$ 731416931 733061600 734467392 735626144 736623077 737492447 738112183 738219452 737545242 735989304
3834G35989304k265473k566147k378692j805954j047974k67181N04913J343002K304840
$$ 735989304 733723831 731157684 728778992 726973038 725925064 725657883 726162796 727505798 729810638
3843G29810638L282547L948441L857117K674255M17633k434540n053482o564407o411972
$$ 729810638 733093185 737041626 740898743 743572998 743990631 741556091 736502609 729938202 723526230
3852G23526230m613342j768952J178665L327484M163132L714752K462693J065979M8523
$$ 723526230 718912888 717143936 718322601 721650085 725813217 729527969 731990662 733056641 733105164
3861G33105164l97339m17328l35465m32739p87659j253051j564942j505127j023025
$$ 733105164 732707825 732290497 731955032 731522293 730734634 729481583 727916641 726411514 725388489
3870G25388489k57492N42068J136627J393967J316605R99832N67627J19858k79160
$$ 725388489 725130997 725673065 726809692 728203659 729520264 730520096 731087723 731207581 730928421
3879G30928421n86090p64923p93076o82220m92630l16925k32620k52152l02048k54593
$$ 730928421 730342331 729577408 728784332 728102112 727609482 727292557 727059937 726807785 726505737 726251144
3889G26251144j602M69818J045838J518326J672439J380921O63223l19901j324768
$$ 726251144 726249542 726719360 727765198 729283524 730955963 732336884 733000107 732680206 731355438
3898G31355438k109527k507019k458725k013932j298523m73785L03192R11636J282578
$$ 731355438 729245911 726738892 724280167 722266235 720967712 720493927 720797119 721708755 722991333
3907G22991333J402664J299286J025238O40411K07520k08588n39932p27234p41806
$$ 722991333 724393997 725693283 726718521 727358932 727566452 727357864 726817932 726090698 725348892
3916G25348892o03027l79334j60598j5564L8986M0512M3564P4081J03684O7749q2779
$$ 725348892 724745865 724366531 724205933 724190369 724229355 724269867 724313431 724387512 724491196 724558945 724476166
3927G24476166l30353n82047p10678o30111l50190K1973L35770M79431M29382K51007
$$ 724476166 724145813 723563766 722853088 722222977 721872787 721894760 722230530 722709961 723139343 723390350
3937G23390350M4251j13297j99966k38571k60010k77252k84500k76184k63062k64969
$$ 723390350 723434601 723321304 723121338 722882767 722622757 722345505 722061005 721784821 721521759 721256790
3947G21256790k87857l08533k84500j91574n3787O0577Q0109j2970j64566k79694k90222
$$ 721256790 720968933 720660400 720375900 720184326 720130539 720191116 720271225 720258255 720093689 719813995 719523773
3958G19523773k06833j10779q9340j63040k63977k90451j95389l9825M2572n1193k97165
$$ 719523773 719316940 719206161 719116821 718953781 718689804 718399353 718203964 718164139 718206711 718155518 717858353
3969G17858353n43442o14319m52957j84174l5782j63726n10941q25119q45871n28717
$$ 717858353 717314911 716700592 716247635 716063461 716027679 715863953 715353012 714527893 713682022 713153305
3979G13153305j24741k2811m39988j196136j782150j724015j010131k30561k38952
$$ 713153305 713028564 713005753 712565765 711369629 709587479 707863464 706853333 706622772 706383820
3988G06383820j489335l509979m991913m640808k384872j65253j608429j0447464k8351440
$$ 706383820 704894485 701384506 696392593 691751785 689366913 689201660 687593231 677145767 648794327
3997F48794327n3310127p9619751r9738999
$$ 648794327 595484200 515864449 416125450
4000D16125450
$$ 416125450
##END=$$ End of the data block
