##TITLE=$$ Begin of the data block
##JCAMP-DX=5.00 $$ ACD/SpecManager v 10.08
##SPECTROMETER/DATA SYSTEM=Alpha
##DATE=10 Nov 2014 10:35:34
##DATA TYPE=INFRARED SPECTRUM
##DATA CLASS=XYDATA
##ORIGIN=
##OWNER=
##NPOINTS=1667
##FIRSTX=599.64648438
##LASTX=3997.64306641
##MAXX=3997.64306641
##MINX=599.64648438
##MAXY=1.10772598
##MINY=0.25652751
##XFACTOR=1.0000000000
##YFACTOR=0.000000010000000
##FIRSTY=1.01729250
##DELTAX=2.03961372
##XUNITS=1/CM
##YUNITS=ARBITRARY UNITS
##XYDATA=(X++(Y..Y))
$$ plain form
599.6 101729250 101758111 101785338 101814699 101881075 101958561 101986575 101984286 101978755 101949120 101914227 101901007 101908481
624.1 101908481 101901102 101828921 101711845 101561368 101278043 100775015 100255287 100191104 100696695 101315236
644.5 101315236 101698792 101898730 102037942 102142930 102222824 102291691 102325237 102323091 102321410 102315962 102315402 102353430
669 102353430 102364588 102329862 102287233 102223337 102129459 102092862 102170777 102288413 102353752 102373242 102385330 102389729
693.5 102389729 102373326 102338421 102303517 102284002 102287233 102308166 102314651 102272344 102221811 102241457 102342594 102467573
717.9 102467573 102564859 102640676 102710640 102762222 102790177 102814305 102846515 102871668 102877760 102874327 102862620 102824771
742.4 102824771 102738750 102587736 102336359 101880157 101051390 99833286 98665190 98138404 98487175 99541092
762.8 99541092 100762129 101602662 101980114 102082050 102028847 101863730 101563680 101015580 99941623 97777277
$$ packed form
599.6A01729250K8861K7227K9361O6376P7486K8014k289n531k9635l4893j3220P474
624.1A01908481p379p2181j17076j50477k83325n03028n19728o4183N05591O18541
644.5A01315236L83556J99938J39212J04988P9894O8867L3546k146j681n448n60L8028
669A02353430J1158l4726m2629o3896r3878l6597P7915J17636O5339J9490J2088M399
693.5A02389729j6403l4905l4904j9515L231K0933O485m2307n0533J9646J01137J24979
717.9A02467573R7286P5817O9964N1582K7955K4128L2210K5153O092l433j1707l7849
742.4A02824771q6021j51014k51377m56202q28767j218104j168096n26786L48771J053917
762.8I9541092J221037Q40533L77452J01936n3203j65117l00050n48100j073957k164346
$$ plain form
783.2 97777277 94063652 90033621 87964672 86867756 83186263 77298349 73804051 75162554 79701996
801.6 79701996 85021245 89921099 93929964 96832854 98685265 99788314 100456727 100898182 101226294
819.9 101226294 101494718 101713538 101886857 102014637 102098477 102152658 102197015 102252793 102314031 102354741 102365363
842.4 102365363 102354312 102337062 102304113 102224398 102100313 101936281 101709259 101399672 101004243 100515425
862.8 100515425 99912828 99127364 98013419 96383882 93942553 90194738 84457827 75893497 64092773
881.1 64092773 50648820 39609069 34886420 37463874 45595920 56494665 67501444 76788348
897.4 76788348 83616042 88130760 90888393 92295533 92132717 89484596 84421420 80629390 82172751
915.8 82172751 87502360 92511135 95961636 98306513 99822152 100754905 101368368 101799965 102083826
$$ packed form
783.2I7777277l713625m030031k068949j096916l681493n887914l494298J358503M539442
801.6G9701996N319249M899854M008865K902890J852411J103049O68413M41455L28112
819.9A01226294K68424K18820J73319J27780Q3840N4181M4357N5778O1238M0710J0622
842.4A02365363j1051j7250l2949p9715j24085j64032k27022l09587l95429m88818
862.8A00515425o02597p85464j113945j629537k441329l747815n736911q564330j1800724
881.1F4092773j3443953j1039751m722649K577454Q132046J0898745J1006779R286904
897.4G6788348O827694M514718K757633J407140j62816k648121n063176l792030J543361
915.8H2172751N329609N008775L450501K344877J515639R32753O13463M31597K83861
$$ plain form
934.1 102083826 102223694 102258408 102290332 102364278 102381992 102229333 101872981 101179874 99862576 98067743
954.5 98067743 97006691 97741485 99533516 100984335 101732433 102076972 102230299 102238345 102085555 101776552
974.9 101776552 101302981 100621688 99761307 98884821 98183209 97790825 97766089 98038644 98417765 98753071
995.3 98753071 99045414 99286002 99336541 99016374 98152417 96670693 94863480 93223977 91987598
1013.7 91987598 91327280 91400433 91909111 92462820 93241572 94494021 95825285 96716517 97133446 97241217
1034.1 97241217 97099942 96817309 96599895 96413487 95854241 94513869 92510247 90841037 90756774
1052.4 90756774 92376810 94571435 96326005 97478771 98254126 98788172 99114144 99252087 99210548
1070.8 99210548 98966396 98569489 98223150 98128641 98334563 98786855 99362469 99894798 100294757 100558901
$$ packed form
934.1A02083826J39868L4714L1924P3946J7714j52659l56352o93107j317298j794833
954.5I8067743j061052P34794J792031J450819P48098L44539J53327Q046j52790l09003
974.9A01776552m73571o81293q60381q76486p01612l92384k4736K72555L79121L35306
995.3I8753071K92343K40588N0539l20167q63957j481724j807213j639503j236379
1013.7I1987598o60318P3153N08678N53709P78752J252449J331264Q91232M16929J07771
1034.1I7241217j41275k82633k17414j86408n59246j340372k003622j669210q4263
1052.4I0756774J620036K194625J754570J152766P75355N34046L25972J37943m1539
1070.8I9210548k44152l96907l46339r4509K05922M52292N75614N32329L99959K64144
$$ plain form
1091.2 100558901 100683928 100654304 100470901 100136733 99658090 99100584 98611736 98362464 98353016 98361707
1111.6 98361707 98304290 98464763 99086905 99961430 100715446 101226914 101554799 101748836 101821601 101764262
1132 101764262 101568818 101240706 100699031 99619842 97419190 93805879 90178412 88963461 89821100
1150.3 89821100 89883310 88963544 89845926 93345541 97285342 99860704 101132667 101795793 102218676
1168.7 102218676 102483416 102620173 102675521 102691936 102689636 102676368 102698779 102794755 102882385 102830684 102551091
1191.1 102551091 101921153 100847089 99727672 99380928 99888831 100436890 100619006 100800347 101280010
1209.5 101280010 101851141 102178085 102195513 102010119 101683462 101156664 100330400 99377275 98782694 98710924
1229.9 98710924 98793614 98729807 98513854 98233169 97976714 97870833 98123109 98766434 99430817 99713010
$$ packed form
1091.2A00558901J25027k9624j83403l34168m78643n57506m88848k49272r448Q691
1111.6I8361707n7417J60473O22142Q74525P54016N11468L27885J94037P2765n7339
1132A01764262j95444l28112n41675j079189k200652l613311l627467j214951Q57639
1150.3H9821100O2210r19766Q82382L499615L939801K575362J271963O63126M22883
1168.7A02218676K64740J36757N5348J6415k300j3268K2411R5976Q7630n1701k79593
1191.1A02551091o29938j074064j119417l46744N07903N48059J82116J81341M79663
1209.5A01280010N71131L26944J7428j85394l26657n26798q26264r53125n94581p1770
1229.9I8710924Q2690o3807k15953k80685k56455j05881K52276O43325O64383K82193
$$ plain form
1250.3 99713010 99621749 99478602 99528700 99810654 100267029 100732827 101022232 101104009 101064634 100955069
1270.7 100955069 100757766 100533140 100470996 100629318 100723922 100439239 99843735 99408960 99548483 100127506
1291.1 100127506 100700760 101047051 101168871 101053154 100684035 100170803 99699426 99269605 98906797 99006385
1311.5 99006385 99758661 100682998 101251221 101350105 101044536 100412858 99677259 99165213 98964399 99014491
1331.9 99014491 99343920 99878353 100396645 100737762 100861502 100812352 100635076 100305152 99825984 99333775
1352.3 99333775 98970455 98645276 98144507 97279912 95786458 93530089 90486956 86556220 82178384
1370.6 82178384 77657205 73433077 72382379 76617533 83640754 89316148 92575651 94522458
1386.9 94522458 95813507 96604204 97091478 97381705 97536695 97623599 97605902 97433990 97084266 96646774
$$ packed form
1250.3I9713010r1261j43147N0098K81954M56375M65798K89405Q1777l9375j09565
1270.7A00955069j97303k24626o2144J58322R4604k84683n95504m34775J39523N79023
1291.1A00127506N73254L46291J21820j15717l69119n13232m71377m29821l62808R9588
1311.5I9006385P52276R24337N68223R8884l05569o31678p35599n12046k00814N0092
1331.9I9014491L29429N34433N18292L41117J23740m9150j77276l29924m79168m92209
1352.3I9333775l63320l25179n00769q64595j493454k256369l043133l930736m377836
1370.6H2178384m521179m224128j050698M235154P023221N675394L259503J946807
1386.9I4522458J291049P90697M87274K90227J54990Q6904j7697j71912l49724m37492
$$ plain form
1407.3 96646774 96263701 95894825 95407420 94736046 93711686 92023361 89831144 86905909 82701719
1425.7 82701719 77106136 69938231 62495780 56837177 53679800 53463376 55040818 57152677 59214061
1444.1 59214061 60646790 60959971 60148984 59423369 60503811 65470052 73590493 79558682 83684164
1462.4 83684164 87589276 90902841 93106073 94821531 96529138 97851253 98627698 99201053 99773175
1480.8 99773175 100385189 100985336 101582170 102158797 102584028 102839422 103056645 103274727 103409719 103483224
1501.2 103483224 103565621 103675282 103625286 103332114 103036690 102843761 102868688 103157949 103630173 104198098
1521.6 104198098 104622889 104837871 104957485 105025887 105107784 105181944 105208039 105264544 105356574 105321300 105191064
1544 105191064 105078781 105018449 104979265 104915702 104846621 104825187 104806578 104590511 104362762 104217565 104096615
$$ packed form
1407.3I6646774l83073l68876m87405o71374j024360j688325k192217k925235m204190
1425.7H2701719n595583p167905p442451n658603l157377k16424J577442K111859K061384
1444.1E9214061J432729L13181q10987p25615J080442M966241Q120441N968189M125482
1462.4H3684164L905112L313565K203232J715458J707607J322115P76445N73355N72122
1480.8I9773175O12014O00147N96834N76627M25231K55394K17223K18082J34992P3505
1501.2A03483224Q2397J09661m9996k93172k95424j92929K4927K89261M72224N67925
1521.6A04198098M24791K14982J19614O8402Q1897P4160K6095N6505R2030l5274j30236
1544A05191064j12283o0332l9184o3563o9081k1434j8609k16067k27749j45197j20950
$$ plain form
1566.4 104096615 103949857 103702331 103435290 103217185 102953470 102656591 102401483 102140963 101824689 101435828
1586.8 101435828 100973487 100454712 99965537 99695957 99787980 100123346 100448406 100656939 100802791 100922024
1607.2 100922024 100951648 100849104 100705993 100597322 100421810 100114036 99755079 99319404 98783106 98088616
1627.6 98088616 97113609 95867902 93947494 89880455 83582163 76312780 68864119 63815749 64604008
1646 64604008 71782392 79155624 86056602 93305779 96728462 98237872 99449283 100405085 101009929
1664.3 101009929 101336539 101548338 101511061 101159847 100710237 100524223 100921357 101721704 102666807 103523290
1684.7 103523290 103909719 104039097 104136086 104229522 104390848 104596460 104751587 104816020 104791594 104740584
1705.1 104740584 104645741 104533780 104501307 104597497 104807246 105044782 105156648 105177391 105192208 105182767 105139065
$$ packed form
1566.4A04096615j46758k47526k67041k18105k63715k96879k55108k60520l16274l88861
1586.8A01435828m62341n18775m89175k69580R2023L35366L25060K08533J45852J19233
1607.2A00922024K9624j02544j43111j08671j75512l07774l58957m35675n36298o94490
1627.6I8088616r75007j245707j920408m067039o298292p269383p448661n048370P88259
1646F4604008P178384P373232O900978P249177L422683J509410J211411R55802O04844
1664.3A01009929L26610K11799l7277l51214m49610j86014L97134Q00347R45103Q56483
1684.7A03523290L86429J29378R6989R3436J61326K05612J55127O4433k4426n1010
1705.1A04740584r4843j11961l2473R6190K09749K37536J11866K0743J4817r441m3702
$$ plain form
1727.6 105139065 105105615 105147719 105311048 105482805 105587542 105672646 105727553 105784142 105903161 106086755
1748 106086755 106266320 106379640 106465650 106584382 106725109 106851280 106919265 106899869 106827271 106696820 106474638
1770.4 106474638 106075823 105555463 105110061 104797506 104628718 104620326 104778767 105069065 105439067 105874121
1790.8 105874121 106306267 106634653 106905627 107166672 107383788 107533252 107650256 107768023 107880163 107964253
1811.2 107964253 108021665 108079433 108141518 108192170 108240855 108300638 108352304 108397806 108444965 108462751 108474326
1833.6 108474326 108508313 108546007 108587217 108643007 108673632 108643675 108602047 108578670 108573222 108576715 108576190 108571506
1858.1 108571506 108563936 108554256 108558536 108586621 108603299 108581841 108565915 108585966 108629441 108678114 108725011 108772624
1882.6 108772624 108818913 108863521 108896708 108903539 108904731 108904946 108890557 108878863 108883643 108898401 108920050 108945215
$$ packed form
1727.6A05139065l3450M2104J63329J71757J04737Q5104N4907N6589J19019J83594
1748A06086755J79565J13320Q6010J18732J40727J26171O7985j9396p2598j30451k22182
1770.4A06474638l98815n20360m45402l12555j68788q392J58441K90298L70002M35054
1790.8A05874121M32146L28386K70974K61045K17116J49464J17004J17767J12140Q4090
1811.2A07964253N7412N7768O2085N0652M8685N9783N1666M5502M7159J7786J1575
1833.6A08474326L3987L7694M1210N5790L0625k9957m1628k3377n448L493n25m684
1858.1A08571506p570r680M280K8085J6678k1458j5926K0051M3475M8673M6897M7613
1882.6A08772624M6289M4608L3187O831J192K15j4389j1694M780J4758K1649K5165
$$ plain form
1907.1 108945215 108959699 108959138 108959377 108977950 109000468 109000611 108990991 108974516 108940113 108901525 108865225 108825910 108785808
1933.6 108785808 108751857 108734179 108737338 108736181 108704293 108667421 108660877 108686984 108732867 108785295 108838844 108892620
1958.1 108892620 108932674 108949566 108954227 108954489 108955634 108968294 108994269 109026527 109058082 109084868 109109211 109129596
1982.5 109129596 109136677 109134376 109133971 109124839 109095156 109066844 109057224 109058857 109068096 109083402 109096706 109101593 109099829
2009 109099829 109094787 109086835 109088361 109112680 109145832 109168601 109179556 109179866 109169173 109158015 109154868 109155095 109152687 109143198
2037.6 109143198 109130168 109114432 109091234 109068584 109054840 109045923 109032381 109011090 108984005 108946979 108900881 108869219
2062.1 108869219 108871019 108893585 108915198 108928537 108939326 108956671 108981192 109002793 109011805 109008598 109004140 109004664 108999586
2088.6 108999586 108986080 108979976 108988750 109008563 109036326 109060431 109065926 109058571 109051931 109042609 109025609 109008658 109001267
$$ packed form
1907.1A08945215J4484n61K39J8573K2518J43r620j6475l4403l8588l6300l9315m0102
1933.6A08785808l3951j7678L159j157l1888l6872o544K6107M5883N2428N3549N3776
1958.1A08892620M0054J6892M661K62J145J2660K5975L2258L1555K6786K4343K0385
1982.5A09129596P081k301m05r132k9683k8312r620J633R239J5306J3304M887j764
2009A09099829n042p952J526K4319L3152K2769J0955L10j0693j1158l147K27k408r489
2037.6A09143198j3030j5736k3198k2650j3744q917j3542k1291k7085l7026m6098l1662
2062.1A08869219J800K2566K1613J3339J0789J7345K4521K1601R012l207m458N24n078
2088.6A08999586j3506o104Q774J9813K7763K4105N495p355o640r322j7000j6951p391
$$ plain form
2115.1 109001267 109000123 108994234 108984411 108977973 108971167 108952439 108919132 108883500 108862793 108867288 108892596 108922112 108944523
2141.6 108944523 108959591 108966589 108966506 108963275 108954513 108938098 108918798 108894384 108863163 108833170 108813977 108808732 108807647
2168.1 108807647 108803046 108795631 108794236 108811140 108837080 108852839 108856857 108861923 108870459 108867264 108851290 108836985 108827865
2194.6 108827865 108820283 108809233 108793330 108780038 108772135 108767462 108769155 108779442 108791506 108792651 108780444 108768761
2219.1 108768761 108760393 108747935 108739531 108739865 108745027 108750653 108742821 108714795 108674753 108631420 108590055 108555114 108529592
2245.6 108529592 108514678 108511388 108514941 108522499 108538997 108566761 108605802 108650839 108690035 108722985 108759844 108796430
2270.1 108796430 108816862 108818817 108814120 108805287 108793843 108789408 108788097 108786869 108794808 108816063 108849978 108887255 108914590
2296.6 108914590 108924639 108917022 108900630 108886087 108878899 108875906 108868420 108854997 108834052 108790863 108725047 108663785
$$ packed form
2115.1A09001267j144n889r823o438o806j8728l3307l5632k0707M495K5308K9516K2411
2141.6A08944523J5068O998q3l231q762j6415j9300k4414l1221k9993j9193n245j085
2168.1A08807647m601p415j395J6904K5940J5759M018N066Q536l195j5974j4305r120
2194.6A08827865p582j1050j5903j3292p903m673J693J0287J2064J145j2207j1683
2219.1A08768761q368j2458q404L34N162N626p832k8026m0042m3333m1365l4941k5522
2245.6A08529592j4914l290L553P558J6498K7764L9041M5037L9196L2950L6859L6586
2270.1A08796430K0432J955m697q833j1444m435j311j228P939K1255L3915L7277K7335
2296.6A08914590J0049p617j6392j4543p188k993p486j3423k0945m3189o5816o1262
$$ plain form
2321.1 108663785 108617914 108584011 108566582 108554411 108544278 108542061 108521497 108485556 108468544 108460057 108429623 108384383
2345.6 108384383 108361065 108353615 108334589 108296967 108246839 108213925 108230245 108249533 108238113 108246219 108288860 108339441
2370.1 108339441 108384132 108426416 108470440 108507884 108542573 108577669 108602738 108613002 108616126 108627415 108654296 108683860
2394.5 108683860 108697796 108701932 108716369 108737314 108753645 108766115 108773732 108777523 108781552 108788025 108796930 108811438 108831096
2421 108831096 108840835 108830500 108805525 108778870 108758640 108743405 108732677 108723104 108700514 108662248 108622420 108588040
2445.5 108588040 108562100 108546054 108530939 108513832 108502710 108499777 108496666 108485663 108467197 108431947 108373213 108315635
2470 108315635 108287203 108296049 108331680 108373094 108408642 108435738 108459687 108490276 108526015 108556998 108580089 108601284
2494.5 108601284 108618224 108621657 108611643 108594036 108579206 108568323 108546722 108512247 108474338 108434570 108395588 108365917
$$ packed form
2321.1A08663785m5871l3903j7429j2171j0133k217k0564l5941j7012q487l0434m5240
2345.6A08384383k3318p450j9026l7622n0128l2914J6320J9288j1420Q106M2641N0581
2370.1A08339441M4691M2284M4024L7444L4689L5096K5069J0264L124J1289K6881K9564
2394.5A08683860J3936M136J4437K0945J6331J2470P617L791M029O473Q905J4508J9658
2421A08831096R739j0335k4975k6655k0230j5235j0728r573k2590l8266l9828l4380
2445.5A08588040k5940j6046j5115j7107j1122k933l111j1003j8466l5250n8734n7578
2470A08315635k8432Q846L5631M1414L5548K7096K3949L0589L5739L0983K3091K1195
2494.5A08601284J6940L433j0014j7607j4830j0883k1601l4475l7909l9768l8982k9671
$$ plain form
2518.9 108365917 108350337 108342683 108331454 108318281 108321977 108355963 108406055 108442187 108454812 108453262 108439136 108416986
2543.4 108416986 108390820 108353901 108305717 108255172 108208120 108157253 108098519 108036220 107975280 107933533 107924390 107945609
2567.9 107945609 107993495 108053803 108108103 108149672 108169961 108159995 108122420 108069122 108012581 107958806 107913291 107879102
2592.4 107879102 107854438 107835221 107809567 107762718 107691836 107610464 107534051 107470715 107418990 107378531 107371175 107420492
2616.8 107420492 107524085 107649612 107756984 107834280 107884073 107901394 107888508 107855451 107806289 107741439 107674885
2639.3 107674885 107627428 107597685 107578397 107568359 107547450 107496786 107414973 107294738 107132244 106938291 106724250
2661.7 106724250 106503463 106310642 106211305 106246710 106382251 106543171 106669390 106745660 106796038 106846571
2682.1 106846571 106894147 106913161 106890178 106838250 106768334 106676495 106578779 106507349 106468391 106438243 106389701
$$ packed form
2518.9A08365917j5580p654j1229j3173L696L3986N0092L6132J2625j550j4126k2150
2543.4A08416986k6166l6919m8184n0545m7052n0867n8734o2299o0940m1747r143K1219
2567.9A07945609M7886O0308N4300M1569K0289r966l7575n3298n6541n3775m5515l4189
2592.4A07879102k4664j9217k5654m6849p0882q1372p6413o3336n1725m0459p356M9317
2616.8A07420492J03593J25527J07372P7296M9793J7321j2886l3057m9162o4850o6554
2639.3A07674885m7457k9743j9288j0038k0909n0664q1813j20235j62494j93953k14041
2661.7A06724250k20787j92821r9337L5405J35541J60920J26219P6270N0378N0533
2682.1A06846571M7576J9014k2983n1928o9916r1839r7716p1430l8958l0148m8542
$$ plain form
2704.5 106389701 106301177 106157577 105950344 105654478 105230570 104645491 103853619 102857828 101861632 101238310
2724.9 101238310 101260900 101855135 102669561 103398502 103937674 104302359 104532492 104673457 104803097 104974365
2745.3 104974365 105171466 105373371 105552411 105651629 105646288 105566978 105457461 105355513 105274296 105200183 105134332
2767.8 105134332 105088747 105046213 104982090 104904878 104816437 104688346 104508841 104284024 104009235 103686833
2788.2 103686833 103334975 102946866 102473938 101875973 101166666 100370717 99485767 98535192 97577566 96653843
2808.6 96653843 95753235 94769692 93529588 91886371 89705062 86788714 82864070 77686965 71321988
2826.9 71321988 64475787 58505636 54744607 53567499 54254228 55806923 57658529 59491616 60768807
2845.3 60768807 60842443 59418553 56879866 54249519 52661526 52707940 54152721 56096154 57490546
$$ packed form
2704.5A06389701q8524j43600k07233k95866m23908n85079p91872r95791r96196o23322
2724.9A01238310K2590N94235Q14426P28941N39172L64685K30133J40965J29640J71268
2745.3A04974365J97101K01905J79040R9218n341p9310j09517j01948q1217p4113o5851
2767.8A05134332m5585m2534o4123p7212q8441j28091j79505k24817k74789l22402
2788.2A03686833l51858l88109m72928n97965p09307p95949q84950r50575r57626r23723
2808.6I6653843r00608r83543j240104j643217k181309k916348l924644n177105o364977
2826.9G1321988o846201n970151l761029j177108O86729J552695J851606J833087J277191
2845.3F0768807P3636j423890k538687k630347j587993M6414J444781J943433J394392
$$ plain form
2863.6 57490546 57694280 56657141 54720992 52410024 50290900 48711061 47618032 46670738 45507985
2882 45507985 44004148 42370313 40994179 40131536 39740661 39543813 39229760 38671485 37961298 37192091
2902.4 37192091 36243066 34888023 33074877 31025985 29089636 27524278 26425380 25803536 25652751
2920.7 25652751 25955290 26673710 27826989 29447514 31422207 33619291 36024737 38706055 41800329
2939.1 41800329 45427239 49490592 53624856 57334906 60124785 61585540 61431628 59535837 56036180
2957.4 56036180 51414770 46580097 42844942 41493112 43154794 47496164 53421706 59545666
2973.8 59545666 64838719 69135761 72782069 75798076 77852982 79022032 80054110 81636304
2990.1 81636304 83634740 85393858 86467206 86759520 86306965 85205162 83724916 82306188 81314385
$$ packed form
2863.6E7490546K03734j037139j936149k310968k119124j579839j093029r47294j162753
2882D5507985j503837j633835j376134q62643l90875j96848l14053n58275p10187p69207
2902.4C7192091r49025j355043j813146k048892j936349j565358j098898o21844j50785
2920.7B5652751L02539P18420J153279J620525J974693K197084K405446K681318L094274
2939.1D1800329L626910M063353M134264L710050K789879J460755j53912j895791l499657
2957.4E6036180m621410m834673l735155j351830J661682M341370N925542O123960
2973.8E9545666N293053M297042L646308L016007K054906J169050J032078J582194
2990.1H1636304J998436J759118J073348K92314m52555j101803j480246j418728r91803
$$ plain form
3008.4 81314385 80899739 81154114 82207060 84062368 86484408 89081293 91454750 93365985 94792604
3026.8 94792604 95783889 96385479 96672571 96721172 96550846 96128017 95472330 94732183 94161797 93981034
3047.2 93981034 94179285 94550270 94914079 95188206 95313191 95190567 94667321 93588424 91911042
3065.5 91911042 89844471 87873971 86565751 86178422 86372399 86441833 85913843 85019183 84635884
3083.9 84635884 85581934 87883985 90807182 93541825 95696372 97259015 98378241 99200159 99813348
3102.2 99813348 100267398 100596440 100843990 101062214 101252127 101382232 101469696 101561666 101683223 101818287
3122.6 101818287 101927650 102000165 102053857 102111566 102181125 102239990 102256310 102242267 102260005 102329397 102405131
3145.1 102405131 102451229 102455103 102429163 102430820 102486229 102545810 102576756 102590561 102598882 102605319 102613616 102624428
$$ packed form
3008.4H1314385m14646K54375J052946J855308K422040K596885K373457J911235J426619
3026.8I4792604R91285O01590K87092M8601j70326m22829o55687p40147n70386j80763
3047.2I3981034J98251L70985L63809K74127J24985j22624n23246j078897j677382
3065.5I1911042k066571j970500j308220l87329J93977O9434n27990q94660l83299
3083.9H4635884R46050K302051K923197K734643K154547J562643J119226Q21918O13189
3102.2I9813348M54050L29042K47550K18224J89913J30105Q7464R1970J21557J35064
3122.6A01818287J09363P2515N3692N7709O9559N8865J6320j4043J7738O9392P5734
3145.1A02405131M6098L874k5940J657N5409N9581L0946J3805Q321O437Q297J0812
$$ plain form
3169.6 102624428 102630627 102634966 102648079 102668846 102683282 102682483 102674258 102668357 102666020 102668631 102672493 102670491 102666414 102664185
3198.1 102664185 102663517 102661777 102654660 102639484 102618217 102597976 102582490 102570915 102557445 102539992 102531946 102530289 102513957
3224.6 102513957 102491617 102470672 102423704 102365184 102358246 102399504 102421141 102405477 102378559 102341473 102309990 102316463
3249.1 102316463 102337134 102329278 102306426 102311981 102340662 102350903 102341652 102337313 102312481 102242017 102204525 102250147
3273.6 102250147 102330768 102421486 102509022 102584314 102649653 102693200 102680552 102558672 102389920 102301705 102297580
3296 102297580 102320933 102310264 102211773 102064931 101971698 101980484 102056050 102139068 102193511 102223635 102244008 102253675
3320.5 102253675 102250266 102234900 102233481 102263284 102289665 102282786 102236271 102159595 102109659 102122223 102163303 102209210
3345 102209210 102247405 102244627 102235115 102277541 102335835 102359819 102347815 102328706 102319407 102285564 102227879 102209032
$$ packed form
3169.6A02624428O199M339J3113K0767J4436p99q225n901k337K611L862k002m077k229
3198.1A02664185o68j740p117j5176k1267k0241j5486j1575j3470j7453q046j657j6332
3224.6A02513957k2340k0945m6968n8520o938M1258K1637j5664k6918l7086l1483O473
3249.1A02316463K0671p856k2852N555K8681J0241r251m339k4832p0464l7492M5622
3273.6A02250147Q0621R0718Q7536P5292O5339M3547j2648j21880j68752q8215m125
3296A02297580K3353j0669r8491j46842r3233Q786P5566Q3018N4443L0124K0373R667
3320.5A02253675l409j5366j419K9803K6381o879m6515p6676m9936J2564M1080M5907
3345A02209210L8195k778r512M2426N8294K3984j2004j9109r299l3843n7685j8847
$$ plain form
3369.4 102209032 102256656 102320755 102344441 102331173 102309835 102310455 102341831 102365673 102347839 102291381 102246785 102262878
3393.9 102262878 102297080 102281809 102237105 102240992 102301812 102352881 102369976 102372789 102376020 102397573 102446294 102500689
3418.4 102500689 102530038 102530110 102526724 102530706 102531123 102531195 102529609 102524185 102550161 102626157 102706516 102751255 102772427 102794278
3446.9 102794278 102812004 102811491 102809548 102831268 102871001 102904582 102930355 102946961 102935255 102910566 102922595 102983654
3471.4 102983654 103044677 103073311 103078187 103079712 103110754 103157210 103175855 103184402 103222942 103283477 103331566 103354025
3495.9 103354025 103375375 103417933 103469741 103520143 103562784 103599441 103632104 103650177 103676081 103732228 103788054
3518.3 103788054 103808606 103816390 103863609 103943610 103997505 104013872 104025590 104042959 104075015 104117692 104143715 104170775
3542.8 104170775 104234231 104321396 104399443 104467440 104537737 104604661 104663205 104710388 104761934 104854214 104990554
$$ packed form
3369.4A02209032M7624O4099K3686j3268k1338O20L1376K3842j7834n6458m4596J6093
3393.9A02262878L4202j5271m4704L887O0820N1069J7095K813L231K1553M8721N4395
3418.4A02500689K9349P2l386L982M17P2j586n424K5976P5996Q0359M4739K1172K1851
3446.9A02794278J7726n13j943K1720L9733L3581K5773J6606j1706k4689J2029O1059
3471.4A02983654O1023K8634M876J525L1042M6456J8645Q547L8540O0535M8089K2459
3495.9A03354025K1350M2558N1808N0402M2641L6657L2663J8073K5904N6147N5826
3518.3A03788054K0552P784M7219Q0001N3895J6367J1718J7369L2056M2677K6023K7060
3542.8A04170775O3456Q7165P8047O7997P0297O6924N8544M7183N1546R2280J36340
$$ plain form
3565.2 104990554 105105507 105134666 105145717 105204952 105290318 105369139 105429983 105472064 105520487 105614436 105738175
3587.7 105738175 105795789 105803514 105858421 105949163 106021202 106099129 106196070 106288099 106398904 106536329 106651187
3610.1 106651187 106743109 106817472 106881595 106964386 107016563 107033849 107094085 107223713 107402730 107510006 107527399
3632.5 107527399 107557201 107614756 107681847 107752883 107841146 107974410 108164537 108334410 108372152 108380163 108438241
3655 108438241 108477080 108471763 108513939 108626914 108759379 108908093 109081352 109210980 109298527 109393215 109415996
3677.4 109415996 109373927 109355533 109385061 109461164 109574664 109691203 109749007 109747672 109774852 109867346 109955335
3699.8 109955335 109985292 109979355 110003459 110107303 110234165 110249650 110188484 110167694 110189998 110220921 110252035
3722.3 110252035 110282826 110300505 110329890 110405886 110497499 110521364 110447156 110379338 110413969 110514903 110576797
$$ packed form
3565.2A04990554J14953K9159J1051N9235Q5366P8821O0844M2081M8423R3949J23739
3587.7A05738175N7614P725N4907R0742P2039P7927R6941R2029J10805J37425J14858
3610.1A06651187R1922P4363O4123Q2791N2177J7286O0236J29628J79017J07276J7393
3632.5A07527399K9802N7555O7091P1036Q8263J33264J90127J69873L7742Q011N8078
3655A08438241L8839n317M2176J12975J32465J48714J73259J29628Q7547R4688K2781
3677.4A09415996m2069j8394K9528P6103J13500J16539N7804j335K7180R2494Q7989
3699.8A09955335K9957n937K4104J03844J26862J5485o1166k0790K2304L0923L1114
3722.3A10252035L0791J7679K9385P5996R1613K3865p4208o7818L4631J00934O1894
$$ plain form
3744.7 110576797 110580969 110588241 110571849 110502613 110450816 110440862 110431302 110409379 110408676 110429299 110446858 110437405 110393107
3771.2 110393107 110358393 110351384 110342836 110325301 110335135 110370851 110391128 110385013 110366130 110376120 110434341 110498691
3795.7 110498691 110557103 110615695 110620546 110580730 110532463 110455525 110415626 110458374 110540974 110610592 110659921 110679746
3820.2 110679746 110627139 110552967 110514736 110509813 110522282 110538602 110559642 110591686 110609794 110576105 110517204 110477602
3844.6 110477602 110478032 110547543 110691845 110772598 110635090 110482275 110435593 110456347 110478556 110473967 110471010 110463560
3869.1 110463560 110423279 110364056 110318136 110320508 110355258 110357356 110322058 110282063 110267043 110279477 110268152 110239112
3893.6 110239112 110259151 110331059 110406280 110433877 110378385 110265088 110175920 110134673 110122097 110136032 110153198
3916 110153198 110142577 110123563 110116696 110111749 110098696 110100162 110125363 110129416 110103571 110097408 110115898 110115492 110080767
$$ packed form
3744.7A10576797M172P272j6392o9236n1797r954r560k1923p03K0623J7559r453m4298
3771.2A10393107l4714p009q548j7535R834L5716K0277o115j8883R990N8221O4350
3795.7A10498691N8412N8592M851l9816m8267p6938l9899M2748Q2600O9618M9329J9825
3820.2A10679746n2607p4172l8231m923J2469J6320K1040L2044J8108l3689n8901l9602
3844.6A10477602M30O9511J44302Q0753j37508j52815m6682K0754K2209m589k957p450
3869.1A10463560m0281n9223m5920K372L4750K098l5298l9995j5020J2434j1325k9040
3893.6A10239112K0039P1908P5221K7597n5492j13297q9168m1247j2576J3935J7166
3916A10153198j0621j9014o867m947j3053J466K5201M053k5845o163J8490m06l4725
$$ plain form
3942.5 110080767 110048330 110044670 110040557 110010588 109983552 109973776 109969413 109970546 109968090 109954321 109947729 109963715 109980536
3969.1 109980536 109983599 109995651 110010457 110012925 110019088 110032344 110052931 110086215 110117304 110129702 110130715 110137713
3993.5 110137713 110147142 110142970
3997.6 110142970
$$ packed form
3942.5A10080767l2437l660m113k9969k7036r776m363J133k456j3769o592J5986J6821
3969.1A09980536L063J2052J4806K468O163J3256K0587L3284L1089J2398J013O998
3993.5A10137713R429m172
3997.6A10142970
##END=$$ End of the data block
