##TITLE=$$ Begin of the data block
##JCAMP-DX=5.00 $$ ACD/SpecManager v 10.08
##SPECTROMETER/DATA SYSTEM=16PC
##DATE=18 Jun 2013 14:27:24
##DATA TYPE=INFRARED SPECTRUM
##DATA CLASS=XYDATA
##ORIGIN=
##OWNER=
##NPOINTS=3601
##FIRSTX=400.00000000
##LASTX=4000.00000000
##MAXX=4000.00000000
##MINX=400.00000000
##MAXY=77.35865784
##MINY=18.22342300
##XFACTOR=1.0000000000
##YFACTOR=0.000000100000000
##FIRSTY=41.98293686
##DELTAX=1.00000000
##XUNITS=1/CM
##YUNITS=TRANSMITTANCE
##XYDATA=(X++(Y..Y))
400 419829369 527424507 607131538 653023300 670665817 672471619 670794296 672767868 679216614
408 679216614 687165222 693474884 697105713 699067001 700891724 703238220 705633469 707221680 707632523
417 707632523 707210541 706566162 705984116 705243835 703943329 701965942 699662781 697637177 696365891
426 696365891 695982590 696346741 697254868 698570099 700183868 701913376 703494949 704705505 705502548
435 705502548 706033249 706488724 706924438 707203445 707107773 706518097 705510635 704295959 703069839 701894379
445 701894379 700694733 699340134 697727127 695806580 693569717 691042252 688309937 685540161 682950516
454 682950516 680720062 678900833 677401581 676062546 674764709 673489838 672286835 671180649 670101089
463 670101089 668883972 667341309 665347977 662902145 660149460 657386322 655043793 653627930 653598175
472 653598175 655206299 658371048 662669754 667475052 672170410 676341019 679843521 682745132 685192184
481 685192184 687291107 689054337 690413361 691268082 691547089 691261673 690536804 689598999 688709259 688052902
491 688052902 687647400 687321777 686797256 685821533 684273453 682172623 679593506 676557846 672991562
500 672991562 668787537 663936005 658636780 653314972 648524857 644786682 642428894 641496582 641750107
509 641750107 642743454 643955994 644932480 645389633 645243759 644545135 643355103 641637421 639251099
518 639251099 636069870 632178574 628022728 624395523 622226295 622250748 624720535 629303169 635218201
527 635218201 641532211 647462692 652549973 656659851 659869766 662336044 664207306 665580521 666458359
536 666458359 666694260 665968857 663875427 660146027 654939880 649026031 643702164 640413361 640220795
545 640220795 643374634 649214706 656449051 663661423 669791260 674378586 677515488 679608154 681113968
554 681113968 682373581 683566971 684740753 685851593 686801147 687472305 687782364 687733612 687434387 687064209
564 687064209 686797028 686721954 686804810 686909256 686862640 686531143 685873108 684952621 683909378 682896271
574 682896271 682011261 681250229 680506973 679621429 678449402 676912918 675002823 672746506 670181122
583 670181122 667371292 664471741 661784286 659745331 658816681 659318237 661287155 664445190 668292923
592 668292923 672277298 675946426 679024811 681400833 683067245 684067841 684476929 684403992 683996124
601 683996124 683420563 682828522 682321930 681934586 681638870 681368866 681047745 680608521 679998856 679175034
611 679175034 678090744 676702347 674998703 673048248 671027985 669200592 667829742 667064056 666861420
620 666861420 667006531 667217178 667272415 667062454 666524124 665505905 663693390 660698166 656313477 650801315
630 650801315 645009995 640185623 637511635 637585449 640103607 643936615 647565308 649661179 649519730
639 649519730 647145920 642987061 637492294 630751114 622401733 611848526 598677330 583071480
647 583071480 566045876 549392014 535336800 526006393 522860260 526272354 535416756 548520737
655 548520737 563412552 578168716 591599007 603371735 613746796 623084221 631416473 638331032
663 638331032 643227921 645785599 646334686 645887985 645778732 647094650 650222778 654748306 659743881
672 659743881 664264679 667767181 670249023 672089920 673744507 675488968 677344208 679165649 680792389
681 680792389 682147903 683248062 684154663 684930038 685627060 686298904 686998444 687749329 688514557 689194412
691 689194412 689670410 689872818 689826279 689645004 689475632 689425430 689515228 689676666 689789810 689735260 689438477
702 689438477 688897629 688184052 687418747 686729126 686196671 685822754 685525818 685179138 684666595 683930054
712 683930054 682983704 681896896 680756073 679627380 678528290 677414474 676183548 674703064 672866821
721 672866821 670662842 668219223 665788345 663663635 662059402 661018143 660396271 659936371 659381256
730 659381256 658564987 657440414 656045914 654448242 652700043 650821609 648802185 646606827 644189148
739 644189148 641512909 638569527 635359001 631810684 627668343 622424583 615410805 606081352 594407845
748 594407845 581183281 568022842 556974449 549852104 547574883 549817123 555135841 561513023
756 561513023 567058411 570573387 571775551 571162720 569656792 568218040 567577286 568133850 569984131
765 569984131 573011742 576984634 581631737 586698608 591981010 597333679 602656593 607861481 612841873
774 612841873 617461815 621569901 625033379 627775154 629799576 631205788 632185020 633002357 633954887
783 633954887 635299377 637162628 639466286 641911926 644055328 645460052 645869522 645324631 644164200
792 644164200 642908401 642075729 642010803 642796097 644265976 646105881 647988586 649692688 651160126
801 651160126 652469025 653724670 654917297 655819092 656004257 655022278 652664032 649185181 645334396
810 645334396 642117767 640383835 640424271 641798325 643478241 644229736 643031311 639333572 633096848
819 633096848 624680939 614734688 604172020 594194069 586229019 581692390 581596451 586174431 594731293
828 594731293 605826759 617729874 628940659 638549347 646314316 652484589 657512512 661806870
836 661806870 665613327 669013596 671985626 674469757 676415787 677819672 678753891 679387054 679973602
845 679973602 680802536 682117996 684040146 686523132 689368439 692290573 695012054 697349014 699256973
854 699256973 700818481 702182770 703483353 704776688 706022415 707102127 707847748 708053513 707472076
863 707472076 705827866 702893982 698633270 693352966 687770309 682904587 679797440 679161987 681122589
872 681122589 685178833 690415421 695851593 700763168 704835968 708113403 710813370 713137131 715168915
881 715168915 716886749 718238831 719219437 719894638 720379639 720795212 721230698 721728134 722287521 722880630
891 722880630 723472977 724045181 724607391 725200882 725877457 726671906 727579727 728557053 729543228 730491104
901 730491104 731387177 732250671 733115997 734011154 734945602 735905533 736859512 737763519 738573456 739263000
911 739263000 739839401 740346375 740843353 741368790 741911850 742411346 742787857 742980652 742953491 742660904
921 742660904 741996918 740786667 738857880 736175995 732970123 729751816 727184906 725847244 726000519
930 726000519 727491760 729840088 732454529 734867630 736862259 738451157 739752960 740860443 741778641
939 741778641 742453079 742841873 742970200 742928009 742821655 742715530 742605133 742432938 742131195 741660538
949 741660538 741026154 740268860 739441910 738589935 737735443 736875229 735985641 735032272 733984756 732836456
959 732836456 731621094 730422897 729371033 728615494 728289948 728468018 729133377 730175095 731412582
968 731412582 732645264 733706741 734500351 735003967 735247650 735278091 735134048 734837418 734404678 733857193
978 733857193 733225250 732539368 731816177 731048660 730207748 729251022 728137054 726836395 725338669 723655090
988 723655090 721813660 719848633 717782974 715612564 713299332 710778580 707980576 704858475 701414337
997 701414337 697718658 693922653 690257645 687017975 684517365 683022003 682673187 683435516 685093994
1006 685093994 687308884 689704742 691956635 693834229 695203400 695998535 696202850 695849228 695036697
1015 695036697 693932953 692744141 691658401 690789261 690155029 689705353 689378815 689152298 689054871 689138336
1025 689138336 689428711 689890747 690428619 690920944 691270523 691440659 691464615 691425247 691419220 691520386 691756821
1036 691756821 692105255 692503128 692870941 693134460 693240051 693158035 692877808 692400436 691732025 690881424
1046 690881424 689859390 688676071 687337189 685843353 684193115 682389679 680444183 678373947 676193619
1055 676193619 673903809 671487808 668912888 666138840 663126755 659843826 656266785 652381973 648184128
1064 648184128 643669357 638822594 633602486 627935638 621722603 614853859 607228622 598759995 589371071
1073 589371071 578986053 567529411 554939003 541181259 526259842 510210495 493090706 474979973
1081 474979973 456003036 436374016 416453285 396801796 378217812 361729927 348508606 339661865
1089 339661865 335926666 337345200 343088455 351581230 360974541 369825363 377688942 385315437 394308128
1098 394308128 406372719 422510147 442541046 465165939 488480415 510633430 530295181 546767731
1106 546767731 559814301 569435425 575792656 579315948 580862350 581726990 583409233 587199326 593779755
1115 593779755 603046074 614222565 626199799 637915573 648610229 657884445 665599594 671731949
1123 671731949 676273041 679209137 680541229 680292130 678474503 675053177 669965210 663238754 655179977
1132 655179977 646528397 638455315 632345390 629408722 630282974 634805260 642070236 650750198 659526672
1141 659526672 667443695 674049759 679312515 683405609 686502228 688669281 689883194 690108337 689370193
1150 689370193 687777634 685494461 682693405 679520493 676079636 672428894 668570099 664429703 659839630
1159 659839630 654532471 648161087 640341492 630712280 619013748 605195084 589553719 572881546
1167 572881546 556550827 542450790 532707062 529202003 533022881 544041443 560821877 580935020
1175 580935020 601589851 620348854 635658569 647019424 654789352 659769592 662785110 664425049
1183 664425049 664991913 664601440 663321075 661259003 658573990 655427017 651925888 648102875 643941345
1192 643941345 639444160 634709587 629975700 625598145 621951561 619283905 617586823 616546364 615612450
1201 615612450 614159279 611671600 607871323 602737656 596428185 589155998 581085930 572289619 562758331
1210 562758331 552441635 541282692 529231987 516246796 502288513 487328224 471361923 454424706
1218 454424706 436599083 418014107 398837852 379271927 359555855 339987640 320960846 303005791
1226 303005791 286809807 273187447 262982349 256906776 255361786 258296814 265167103 275010777
1234 275010777 286628113 298805618 310521183 321080971 330173073 337842445 344410667 350359650
1242 350359650 356200371 362354431 369070511 376395836 384191055 392156029 399836617 406606636 411677551
1251 411677551 414207497 413552246 409613571 403137321 395778198 389818649 387581787 390747070 399849472
1260 399849472 414170723 432053566 451473732 470605965 488169365 503479424 516299057 526647911
1268 526647911 534696579 540767136 545368385 549169312 552870178 557011642 561809692 567100983 572418365
1277 572418365 577150459 580711060 582650642 582694588 580722694 576726151 570763893 562921486 553277664
1286 553277664 541888657 528819351 514240494 498576317 482641754 467681503 455240898 446871986
1294 446871986 443755951 446378746 454386749 466670570 481636887 497553749 512847137 526274033
1302 526274033 536963844 544372787 548210411 548381004 544953651 538164062 528436241 516418495
1310 516418495 503014793 489384956 476886482 466937599 460821152 459472580 463312454 472177315
1318 472177315 485362968 501764221 520068054 538948593 557227249 573978500 588577347 600697021
1326 600697021 610274048 617456284 622552834 625990486 628277130 629955673 631537781 633421593 635814552
1335 635814552 638699760 641870422 645026016 647890549 650297241 652204437 653647842 654672775 655294037
1344 655294037 655504913 655309982 654745941 653869171 652720184 651305389 649613800 647655029 645475006
1353 645475006 643123169 640584183 637729263 634318428 630045433 624564781 617462502 608213844 596239166
1362 596239166 581159515 563221016 543674545 524820404 509532661 500351028 498512726 503395805
1370 503395805 512672424 523119469 531701736 536445465 536780052 533335533 527441025 520619583 514266090
1379 514266090 509505844 507141647 507615967 510992279 517005920 525198898 535081902 546231117 558271942
1388 558271942 570788536 583256073 595074387 605697670 614782906 622260933 628294487 633157806
1396 633157806 637112732 640337601 642919235 644878693 646205902 646891174 646951523 646450729 645495605
1405 645495605 644203339 642655869 640871582 638824272 636492920 633902855 631118164 628181801 625049515
1414 625049515 621577721 617585754 612963409 607750320 602136002 596378288 590691605 585172577 579796906
1423 579796906 574475937 569135284 563772850 558478584 553414230 548759117 544639168 541062431 537892685
1432 537892685 534887123 531786232 528411636 524714966 520747871 516586075 512270699 507816086 503277550
1441 503277550 498802681 494602051 490830841 487454910 484212646 480722427 476679955 472020035 466924210
1450 466924210 461670265 456429710 451165657 445708809 439960747 434077644 428498039 423780441 420353699
1459 420353699 418328171 417480087 417403259 417731056 418305130 419221420 420761490 423266144 427017365
1468 427017365 432156067 438641815 446250725 454610863 463279495 471844826 480021896 487706604 494964523
1477 494964523 501970901 508930893 516012459 523305359 530802269 538389816 545856895 552927551 559329338
1486 559329338 564885063 569587593 573619614 577288589 580900192 584622688 588414383 592058983 595298157
1495 595298157 597995415 600232811 602274475 604395218 606660652 608780403 610134010 609973869 607709465
1504 607709465 603130798 596455231 588188248 578883820 568934669 558492279 547540283 536074257
1512 536074257 524322166 512937508 503104858 496491661 494980392 500182838 512849617 532412910
1520 532412910 556918640 583466568 609036369 631347961 649368286 663257294 673856506 682060547
1528 682060547 688430023 693200836 696550064 698841019 700617676 702357483 704186630 705795517 706644440
1537 706644440 706323776 704834671 702613297 700305405 698457260 697311172 696791916 696638565 696563721
1546 696563721 696359406 695937347 695333710 694696274 694230423 694077682 694168549 694136963 693401489 691418915
1556 691418915 687997589 683485031 678692780 674569473 671781616 670425873 670016403 669745407 668868561
1565 668868561 667021484 664326248 661262054 658387070 656049347 654222946 652533340 650453491 647570267
1574 647570267 643784409 639341469 634680786 630187912 625996361 621947479 617719841 613030243 607772522
1583 607772522 602013168 595869293 589368820 582395515 574738617 566192093 556618118 545945435
1591 545945435 534146194 521268768 507558594 493610039 480432510 469328575 461583633 458072243
1599 458072243 458944740 463525391 470455055 478017540 484531479 488687477 489754372 487622719 482700806
1608 482700806 475718460 467514458 458880157 450499382 442958260 436762085 432291641 429687996 428729706
1617 428729706 428797684 428993187 428383636 426268082 422337646 416663971 409552765 401362839 392390022
1626 392390022 382843933 372877350 362598686 352044220 341145248 329749680 317727318 305111980
1634 305111980 292193375 279480114 267542744 256820202 247505569 239574203 232929764 227571354
1642 227571354 223677883 221570358 221585064 223939533 228660030 235589218 244450607 254921303 266686993
1651 266686993 279464149 292996216 307026711 321256828 335306778 348713646 360986252 371709023
1659 371709023 380643692 387760315 393163261 396940193 399020691 399136505 396909714 392013741 384303246
1668 384303246 373831482 360766373 345289536 327585716 307957573 286997738 265685978 245303459
1676 245303459 227161617 212257786 201021023 193262863 188338833 185423183 183764839 182833061
1684 182833061 182346134 182234230 182596912 183677750 185838013 189493961 195010529 202580929 212143307
1693 212143307 223379459 235798893 248871346 262153473 275357780 288349571 301088428 313553448
1701 313553448 325695839 337440872 348733864 359603767 370204124 380803185 391720238 403229256
1709 403229256 415470047 428402519 441822510 455430450 468928299 482105980 494886703 507313843
1717 507313843 519481888 531442719 543130722 554352989 564860878 574472008 583178329 591162529
1725 591162529 598696823 605968399 612933693 619304466 624698830 628882408 631963005 634406319 636851959
1734 636851959 639821396 643488464 647641830 651857834 655769577 659271545 662540436 665882339 669512787
1743 669512787 673409042 677319794 680906067 683922424 686330643 688299103 690107803 692023544 694206390
1752 694206390 696677246 699341278 702037735 704600601 706904144 708894272 710596619 712103195 713546753
1761 713546753 715067673 716780014 718737717 720900421 723118896 725154877 726754227 727753601 728176651
1770 728176651 728256607 728357773 728823013 729826965 731313782 733053284 734773941 736288300 737544785
1779 737544785 738594055 739521561 740403671 741311798 742327271 743526993 744924698 746408997 747748337
1788 747748337 748689575 749107590 749108429 749005127 749163666 749805984 750890427 752145004 753226013 753906403
1798 753906403 754180374 754239197 754348221 754709702 755381851 756279831 757236176 758081970 758710861 759112167
1808 759112167 759365768 759603882 759947739 760450821 761075897 761724167 762300720 762773895 763189240 763629761
1818 763629761 764153976 764760132 765398636 766015015 766580505 767084961 767502899 767777786 767851944 767729187
1828 767729187 767513504 767378845 767477112 767843399 768378906 768927994 769398727 769832535 770362244 771081009
1838 771081009 771923370 772653122 772983780 772755356 772051773 771173935 770486145 770234604 770445251 770951309
1848 770951309 771515961 771959381 772221603 772342148 772395782 772433853 772466049 772477341 772457809 772422409 772412720
1859 772412720 772481079 772664261 772950211 773259964 773456116 773390732 772978592 772254715 771379623 770574265
1869 770574265 770017776 769763336 769725571 769743195 769676895 769479446 769201508 768937302 768757629 768674850 768654556
1880 768654556 768651428 768636398 768593063 768498077 768311462 767995300 767549515 767036667 766570358 766265488 766184616
1891 766184616 766314926 766586380 766922913 767286835 767686615 768150330 768687668 769269485 769840469 770350571
1901 770350571 770778427 771129990 771414108 771622772 771733627 771739120 771677704 771636505 771714478 771963654 772347641
1912 772347641 772748032 773023071 773081131 772928085 772657013 772391510 772218704 772152710 772147980 772144470 772111053
1923 772111053 772059555 772025070 772034073 772081680 772136230 772159576 772131653 772061310 771983490 771942596 771975784 772097397
1935 772097397 772289200 772500458 772659378 772699203 772588043 772348709 772054749 771802597 771669083 771679764
1945 771679764 771803436 771973114 772120895 772207184 772229767 772213745 772189636 772177963 772181854 772192383 772198029 772193527
1957 772193527 772182617 772176514 772184219 772206955 772235489 772254639 772253418 772235336 772220230 772235870 772303085 772423019
1969 772423019 772574158 772723465 772842407 772920227 772967148 773005066 773054047 773121490 773200073 773271713 773319168
1980 773319168 773334656 773325958 773314056 773324585 773373337 773455429 773540573 773586578 773556900 773441315 773262329 773064957
1992 773064957 772894287 772775116 772703247 772654343 772601624 772529449 772437057 772330933 772213898 772079544 771916046
2003 771916046 771715240 771479797 771225433 770977097 770759430 770588684 770466080 770374146 770281525 770151825
2013 770151825 769958649 769698257 769394531 769091797 768837051 768661041 768566589 768529282 768511124 768476410 768405457
2024 768405457 768296280 768162155 768023605 767900696 767807846 767751389 767728043 767724380 767721100 767696152 767632065
2035 767632065 767519073 767358322 767159348 766938705 766715164 766505432 766321106 766164017 766027527 765898590
2045 765898590 765764694 765620499 765471344 765331192 765216522 765137558 765093842 765073395 765059433 765036240 764994583
2056 764994583 764931107 764845276 764736938 764605637 764453583 764288330 764122772 763970718 763839645 763725891
2066 763725891 763615723 763492584 763345947 763177795 763002243 762838364 762700577 762593842 762511292 762440186
2076 762440186 762368011 762288818 762205200 762127609 762071609 762052307 762078781 762148361 762244492 762339783 762402954 762410583
2088 762410583 762354355 762245102 762107391 761970215 761855774 761773834 761719360 761676865 761627350 761554260 761448517
2099 761448517 761310120 761148376 760979080 760819626 760683670 760576248 760490723 760410309 760313416 760182343
2109 760182343 760009384 759801483 759576950 759358063 759160919 758989182 758832474 758672333 758490906 758278427
2119 758278427 758036194 757773590 757503128 757233734 756969833 756710510 756452255 756190643 755922241 755644684
2129 755644684 755357437 755061722 754760742 754458923 754159698 753865204 753576431 753293915 753020172 752759247
2139 752759247 752517471 752302246 752120209 751977234 751876755 751820679 751807861 751836395 751904678 752013626 752166748
2150 752166748 752368622 752620468 752914658 753234482 753556900 753860016 754132385 754377365 754612350 754860306
2160 754860306 755139236 755453262 755790405 756127396 756439743 756710129 756935501 757125778 757298813 757472763
2170 757472763 757659531 757861023 758068848 758268280 758443069 758580780 758677750 758740158 758781967 758821411 758874283
2181 758874283 758949127 759044952 759152527 759258347 759351120 759426270 759488297 759549408 759623718 759722366 759846725
2192 759846725 759989014 760133438 760263138 760367279 760444031 760500488 760548477 760598755 760655594 760715561 760768509
2203 760768509 760802689 760808258 760781631 760725708 760648804 760561752 760473938 760390854 760313263 760238113 760160141 760075531
2215 760075531 759980927 759875717 759761200 759640045 759515533 759392166 759272842 759157639 759043427 758924255
2225 758924255 758794708 758653183 758504028 758356247 758220978 758107986 758022385 757965088 757934189 757925797 757935715
2236 757935715 757960052 757993774 758031998 758070526 758106155 758137360 758163452 758183441 758195801 758197327 758184662 758154297
2248 758154297 758104019 758032608 757940140 757826767 757693939 757543488 757379379 757207489 757033844 756863327
2258 756863327 756696777 756531296 756361542 756182938 755996017 755806656 755624542 755460434 755320129 755204773
2268 755204773 755110779 755035172 754977951 754944077 754940414 754971619 755037155 755132294 755251694 755391846 755550690
2279 755550690 755722198 755889053 756021957 756085052 756048965 755902328 755657043 755341339 754985428 754608994
2289 754608994 754217758 753808670 753378448 752928314 752461853 751980362 751479416 750952988 750400314 749828186
2299 749828186 749246597 748657684 748047409 747384949 746632538 745758591 744748688 743610306 742373199
2308 742373199 741088943 739825287 738652878 737619934 736722946 735887375 734974670 733823013 732307358
2317 732307358 730396805 728179855 725844650 723617630 721683121 720111923 718834381 717669601 716407852
2326 716407852 714915543 713207397 711449509 709877930 708672562 707860641 707304764 706785660 706121902
2335 706121902 705242157 704164352 702907257 701430054 699679565 697744446 696010284 695163498 695968399
2344 695968399 698881073 703702850 709490128 714816513 718283844 719035416 717018280 712888947 707648239
2353 707648239 702222214 697196732 692789536 688994598 685763855 683107605 681089706 679764328 679129562
2362 679129562 679128494 679685440 680739670 682249298 684172668 686454239 689026489 691827316 694814682
2371 694814682 697965927 701263504 704682083 708188934 711752548 715348969 718955765 722535172 726019440
2380 726019440 729312057 732305069 734906616 737062073 738760910 740031586 740929642 741526947 741902237
2389 741902237 742132492 742284088 742404785 742521515 742642059 742761612 742870865 742960205 743023376 743058319
2399 743058319 743067780 743059235 743041229 743019333 742993698 742958527 742907181 742835541 742745438 742643280 742536163 742427216
2411 742427216 742314453 742192383 742054977 741898193 741722870 741533661 741337738 741142120 740950851 740762177
2421 740762177 740568924 740362625 740136642 739891739 739636688 739383240 739141998 738916702 738703995 738496704
2431 738496704 738287964 738075256 737860870 737650604 737451096 737267990 737104340 736960068 736830368 736704941
2441 736704941 736569061 736407394 736209488 735975418 735715714 735449066 735194092 734961777 734751053 734549637
2451 734549637 734340668 734110870 733855133 733579178 733294525 733015060 732752075 732511826 732294998 732095718
2461 732095718 731902924 731701355 731475754 731216202 730922089 730603027 730275421 729954605 729649963 729361572
2471 729361572 729081345 728797989 728500977 728183517 727842789 727480621 727103043 726718903 726337433 725965958
2481 725965958 725605545 725250854 724892960 724524307 724142532 723752747 723364105 722986679 722626495 722284851
2491 722284851 721958923 721644821 721340179 721045151 720762939 720499268 720262146 720060501 719904556 719802933
2501 719802933 719761353 719781342 719859085 719985809 720149689 720336685 720533524 720729065 720915222 721087646
2511 721087646 721244278 721385269 721510315 721619110 721709900 721780396 721829147 721857376 721871185 721881485 721902084
2522 721902084 721944885 722016830 722115631 722231598 722351227 722461777 722555466 722629929 722685699 722724152 722744904
2533 722744904 722746582 722728043 722689514 722631531 722555466 722461929 722352676 722231293 722104950 721981583 721867142
2544 721867142 721761856 721658707 721546097 721413040 721253738 721068802 720864182 720646667 720418777 720179138
2554 720179138 719923248 719646759 719348297 719030609 718699036 718358917 718014603 717668686 717320786 716970444
2564 716970444 716615067 716253204 715883408 715506210 715123367 714736557 714346237 713950119 713543777 713122101
2574 713122101 712681732 712220993 711740646 711241074 710721512 710179367 709611588 709015961 708392410 707741928
2584 707741928 707067337 706371918 705659256 704933929 704200897 703465576 702732773 702005463 701284637 700568924
2594 700568924 699853745 699134369 698406906 697672501 696938705 696218643 695527954 694879227 694275513 693710327
2604 693710327 693170853 692645111 692129211 691630249 691164627 690752182 690409851 690147095 689965134 689858475
2614 689858475 689817581 689830780 689888687 689984741 690117035 690288696 690503082 690762024 691061020 691389618 691734695
2625 691734695 692084427 692432098 692776337 693118820 693460693 693801117 694137115 694466400 694787445 695098495
2635 695098495 695395584 695670090 695910416 696104126 696243820 696329346 696367645 696368942 696343002 696295242 696227722
2646 696227722 696139984 696031952 695904770 695761185 695603561 695435638 695260773 695083389 694908142 694737701
2656 694737701 694570847 694400558 694214859 694000549 693746567 693448257 693107376 692730255 692323074 691888962
2666 691888962 691424713 690920563 690363235 689738770 689038239 688259659 687410965 686506653 685564194 684597473
2676 684597473 683611984 682602921 681558075 680462952 679308777 678096390 676836777 675548477 674250565
2685 674250565 672958755 671683197 670428619 669198227 667997055 666833954 665723572 664683533 663734131
2694 663734131 662895050 662181778 661604156 661164169 660856781 660672607 660600739 660631180 660755310 660963440
2704 660963440 661243591 661580124 661955872 662355652 662767944 663185883 663603287 664011459 664396362 664739380
2714 664739380 665020142 665222626 665336533 665359650 665294342 665146866 664923248 664630051 664272079 663855515
2724 663855515 663386383 662873917 662330780 661774597 661225815 660704956 660228577 659805145 659434814 659110336
2734 659110336 658819885 658551865 658296432 658048553 657808380 657580414 657372665 657194061 657051392 656947098
2744 656947098 656878510 656839828 656822891 656821136 656829987 656847153 656873016 656910782 656965332 657043076 657149048 657284164
2756 657284164 657443466 657616043 657787704 657944794 658077621 658183060 658261719 658316650 658347549 658350754 658317413
2767 658317413 658235855 658095169 657887573 657610016 657263947 656852798 656380768 655850906 655264359 654622192
2777 654622192 653926163 653178482 652383957 651547852 650677109 649779892 648864136 647936325 646999283 646051102
2787 646051102 645087585 644104385 643102798 642089615 641074295 640062790 639051514 638024788 636958237
2796 636958237 635826988 634614029 633314362 631934204 630486298 628983269 627436600 625857697 624260826
2805 624260826 622665291 621094208 619568901 618105659 616713524 615396767 614158669 613004875 611943970
2814 611943970 610984459 610132370 609390793 608761635 608247643 607854614 607587967 607449722 607435226 607532845
2824 607532845 607728539 608010597 608373108 608816948 609344330 609954605 610639954 611384735 612168045 612966614
2834 612966614 613757248 614518242 615229759 615873947 616434975 616900215 617260628 617511330 617651215 617683640
2844 617683640 617616997 617464485 617242508 616968422 616657486 616321144 615965576 615594368 615209274 614811668
2854 614811668 614402618 613979225 613533592 613050537 612508469 611882591 611149139 610290871 609302101 608191490
2864 608191490 606984291 605717850 604436951 603182831 601982765 600843391 599748535 598665504 597556953
2873 597556953 596393700 595164261 593878708 592565918 591267471 590030518 588902168 587926407 587139587
2882 587139587 586566544 586214600 586069450 586093826 586231384 586415520 586579819 586667480 586637459 586465836
2892 586465836 586142731 585669098 585050926 584296341 583412437 582404137 581272812 580018921 578645592
2901 578645592 577164459 575600204 573991928 572389297 570844040 569399529 568082771 566899681 565838242
2910 565838242 564873276 563974838 563116035 562276726 561446571 560625076 559818535 559035873 558285294 557569580
2920 557569580 556885834 556226959 555584755 554951477 554322281 553693924 553063011 552424278 551769600 551085472
2930 551085472 550352402 549545746 548641853 547629776 546525726 545382385 544286919 543342247 542635002
2939 542635002 542203369 542017441 541982384 541965408 541833267 541487999 540885468 540031891 538967094 537741165
2949 537741165 536398468 534970245 533476524 531930313 530341377 528717690 527067184 525397835 523720932
2958 523720932 522051888 520409508 518813210 517279739 515820847 514443207 513148003 511930695 510779915
2967 510779915 509675293 508588867 507487755 506339912 505122719 503828049 502469940 501090279 499762115
2976 499762115 498590889 497706413 497246590 497331352 498031731 499342918 501169853 503331604 505590706
2985 505590706 507699776 509459305 510770149 511662750 512291832 512891579 513703575 514899445 516525459
2994 516525459 518489876 520595665 522604752 524308090 525573769 526361237 526702843 526668663 526331444
3003 526331444 525746841 524948921 523957443 522787628 521458092 519995079 518436089 516831589 515247574
3012 515247574 513762321 512458496 511408920 510660858 510223274 510063820 510117493 510307465 510570641 510880966
3022 510880966 511261864 511777306 512507439 513510284 514786644 516260033 517781029 519156799 520195885
3031 520195885 520753479 520762596 520242348 519282570 518015060 516578369 515092926 513645363 512286949
3040 512286949 511040039 509907684 508883667 507959518 507127800 506383438 505722084 505136032 504611664
3049 504611664 504128380 503659973 503178940 502660828 502088280 501451683 500749588 499988861 499182816 498350258
3059 498350258 497510376 496675835 495845375 495000496 494107323 493126297 492025490 490790977 489433708
3068 489433708 487987328 486500397 485024529 483603172 482262268 481006241 479819107 478671570 477528267
3077 477528267 476357384 475134392 473842010 472468643 471005745 469447937 467793655 466045952 464210320
3086 464210320 462291870 460292702 458212700 456055183 453832321 451568642 449298019 447055588 444868889
3095 444868889 442753105 440711784 438744202 436851845 435044174 433336716 431747780 430291634 428973923
3104 428973923 427790604 426729584 425774879 424911118 424126854 423415298 422773323 422198944 421688156 421233673
3114 421233673 420824394 420447044 420090828 419751282 419435310 419163551 418969421 418893356 418974113 419239273
3124 419239273 419698486 420343094 421150475 422093163 423147812 424302292 425555496 426915436 428390999
3133 428390999 429986076 431693649 433495941 435368347 437286530 439232903 441200714 443192749 445216255
3142 445216255 447277832 449379616 451520004 453693619 455892410 458103752 460308037 462477570 464580536
3151 464580536 466587868 468481255 470256615 471920586 473483849 474951477 476319237 477574844 478703270
3160 478703270 479693260 480538979 481238174 481790695 482195969 482456322 482579651 482580910 482480164 482295876
3170 482295876 482040405 481718330 481331558 480884247 480387917 479859428 479315262 478766136 478214569 477657166
3180 477657166 477089882 476510963 475919838 475313416 474683495 474017029 473301697 472529449 471698799 470811348
3190 470811348 469867859 468864136 467793236 466649132 465430336 464141808 462791557 461387672 459936600
3199 459936600 458442268 456907654 455334320 453721504 452064247 450354156 448583794 446750488 444859123
3208 444859123 442920837 440949059 438954544 436943893 434920464 432886734 430848465 428813820 426793365
3217 426793365 424798698 422841301 420931931 419078941 417286911 415555382 413881416 412264366 410711136
3226 410711136 409237022 407862320 406602287 405458984 404419060 403458595 402557068 401708031 400923042
3235 400923042 400226440 399641838 399180794 398838043 398596611 398438034 398351669 398337936 398404350 398557930
3245 398557930 398798790 399118919 399503593 399935379 400396080 400867233 401329994 401765442 402155571 402486458
3255 402486458 402747116 402928886 403021812 403011742 402880249 402605858 402168655 401555290 400761452 399793854
3265 399793854 398669548 397411575 396048622 394612083 393137589 391666031 390246201 388934174 387791023
3274 387791023 386878204 386251259 385954971 386019630 386460609 387277946 388457451 389971504 391780853 393838501
3284 393838501 396093712 398498077 401010857 403600197 406242561 408918228 411605453 414279060 416909332
3293 416909332 419467468 421930580 424284134 426522636 428646431 430657921 432559586 434351807 436033401
3302 436033401 437600899 439048653 440369263 441556206 442606659 443523636 444315414 444992371 445563545
3311 445563545 446034355 446408348 446689758 446886330 447009659 447071800 447082481 447047882 446970291 446850471 446689301
3322 446689301 446488228 446249161 445975533 445671806 445344543 444999275 444637642 444255333 443842201 443387794
3332 443387794 442885742 442338486 441754417 441142235 440504227 439832306 439110260 438321037 437453728 436508522
3342 436508522 435495987 434431381 433328171 432193298 431025696 429820328 428573837 427289581 425980377
3351 425980377 424665985 423368645 422108231 420898437 419747238 418658371 417634239 416677055 415788956
3360 415788956 414972305 414230194 413567619 412992249 412512932 412137375 411868820 411703987 411634407 411648979
3370 411648979 411737938 411897430 412130280 412444077 412847252 413342094 413921165 414565697 415250931 415954552
3380 415954552 416664696 417384148 418127632 418912010 419747429 420631065 421548004 422478714 423406715 424323845
3390 424323845 425230103 426130142 427028236 427925987 428822365 429716034 430606346 431493683 432377434 433255463
3400 433255463 434124641 434982300 435827370 436661682 437486763 438302574 439107056 439897461 440674133 441441803
3410 441441803 442207909 442977715 443747902 444504433 445227356 445899467 446516304 447089615 447642860 448202019
3420 448202019 448783836 449391594 450016708 450644798 451262436 451860352 452433357 452980919 453505440 454014091
3430 454014091 454516411 455020027 455524750 456020432 456489563 456915703 457292213 457625351 457929001 458214226
3440 458214226 458480377 458715210 458903770 459041595 459142075 459232254 459340096 459478378 459637947 459793091
3450 459793091 459915543 459989052 460014381 460003548 459967575 459906540 459809036 459659920 459451675 459190674 458894691
3461 458894691 458584175 458271828 457956619 457623100 457247467 456804085 456273727 455648804 454937630 454164238
3471 454164238 453361206 452557983 451766891 450974884 450145798 449235420 448210220 447063446 445814934
3480 445814934 444498596 443141861 441750259 440306969 438784485 437162514 435438232 433623695 431733780
3489 431733780 429773521 427736359 425614471 423411789 421150360 418863106 416576691 414299583 412024307
3498 412024307 409744911 407478447 405274773 403205528 401340027 399722099 398365936 397269325 396436691
3507 396436691 395892601 395676079 395820503 396333389 397189178 398340797 399738998 401346207 403138885
3516 403138885 405098724 407201385 409413605 411697311 414017906 416351128 418684349 421017570 423361855
3525 423361855 425739746 428180161 430707932 433330498 436027985 438755646 441460686 444107819 446699066
3534 446699066 449277496 451907158 454639320 457477913 460367699 463211441 465912857 468423538 470768433
3543 470768433 473033447 475319977 477692833 480150909 482640648 485100555 487508011 489895325 492325287
3552 492325287 494846916 497465057 500148087 502865753 505620842 508441505 511330566 514206352 516889420
3561 516889420 519165039 520898819 522139816 523139954 524266243 525845184 528025436 530731926 533729057
3570 533729057 536748199 539601288 542227936 544672775 547033806 549421616 551941338 554676361 557649117
3579 557649117 560769196 563811607 566470337 568490410 569814110 570653076 571423416 572562599 574329376
3588 574329376 576695595 579393997 582079086 584503136 586604538 588477707 590273552 592112160 594059181
3597 594059181 596156845 598454437 600992584 603748016 606584663 609269371 611558800 613315964 614586601
3606 614586601 615590401 616633759 617989998 619803200 622041245 624503098 626868172 628788490 630014229
3615 630014229 630531731 630647240 630942345 632068825 634436760 637940483 641889877 645231323 646991577
3624 646991577 646737213 644810486 642201462 640114899 639454346 640486221 642837830 645786896 648650208
3633 648650208 651054535 652986298 654662628 656362076 658317413 660681229 663495026 666613312 669620514
3642 669620514 671855774 672627335 671564255 668912201 665554810 662682571 661256256 661567612 663157730
3651 663157730 665136108 666694031 667497177 667748260 667943268 668534012 669724197 671479645 673659897
3660 673659897 676112213 678653870 681007538 682814560 683777466 683842773 683263855 682451630 681693878
3669 681693878 680946503 679871979 678122253 675674057 672977295 670796585 669853134 670493317 672584000
3678 672584000 675652542 679126511 682492905 685310287 687152863 687624893 686506348 683947296 680548477
3687 680548477 677219009 674849319 673973923 674605484 676315155 678476944 680523148 682079620 682972794
3696 682972794 683180389 682806778 682102432 681463547 681344910 682073288 683646622 685641632 687323685
3705 687323685 687938690 687059860 684817047 681883011 679214172 677665558 677659836 679062576 681299896
3714 681299896 683636017 685463333 686470566 686649475 686186981 685342102 684374924 683534546 683062515
3723 683062515 683163605 683933411 685282059 686901398 688309784 688974152 688478699 686704483 683958740
3732 683958740 680987625 678806076 678345413 680028305 683476639 687558746 690829620 692190399 691414719
3741 691414719 689221649 686822281 685195389 684535522 684222336 683327332 681318359 678490295 675840149
3750 675840149 674474030 674942474 676932068 679485092 681570892 682629776 682769547 682554703 682584305
3759 682584305 683145599 684120789 685132675 685778809 685806274 685171814 684018021 682626572 681363373
3768 681363373 680598526 680590744 681368103 682681427 684076843 685072861 685361633 684926605 684021606 683029938
3778 683029938 682280731 681920242 681889114 682007370 682108002 682143173 682205200 682454300 683001556 683826065
3788 683826065 684785690 685711365 686517563 687231903 687916565 688534241 688878479 688646393 687634048 685914459
3798 685914459 683856888 681946106 680512161 679569397 678886261 678250504 677721634 677669907 678540268 680494766
3808 680494766 683192139 685875778 687735901 688311310 687671509 686278687 684647141 683051300 681471100
3817 681471100 679783554 678021545 676490097 675644913 675820923 677007523 678828430 680740662 682316208
3826 682316208 683425980 684221573 684942627 685688324 686299667 686419144 685689163 683973007 681471481
3835 681471481 678674774 676173401 674429626 673631744 673709488 674494247 675913010 678065491 681096573
3844 681096573 684907837 688892975 691920090 692672958 690249786 684725418 677335739 670121765 665148697
3853 665148697 663674240 665675964 669965897 674804077 678673325 680825882 681381760 681015091 680464630
3862 680464630 680146790 680034714 679800110 679088974 677766953 676024628 674310226 673137665 672863998
3871 672863998 673538589 674891434 676465607 677818604 678688202 679036713 678973389 678628464 678077164 677358551
3881 677358551 676546173 675784378 675237122 674979095 674922485 674866486 674649200 674304733 674095001 674376526
3891 674376526 675373535 676999817 678845978 680335007 680954056 680438309 678833237 676440430 673709106
3900 673709106 671122665 669104080 667941284 667734070 668383865 669639206 671186066 672739868 674097366
3909 674097366 675132370 675766678 675951385 675684509 675043411 674193420 673350677 672704163 672346497 672248077
3919 672248077 672295151 672364120 672388687 672382278 672404175 672492447 672609253 672637558 672442856 671967239 671296463
3930 671296463 670645905 670263672 670295792 670705490 671291885 671801758 672057495 672023163 671779327 671443405
3940 671443405 671100845 670786591 670506897 670258255 670026474 669778061 669475861 669119644 668775635 668551331
3950 668551331 668518829 668646545 668803864 668848495 668728256 668510056 668307648 668173828 668058472 667873154
3960 667873154 667598190 667323608 667169113 667158737 667171936 667037048 666690216 666244583 665890579 665708542
3970 665708542 665575104 665272827 664714508 664065628 663616333 663499985 663523407 663305359 662632980 661703873
3980 661703873 660979462 660732956 660705795 660257187 658959503 657105331 655560303 654938354 654782104 653637772
3990 653637772 650255356 645042038 640294418 638341599 638350525 634031296 614517441 568935966 492604179
3999 492604179 391226501
4000 391226501
##END=$$ End of the data block
