##TITLE=$$ Begin of the data block
##JCAMP-DX=5.00 $$ ACD/SpecManager v 10.08
##SPECTROMETER/DATA SYSTEM=16PC
##DATE=18 Jun 2013 14:17:14
##DATA TYPE=INFRARED SPECTRUM
##DATA CLASS=XYDATA
##ORIGIN=
##OWNER=
##NPOINTS=3601
##FIRSTX=400.00000000
##LASTX=4000.00000000
##MAXX=4000.00000000
##MINX=400.00000000
##MAXY=77.35929871
##MINY=17.36754417
##XFACTOR=1.0000000000
##YFACTOR=0.000000100000000
##FIRSTY=43.97741699
##DELTAX=1.00000000
##XUNITS=1/CM
##YUNITS=TRANSMITTANCE
##XYDATA=(X++(Y..Y))
$$ plain form
400 439774170 553996849 639091606 688772507 708828049 712047577 710924377 712439651 717264023
408 717264023 722610550 725950775 727001953 727251358 728184662 729986496 731641083 732027512 730899200
417 730899200 728975601 727254257 726264038 725865707 725631027 725335388 725117264 725242462 725781403 726519928
427 726519928 727158279 727563705 727836456 728150101 728546295 728879166 728936539 728593826 727850723 726737289
437 726737289 725215836 723201828 720692902 717880325 715116348 712741852 710898972 709465866 708152390
446 708152390 706673126 704884033 702826614 700699768 698810654 697515564 697137375 697853622 699604721
455 699604721 702090149 704879761 707580032 709955826 711938553 713545303 714793243 715679550 716219254
464 716219254 716474915 716526108 716396866 716016464 715272598 714135666 712763062 711498413 710752029 710839233
$$ packed form
400D39774170J14222679Q5094757M9680901K0055542L219528j123200J515274M824372
408G17264023N346527L340225J051178K49405R33304J801834J654587L86429j128312
417G30899200j923599j721344r90219l98331k34680k95639k18124J25198N38941P38525
427G26519928O38351M05426K72751L13645L96194L32871N7373l42713p43103j113434
437G26737289j521453k014008k508926k812577k763977k374496j842880j433106j313476
446G08152390j479264j789093k057419k126846j889114j295090l78189P16247J751099
455F99604721K485428K789612K700271K375794J982727J606750J247940Q86307N39704
464G16219254K55661N1193j29242l80402p43866j136932j372604j264649p46384Q7204
$$ plain form
474 710839233 711870422 713745728 716223221 719004593 721790695 724318085 726396408 727953796 729059372
483 729059372 729891129 730642395 731418076 732175827 732746964 732917404 732521591 731505585 729946442 728036194
493 728036194 726044617 724260483 722913666 722092743 721687927 721398087 720811310 719539642 717356720
502 717356720 714285202 710597153 706721878 703095093 700008011 697520981 695489197 693685608 691962967
511 691962967 690361404 689097290 688443146 688563385 689405746 690699692 692052307 693077545 693497467
520 693497467 693188019 692183838 690670090 688963165 687471237 686614227 686717911 687917633 690117264
529 690117264 693020859 696223602 699326401 702032089 704196472 705821304 706997223 707816849 708305054
538 708305054 708398819 707997894 707052765 705636215 703948975 702252350 700768127 699605560 698736725
$$ packed form
474G10839233J031189J875306K477493K781372K786102K527390K078323J557388J105576
483G29059372Q31757P51266P75681P57751N71137J70440l95813j016006j559143j910248
493G28036194j991577j784134j346817q20923m04816k89840n86777j271668k182922
502G17356720l071518l688049l875275l626785l087082k487030k031784j803589j722641
511F91962967j601563j264114o54144J20239Q42361J293946J352615J025238M19922
520F93497467l09448j004181j513748j706925j491928q57010J03684J199722K199631
529F90117264K903595L202743L102799K705688K164383J624832J175919Q19626M88205
538G08305054R3765m00925r45129j416550j687240j696625j484223j162567q68835
$$ plain form
547 698736725 698006516 697142181 695761490 693422623 689764786 684732437 678780594 672913208 668460007
556 668460007 666635208 668071060 672550964 679086914 686296768 692889481 698034973 701482468 703441925
565 703441925 704349213 704655228 704708557 704731140 704835358 705042114 705291367 705458527 705391693 704966354 704135361
576 704135361 702953720 701561661 700133057 698802185 697600479 696432800 695113297 693457108 691397934
585 691397934 689070587 686816101 685089035 684301453 684668961 686124802 688338394 690823746 693088913
594 693088913 694765778 695679703 695848007 695425644 694629974 693671494 692707520 691824188 691037903 690314178
604 690314178 689591751 688807907 687921219 686925583 685850220 684747849 683671570 682656250 681712646
613 681712646 680839844 680048599 679375839 678875504 678586273 678490906 678499374 678471222 678270111 677816391 677100906
$$ packed form
547F98736725p30209q64335j380691k338867l657837n032349n951843n867386m453201
556F68460007j824799J435852M479904O535950P209854O592713N145492L447495J959457
565G03441925R07288L06015N3329K2583J04218K06756K49253J67160o6834m25339q30993
576G04135361j181641j392059j428604j330872j201706j167679j319503j656189k059174
585F91397934k327347k254486j727066p87582L67508J455841K213592K485352K265167
594F93088913J676865R13925J68304m22363p95670r58480r63974q83332p86285p23725
604F90314178p22427p83844q86688r95636j075363j102371j076279j015320r43604
613F81712646q72802p91245o72760n00335k89231r5367Q468k8152k01111m53720p15485
$$ plain form
624 677100906 676147232 674950027 673435669 671488724 669037628 666150131 663069611 660149612 657713852
633 657713852 655913849 654671249 653741226 652864914 651918640 650973053 650224609 649834595 649769211 649725952
643 649725952 649192123 647609482 644576950 640009842 634203720 627787552 621589813 616454315 613046722
652 613046722 611698570 612326508 614465866 617422829 620506248 623249397 625521202 627464905 629295311
661 629295311 631071815 632592812 633491325 633485146 632625847 631371880 630417137 630356102 631382828 633203049
671 633203049 635210304 636810379 637696877 637925682 637774963 637514420 637242813 636880989 636295586 635443916
681 635443916 634439392 633513603 632922134 632863426 633451691 634728394 636678238 639228401 642242508
690 642242508 645534973 648919067 652264862 655535278 658775940 662061005 665432510 668861923 672253952
$$ packed form
624F77100906r53674j197205j514358j946945k451096k887497l080520k919999k435760
633F57713852j800003j242600r30023q76312r46274r45587p48444l90014o5384m3259
643F49725952n33829j582641l032532m567108n806122o416168o197739n135498l407593
652F13046722j348152O27938K139358K956963L083419K743149K271805J943703J830406
661F29295311J776504J520997Q98513o179q59299j253967r54743o1035J026726J820221
671F33203049K007255J600075Q86498K28805j50719k60543k71607l61824n85403q51670
681F35443916j004524r25789n91469n8708N88265J276703J949844K550163L014107
690F42242508L292465L384094L345795L270416L240662L285065L371505L429413L392029
$$ plain form
699 672253952 675475769 678399734 680935059 683045197 684751663 686125870 687265396 688260422 689152985
708 689152985 689907455 690407867 690493774 690025787 688957214 687376251 685491943 683560791 681789322
717 681789322 680260696 678935623 677729111 676620560 675725555 675274658 675503845 676515579 678200455
726 678200455 680265884 682358551 684205093 685690002 686836853 687718964 688371124 688756256 688794327
735 688794327 688420639 687622299 686433640 684899063 683040619 680842056 678251419 675178757 671483231
744 671483231 666969376 661422043 654699860 646865234 638289566 629665375 621888123 615832634 612105026
753 612105026 610868111 611811333 614272614 617452087 620632858 623326912 625318604 626625443 627425537
762 627425537 627993240 628659859 629779854 631682396 634602242 638612213 643586884 649226379 655128174
$$ packed form
699F72253952L221817K923965K535325K110138J706466J374207J139526R95026Q92563
708F89152985P54470N00412Q5907m67987j068573j580963j884308j931152j771469
717F81789322j528626j325073j206512j108551q95005m50897K29187J011734J684876
726F78200455K065429K092667J846542J484909J146851Q82111O52160L85132L8071
735F88794327l73688p98340j188659j534577j858444k198563k590637l072662l695526
744F71483231m513855n547333o722183p834626q575668q624191p777252o055489l727608
753F12105026j236915R43222K461281L179473L180771K694054J991692J306839Q00094
762F27425537N67703O66619J119995J902542K919846M009971M974671N639495N901795
$$ plain form
771 655128174 660884247 666160431 670740967 674533310 677548141 679865646 681600571 682866287 683750458
780 683750458 684311066 684591751 684646072 684543839 684346008 684058151 683602600 682841263 681652985 680018539
790 680018539 678045578 675896454 673650436 671194534 668241119 664497986 659915085 654863052 650115204
799 650115204 646610947 645098724 645835419 648483887 652254333 656208267 659584427 662011566 663545990
808 663545990 664554749 665511932 666795120 668547897 670633850 672681198 674175797 674556503 673283768
817 673283768 669886627 664030228 655642929 645089035 633303452 621768608 612249870 606332626
825 606332626 604926567 607959671 614416466 622711754 631225929 638761063 644739075 649117279 652140198
834 652140198 654096985 655207672 655647888 655641861 655527191 655739822 656731110 658863068 662325821 667101135
$$ packed form
771F55128174N756073N276184M580536L792343L014831K317505J734925J265716Q84171
780F83750458N60608K80685N4321j02233j97831k87857m55551p61337j188278j634446
790F80018539j972961k149124k246018k455902k953415l743133m582901n052033m747848
799F50115204l504257j512223P36695K648468L770446L953934L376160K427139J534424
808F63545990J008759R57183J283188J752777K085953K047348J494599L80706j272735
817F73283768l397141n856399q387299j0553894j1785583j1534844r518738n917244
825F06332626j406059L033104O456795Q295288Q514175P535134N978012M378204L022919
834F52140198J956787J110687M40216o027j14670K12631R91288K131958L462753M775314
$$ plain form
844 667101135 672966766 679532471 686302414 692758636 698452301 703081818 706529617 708845062 710182648
853 710182648 710722122 710605240 709911118 708671417 706914825 704716949 702234039 699714432 697477722
862 697477722 695872650 695215378 695726395 697477493 700364990 704123993 708382568 712748184 716899338
871 716899338 720657578 724013138 727099380 730123978 733283081 736687546 740321655 744048462 747654190
880 747654190 750914993 753666077 755845184 757504730 758784714 759862671 760898285 761989365 763151550
889 763151550 764324646 765400848 766265182 766839371 767116394 767171249 767145767 767203598 767475510 768013535
899 768013535 768773346 769631119 770426712 771016846 771320114 771339874 771163635 770936890 770818787 770932159
909 770932159 771318512 771922684 772607346 773200912 773554840 773592987 773332062 772872162 772362366 771951370
$$ packed form
844F67101135N865631O565705O769943O456222N693665M629517L447799K315445J337586
853G10182648N39474j16882o94122j239701j756592k197876k482910k519607k236710
862F97477722j605072o57272N11017J751098K887497L759003M258575M365616M151154
871G16899338L758240L355560L086242L024598L159103L404465L634109L726807L605728
880G47654190L260803K751084K179107J659546J279984J077957J035614J091080J162185
889G63151550J173096J076202Q64334N74189K77023N4855k5482N7831K71912N38025
899G68013535P59811Q57773P95593N90134L03268J9760j76239k26745j18103J13372
909G70932159L86353O04172O84662N93566L53928L8147k60925m59900n09796m10996
$$ plain form
919 771951370 771737289 771724625 771805801 771782532 771426163 770567703 769173355 767371979 765410461 763556747
929 763556747 761999054 760790863 759869232 759126205 758488388 757957230 757595596 757478790 757646637 758083878
939 758083878 758732224 759514008 760345154 761130981 761755753 762082977 761979141 761352768 760190582 758569717
949 758569717 756639709 754577255 752528534 750560074 748633347 746610489 744287949 741441498 737859879
958 737859879 733354416 727750854 720893021 712695847 703259354 693010941 682795105 673826294
966 673826294 667464523 664859390 666593323 672470016 681551590 692429886 703623581 713936081
974 713936081 722652359 729537430 734691620 738367920 740836639 742335434 743081207 743300629 743238144
983 743238144 743132248 743170929 743453445 743974152 744637756 745298080 745806732 746054916 745994186 745632782
$$ packed form
919G71951370k14081j2664Q1176k3269l56369q58460j394348j801376j961518j853714
929G63556747j557693j208191r21631p43027o37817n31158l61634j16806J67847M37241
939G58083878O48346P81784Q31146P85827O24772L27224j03836o26373j162186j620865
949G58569717j930008k062454k048721j968460j926727k022858k322540k846451l581619
958G37859879m505463n603562o857833q197174r436493j0248413j0215836q968811
966F73826294o361771k605133J733933N876693R081574J0878296J1193695J0312500
974G13936081Q716278O885071N154190L676300K468719J498795P45773K19422o2485
983G43238144j05896L8681K82516N20707O63604O60324N08652K48184o0730l61404
$$ plain form
993 745632782 745012817 744178085 743149567 741912003 740421448 738626862 736502914 734080429 731452789
1002 731452789 728745193 726046448 723332672 720434723 717087936 713069611 708363190 703264084 698348999
1011 698348999 694308853 691711807 690819092 691534576 693502884 696285629 699514771 702956390 706480789
1020 706480789 709995956 713401184 716592789 719498749 722103729 724438553 726539001 728406906 729997482
1029 729997482 731241989 732086411 732524796 732609253 732439194 732136688 731818390 731570969 731431656 731380615
1039 731380615 731348419 731238480 730959625 730454559 729716797 728788147 727741852 726655579 725585175 724542923
1049 724542923 723492050 722353516 721027908 719423447 717478638 715172501 712519073 709547882 706279678
1058 706279678 702700577 698744354 694287033 689158630 683170853 676152496 667976532 658570328 647909927
$$ packed form
993G45632782o19965q34732j028518j237564j490555j794586k123948k422485k627640
1002G31452789k707596k698745k713776k897949l346787m018325m706421n099106m915085
1011F98348999m040146k597046q92715P15484J968308K782745L229142L441619L524399
1020G06480789L515167L405228L191605K905960K604980K334824K100448J867905J590576
1029G29997482J244507Q44422M38385Q4457j70059l02506l18298k47421j39313n1041
1039G31380615l2196j09939k78855n05066p37762r28650j046295j086273j070404j042252
1049G24542923j050873j138534j325608j604461j944809k306137k653428k971191l268204
1058G06279678l579101l956223m457321n128403n987777p018357q175964r406204j0660401
$$ plain form
1067 647909927 636018867 622995987 609079895 594726105 580650558 567780685 557096901 549389191
1075 549389191 545009499 543711052 544647408 546539040 547952499 547599182 544560738 538390732 529102554
1084 529102554 517092628 503051491 487884331 472621346 458280716 445681229 435254440 426945190
1092 426945190 420277672 414588203 409335823 404351730 399920616 396675606 395390167 396782570 401408806
1101 401408806 409635925 421623497 437252388 456001549 476848106 498287430 518526268 535817299
1109 535817299 548843117 557033195 560727425 561145668 560163307 559926796 562380524 568813667 579557152
1118 579557152 593938866 610525017 627565498 643481903 657220688 668367157 677026138 683571930
1126 683571930 688398056 691770782 693808289 694553528 694076385 692548981 690273666 687655029 685131378
$$ packed form
1067F47909927j1891060j3022880j3916092j4353790j4075547j2869873j0683784p707710
1075E49389191m379692j298447R36356J891632J413459l53317l038444o170006r288178
1084E29102554j2009926j4041137j5167160j5262985j4340630j2599487j0426789q309250
1092D26945190o667518n689469n252380m984093m431114l245010j285439J392403M626236
1101D01408806Q227119J1987572J5628891J8749161K0846557K1439324K0238838J7291031
1109E35817299J3025818Q190078L694230M18243r82361k36511K453728O433143J0743485
1118E79557152J4381714J6586151J7040481J5916405J3738785J1146469Q658981O545792
1126F83571930M826126L372726K037507P45239m77143j527404k275315k618637k523651
$$ plain form
1135 685131378 683083878 681747513 681159744 681173248 681539536 682034225 682560349 683174057 684010925 685157852
1145 685157852 686547623 687948990 689053497 689601212 689456558 688594894 687033615 684783707 681866837
1154 681866837 678358765 674359589 669830627 664365082 657080307 646809998 632609444 614339180
1162 614339180 592971306 570371056 548624382 529290924 513049469 499953957 490106850 484248314
1170 484248314 483788414 490177917 503967018 524138451 548153000 572714386 594840355 612687263
1178 612687263 625769653 634604340 640096283 643041153 643932266 643031616 640527496 636636696 631623077
1187 631623077 625785866 619468536 613079262 607068329 601837044 597609978 594346199 591748848 589365692
1196 589365692 586720200 583401794 579088478 573527718 566516457 557909851 547648582 535779533
$$ packed form
1135F85131378k047500j336365n87769J3504L66288M94689N26124O13708Q36868J146927
1145F85157852J389771J401367J104507N47715j44654q61664j561279k249908k916870
1154F81866837l508072l999176m528962n465545p284775j0270309j4200554j8270264
1162F14339180k1367874k2600250k1746674j9333458j6241455j3095512r847107n858536
1170D84248314m59900O389503J3789101K0171433K4014549K4561386K2125969J7846908
1178F12687263J3082390Q834687N491943K944870Q91113r00650k504120l890800n013619
1187F31623077n837211o317330o389274o010933n231285m227066l263779k597351k383156
1196E89365692k645492l318406m313316n560760p011261q606606j0261269j1869049
$$ plain form
1204 535779533 522453079 507903862 492433319 476402664 460227394 444353294 429203262 415099335
1212 415099335 402191887 390419846 379524498 369114189 358763618 348116035 336962433 325269699
1220 325269699 313158207 300843620 288574543 276595192 265146561 254489040 244922085 236772537
1228 236772537 230344696 225845356 223314705 222588234 223306751 224974976 227058048 229095287 230806694
1237 230806694 232168369 233434505 235095329 237771530 242063599 248384132 256816330 267039948
1245 267039948 278355770 289814758 300421524 309354210 316131535 320681763 323303680 324552116
1253 324552116 325098648 325609932 326664238 328704109 332008209 336677551 342630310 349612999 357227783
1262 357227783 364977722 372330055 378787422 383959770 387614975 389692688 390278702 389567223 387848549
$$ packed form
1204E35779533j3326454j4549217j5470543j6030655j6175270j5874100j5150032j4103927
1212D15099335j2907448j1772041j0895348j0410309j0350571j0647583j1153602j1692734
1220C25269699j2111492j2314587j2269077j1979351j1448631j0657521r566955q149548
1228B36772537o427841m499340k530651p26471P18517J668225K083072K037239J711407
1237B30806694J361675J266136J660824K676201M292069O320533Q432198J0223618
1245B67039948J1315822J1458988J0606766Q932686O777325M550228K621917J248436
1253C24552116N46532N11284J054306K039871L304100M669342N952759O982689P614784
1262C57227783P749939P352333O457367N172348L655205K077713N86014p11479j718674
$$ plain form
1271 387848549 385548363 383307190 382033958 382855186 386915970 395065002 407535400 423762398
1279 423762398 442435379 461782379 479984322 495564270 507621536 515858231 520445099 521829872
1287 521829872 520595703 517424850 513144264 508780746 505533905 504623756 507032852 513234291 523018494
1296 523018494 535501862 549327545 562987137 575151024 584896355 591780357 595770836 597092171
1304 597092171 596057472 592939224 587898674 580973892 572119255 561287918 548549156 534221344
1312 534221344 518982315 503914795 490441093 480135078 474432220 474309540 480031166 491049156
1320 491049156 506106987 523517799 541532784 558678246 573965492 586934547 597557907 606079903
1328 606079903 612858124 618255234 622582550 626079216 628906555 631150818 632837486 633957977 634504776
$$ packed form
1271C87848549k300186k241173j273232Q21228M060784Q149032J2470398J6226998
1279D23762398J8672981J9347000J8201943J5579948J2057266Q236695M586868J384773
1287E21829872j234169l170853m280586m363518l246841r10149K409096O201439R784203
1296E23018494J2483368J3825683J3659592J2163887R745331O884002L990479J321335
1304E97092171j034699l118248n040550o924782q854637j0831337j2738762j4327812
1312E34221344j5239029j5067520j3473702j0306015n702858j22680N721626J1017990
1320D91049156J5057831J7410812J8014985J7145462J5287246J2969055J0623360Q521996
1328F06079903O778221N397110M327316L496666K827339K244263J686668J120491N46799
$$ plain form
1337 634504776 634500618 634008598 633117790 631914520 630452156 628742256 626771088 624536781 622087173
1346 622087173 619534836 617038956 614761200 612820282 611269722 610100327 609255676 608629189 608038216
1355 608038216 607191353 605689774 603083038 598969460 593093643 585393753 575992165 565167313 553361359
1364 553361359 541239014 529749222 520100784 513585739 511269455 513658142 520490723 530757866
1372 530757866 542947884 555423241 566789970 576152420 583203888 588166161 591619148 594278374
1380 594278374 596778831 599524956 602647858 606073723 609653664 613281631 616939011 620658569 624454803
1389 624454803 628279877 632037735 635640526 639054680 642304916 645433350 648451920 651318512 653949356
1398 653949356 656249542 658139725 659568939 660521088 661017914 661114349 660876846 660347748 659521484 658356628
$$ packed form
1337F34504776m158m92020q90808j203270j462364j709900j971168k234307k449608
1346F22087173k552337k495880k277756j940918j550560j169395q44651o26487n90973
1355F08038216q46863j501579k606736m113578n875817p699890r401588j0824852j1805954
1364E53361359j2122345j1489792r648438o515045k316284K388687O832581J0267143
1372E30757866J2190018J2475357J1366729R362450P051468M962273L452987K659226
1380E94278374K500457K746125L122902L425865L579941L627967L657380L719558L796234
1389F24454803L825074L757858L602791L414154L250236L128434L018570K866592K630844
1398F53949356K300186J890183J429214R52149M96826R6435k37503n29098q26264j164856
$$ plain form
1408 658356628 656824722 654961472 652870941 650662613 648354568 645814285 642790985 639035072 634431877
1417 634431877 629063911 623158646 616954079 610564728 603917427 596778793 588838577 579800186 569445610
1426 569445610 557673607 544515190 530128441 514769096 498748627 482414818 466184120 450617599
1434 450617599 436473808 424653435 415999413 411014709 409641495 411239662 414799232 419286499
1442 419286499 423946228 428417473 432641449 436661758 440454063 443868141 446664658 448578568 449351845
1451 449351845 448747101 446586266 442837029 437705650 431652336 425272751 419083519 413324814 407908897
1460 407908897 402553520 397032814 391399155 386051941 381629829 378803711 378089981 379771042 383924980
1469 383924980 390507317 399411125 410471497 423429031 437893982 453352432 469222374 484943314
$$ packed form
1408F58356628j531906j863250k090531k208328k308045k540283l023300l755913m603195
1417F34431877n367966n905265o204567o389351o647301p138634p940216r038391j0354576
1426E69445610j1772003j3158417j4386749j5359345j6020469j6333809j6230698j5566521
1434D50617599j4143791j1820373q654022m984704j373214J598167L559570M487267
1442D19286499M659729M471245M223976M020309L792305L414078K796517J913910P73277
1451D49351845o04744k160835l749237n131379o053314o379585o189232n758705n415917
1460D07908897n355377n520706n633659n347214m422112k826118p13730J681061M153938
1469C83924980O582337Q903808J1060372J2957534J4464951J5458450J5869942J5720940
$$ plain form
1477 484943314 500066071 514308243 527555008 539808578 551108780 561464996 570836334 579171257
1485 579171257 586482811 592913475 598740768 604301834 609864540 615496750 621003838 625973587 629932137
1494 629932137 632551727 633816223 634045334 633733940 633251801 632551041 631044807 627753181 621655197
1503 621655197 612059975 598786392 582078629 562375221 540176277 516176224 491613312 468555603
1511 468555603 449803886 438293533 436208687 444245262 461412201 485455742 513637161 543437500
1519 543437500 572889900 600541573 625286484 646316833 663244324 676232529 685939026 693223801
1527 693223801 698792114 703015823 706040573 708056793 709472122 710814743 712420731 714164963 715476913
1536 715476913 715676804 714423752 711974106 709084091 706633453 705218124 704947586 705512924 706416626
$$ packed form
1477D84943314J5122757J4242172J3246765J2253570J1300202J0356216R371338Q334923
1485E79171257P311554O430664N827293N561066N562706N632210N507088M969749L958550
1494F29932137K619590J264496K29111l11394m82139p00760j506234l291626o097984
1503F21655197r595222j3273583j6707763j9703408k2198944k4000053k4562912k3057709
1511D68555603j8751717j1510353k084846Q036575J7166939K4043541K8181419K9800339
1519E43437500K9452400K7651673K4744911K1030349J6927491J2988205R706497P284775
1527F93223801N568313M223709L024750K016220J415329J342621J605988J744232J311950
1536G15476913J99891j253052k449646k890015k450638j415329k70538N65338R03702
$$ plain form
1545 706416626 707198715 707559357 707384338 706732559 705800323 704841309 704018250 703242874 702118378 700076828
1555 700076828 696682739 691940079 686402664 680985870 676561203 673547821 671722488 670339584 668478165
1564 668478165 665432739 660959549 655290756 648938446 642396927 635879822 629196320 621818352 613101120
1573 613101120 602554016 590031662 575764427 560247536 544093094 527961693 512603836 498918610
1581 498918610 487887344 480296021 476336060 475293579 475557785 475015488 471690521 464342575 452764969
1590 452764969 437687302 420376587 402145157 383955612 366231728 348897514 331622505 314216213
1598 314216213 297064934 281429138 269409294 263475475 265663929 276747017 295759773 320139389
1606 320139389 346448860 371382103 392634163 409317627 421848488 431455460 439571800 447330055
$$ packed form
1545G06416626P82089L60642j75019o51779r32236r59014q23059p75376j124496k041550
1555G00076828l394089m742660n537415n416794m424667l013382j825333j382904j861419
1564F68478165l045426m473190n668793o352310o541519o517105o683502p377968q717232
1573F13101120j0547104j2522354j4267235j5516891j6154442j6131401j5357857j3685226
1581D98918610j1031266p591323l959961j042481K64206n42297l324967p347946j1577606
1590D52764969j5077667j7310715j8231430j8189545j7723884j7334214j7275009j7406292
1598C14216213j7151279j5635796j2019844n933819K188454J1083088J9012756K4379616
1606C20139389K6309471K4933243K1252060J6683464J2530861R606972Q116340P758255
$$ plain form
1614 447330055 455267181 463245659 470545959 476083069 478692551 477423935 471772270 461798134 448131142
1623 448131142 431886292 414525566 397670975 382860298 371255417 363378181 358982468 357155724
1631 357155724 356643677 356277008 355321426 353606377 351415787 349231529 347482224 346408958 346074867
1640 346074867 346466751 347608528 349619102 352683830 356949883 362382202 368647156 375098190 380908852
1649 380908852 385325279 387930450 388769684 388243752 386797180 384568138 381203308 375970306 368122711
1658 368122711 357331543 343948784 328970757 313731728 299495506 287142868 277064190 269244957
1666 269244957 263436184 259290981 256412506 254336338 252518673 250389519 247477283 243546677 238670025
1675 238670025 233174496 227476425 221881237 216455345 211044903 205429115 199519043 193479671 187701969
$$ packed form
1614D47330055P937126P978478P300300N537110K609482j268616n651665r974136j3666992
1623D48131142j6244850j7360726j6854591j4810677j1604881p877236m395713j826744
1631C57155724n12047l66669r55582j715049k190590k184258j749305j073266l34091
1640C46074867L91884J141777K010574L064728M266053N432319O264954O451034N810662
1649C80908852M416427K605171Q39234n25932j446572k229042l364830n233002p847595
1658C68122711j0791168j3382759j4978027j5239029j4236222j2352638j0078678p819233
1666B69244957n808773m145203k878475k076168j817665k129154k912236l930606m876652
1675B38670025n495529n698071n595188n425892n410442n615788n910072o039372n777702
$$ plain form
1684 187701969 182645283 178652229 175853271 174212894 173675442 174309731 176359234 180179062 186112518
1693 186112518 194389572 205092525 218180351 233519840 250889149 269955330 290266895 311293983
1701 311293983 332519035 353536301 374111862 394181023 413788948 433012924 451894836 470399323
1709 470399323 488398972 505683327 521999893 537126503 550962677 563601112 575335159 586573372
1717 586573372 597685089 608840141 619921646 630574570 640374603 649041748 656583710 663281555
1725 663281555 669514389 675513840 681197739 686193848 690061951 692596207 694023514 694967499 696177216
1734 696177216 698173370 701016541 704331284 707565536 710319748 712544403 714501266 716535873 718825989
1743 718825989 721266937 723552017 725378876 726637268 727469254 728182907 729089661 730369492 732020798
$$ packed form
1684A87701969n056686l993054k798958j640377n37452O34289K049503L819828N933456
1693A86112518Q277054J0702953J3087826J5339489J7369309J9066181K0311565K1027088
1701C11293983K1225052K1017266K0575561K0069161J9607925J9223976J8881912J8504487
1709D70399323J7999649J7284355J6316566J5126610J3836174J2638435J1734047J1238213
1717E86573372J1111717J1155052J1081505J0652924R800033Q667145P541962O697845
1725F63281555O232834N999451N683899M996109L868103K534256J427307R43985J209717
1734F96177216J996154K843171L314743L234252K754212K224655J956863K034607K290116
1743G18825989K440948K285080J826859J258392Q31986P13653R06754J279831J651306
$$ plain form
1752 732020798 733902130 735812912 737571945 739061203 740242081 741149750 741874313 742537231 743260880
1761 743260880 744143066 745233612 746516418 747893906 749185867 750162888 750622177 750491180 749900818
1770 749900818 749176712 748725128 748858109 749654388 750932083 752355804 753605804 754512787 755086441
1779 755086441 755446701 755727997 756028519 756419067 756964569 757710190 758619385 759522705 760149231 760256958
1789 760256958 759795990 758990707 758263168 758024292 758454819 759409485 760508118 761351166 761727982 761700287
1799 761700287 761529541 761512985 761831512 762486115 763328781 764150391 764770813 765100555 765161057 765067520
1809 765067520 764978409 765026321 765260391 765630569 766027832 766356430 766588821 766764908 766942291 767138519
1819 767138519 767315063 767415543 767418518 767353821 767265396 767151489 766948700 766584091 766064987 765528259 765192490
$$ packed form
1752G32020798J881332J910782J759033J489258J180878R07669P24563O62918P23649
1761G43260880Q82186J090546J282806J377488J291961R77021M59289j30997n90362
1770G49900818p24106m51584J32981P96279J277695J423721J250000R06983N73654
1779G55086441L60260K81296L00522L90548N45502P45621R09195R03320O26526J07727
1789G60256958m60968q05283p27539k38876M30527R54666J098633Q43048L76816k7695
1799G61700287j70746j6556L18527O54603Q42666Q21610O20422L29742O0502r3537
1809G65067520q9111M7912K34070L70178L97263L28598K32391J76087J77383J96228
1819G67138519J76544J00480K975o4697q8425j13907k02789l64609n19104n36728l35769
$$ plain form
1830 765192490 765236588 765686417 766402206 767178421 767881088 768516846 769173126 769882889 770521927 770841599
1840 770841599 770623474 769853745 768786163 767837601 767375870 767533875 768163528 768944473 769566498 769873505
1850 769873505 769894028 769770355 769650040 769611893 769650726 769712830 769741135 769711151 769639664 769573212 769556274
1861 769556274 769593353 769622421 769524460 769178772 768538132 767681503 766798706 766106186 765737610 765675354 765769348
1872 765769348 765825577 765712433 765414200 765009232 764598083 764239273 763932343 763647690 763366470 763095016
1882 763095016 762844925 762604294 762332916 761989975 761574402 761142273 760779648 760550156 760450439 760412674
1892 760412674 760351562 760226974 760077744 760005188 760118027 760474243 761058426 761800232 762614365 763431396
1902 763431396 764201126 764877930 765413055 765770874 765961075 766059189 766186523 766451263 766880035 767388306
$$ packed form
1830G65192490M4098M49829P15789P76215P02667O35758O56280P09763O39038L19672
1840G70841599k18125p69729j067582r48562m61731J58005O29653P80945O22025L07007
1850G69873505K0523j23673j20315l8147L8833O2104K8305k9984p1487o6452j6938
1861G69556274L7079K9068r7961l45688o40640q56629q82797o92520l68576o2256R3994
1872G65769348N6229j13144k98233m04968m11149l58810l06930k84653k81220k71454
1882G63095016k50091k40631k71378l42941m15573m32129l62625k29492r9717l7765
1892G60412674o1112j24588j49230p2556J12839L56216N84183P41806Q14133Q17031
1902G63431396P69730O76804N35125L57819J90201R8114J27334K64740M28772N08271
$$ plain form
1912 767388306 767814560 768004532 767896500 767555923 767139053 766808929 766656876 766674042 766780396 766885910
1922 766885910 766939240 766938858 766911392 766878586 766841888 766788406 766708069 766605453 766500702 766418381 766378708 766389389
1934 766389389 766441956 766509933 766550064 766514587 766373672 766137619 765863342 765634918 765524368 765554962 765688782
1945 765688782 765847321 765954285 765972672 765917130 765837708 765785599 765786057 765828705 765878448 765894547 765850983 765746918
1957 765746918 765606003 765466919 765367508 765328827 765346985 765395660 765440369 765456314 765439148 765403671 765373535
1968 765373535 765366974 765392380 765449982 765538406 765655823 765796738 765946884 766082611 766177368 766213684 766191406
1979 766191406 766129990 766062851 766026993 766051636 766147995 766300888 766467056 766585464 766599426 766483612 766261368
1990 766261368 766001053 765788269 765689621 765722809 765853424 766013412 766133881 766169052 766106033 765958099 765752335
$$ packed form
1912G67388306M26254J89972j08032l40577m16870l30124j52053J7166J06354J05514
1922G66885910N3330l82k7466l2806l6698n3482q0337j02616j04751q2321l9673J0681
1934G66389389N2567O7977M0131l5477j40915k36053k74277k28424j10550L0594J33820
1945G65688782J58539J06964J8387n5542p9422n2109M58M2648M9743J6099m3564j04065
1957G65746918j40915j39084r9411l8681J8158M8675M4709J5945j7166l5477l0136
1968G65373535o561K5406N7602Q8424J17417J40915J50146J35727R4757L6316k2278
1979G66191406o1416o7139l5858K4643R6359J52893J66168J18408J3962j15814k22244
1990G66261368k60315k12784r8648L3188J30615J59988J20469L5171o3019j47934k05764
$$ plain form
2001 765752335 765519791 765290146 765089645 764934692 764828568 764756393 764690018 764594879 764442215 764215164
2011 764215164 763913498 763553009 763164444 762786865 762459564 762209396 762040253 761929932 761839828 761732254
2021 761732254 761589279 761421356 761262589 761155319 761129227 761188965 761309204 761443329 761538696 761552963 761467819
2032 761467819 761293945 761066360 760831604 760631943 760492477 760415878 760386200 760377045 760361023 760316086 760228882
2043 760228882 760095673 759924622 759735565 759556656 759417191 759336777 759314957 759327316 759332504 759286346 759160004
2054 759160004 758951569 758689041 758419647 758192825 758042603 757977219 757979202 758015289 758049545 758054123 758016510
2065 758016510 757940140 757841263 757745361 757680435 757669754 757723999 757834015 757971573 758096848 758171310 758171616 758099289
2077 758099289 757979889 757854233 757765121 757743759 757800827 757923508 758080063 758229294 758334274 758372726 758343658
$$ packed form
2001G65752335k32544k29645k00501j54953j06124p2175o6375r5139j52664k27051
2011G64215164l01666l60489l88565l77579l27301k50168j69143j10321r0104j07574
2021G61732254j42975j67923j58767j07270k6092N9738J20239J34125R5367J4267q5144
2032G61467819j73874k27585k34756j99661j39466p6599k9678r155j6022m4937q7204
2043G60228882j33209j71051j89057j78909j39465q0414k1820J2359N188m6158j26342
2054G59160004k08435k62528k69394k26822j50222o5384J983L6087L4256M578l7613
2065G58016510p6370r8877r5902o4926j0681N4245J10016J37558J25275P4462L06p2327
2077G58099289j19400j25656q9112k1362N7068J22681J56555J49231J04980L8452k9068
$$ plain form
2088 758343658 758266525 758171234 758087845 758036957 758025284 758047485 758090286 758137360 758173218 758186569 758172531 758135452
2100 758135452 758088303 758048782 758034134 758053207 758103943 758175201 758251343 758318939 758370361 758404236 758424072 758435059
2112 758435059 758442688 758451538 758464050 758479996 758496170 758508072 758511734 758505859 758492355 758473892 758451385 758421021 758375778
2125 758375778 758309708 758221893 758119354 758015594 757924652 757856216 757811584 757784042 757762375 757735977 757697220
2136 757697220 757643890 757577820 757504807 757433853 757376709 757346725 757354813 757406311 757496719 757611542 757728119 757822876
2148 757822876 757878494 757891006 757872391 757847214 757844696 757887039 757981491 758116302 758265915 758399734 758493729
2159 758493729 758537750 758537369 758511581 758485260 758483047 758521957 758607407 758731155 758871231 758997421 759080811 759102631
2171 759102631 759063187 758982849 758896027 758839188 758839035 758901825 759012222 759137802 759240112 759287338 759264755 759179535
$$ packed form
2088G58343658p7133r5291q3389n0888j1673K2201M2801M7074L5858J3351j4038l7079
2100G58135452m7149l9521j4648J9073N0736P1258P6142O7596N1422L3875J9836J0987
2112G58435059P629Q850J2512J5946J6174J1902L662n875j3504j8463k2507l0364m5243
2125G58375778o6070q7815j02539j03760r0942o8436m4632k7542k1667k6398l8757
2136G57697220n3330o6070p3013p0954n7144k9984Q088N1498R0408J14823J16577R4757
2148G57822876N5618J2512j8615k5177k518M2343R4452J34811J49613J33819R3995
2159G58493729M4021l81k5788k6321k213L8910Q5450J23748J40076J26190Q3390K1820
2171G59102631l9444q0338q6822n6839j53O2790J10397J25580J02310M7226k2583q5220
$$ plain form
2183 759179535 759058228 758938828 758858719 758842316 758893890 758996735 759117279 759216080 759260254 759234238 759145508
2194 759145508 759023666 758910751 758846893 758856506 758938065 759065552 759195404 759282379 759292297 759212341 759053421
2205 759053421 758847122 758636017 758463669 758360596 758335114 758369370 758424759 758454132 758420029 758306427 758124847
2216 758124847 757908783 757700500 757536545 757436447 757399445 757405090 757420197 757407684 757336502 757191238 756978683
2227 756978683 756728973 756487198 756300583 756201706 756196289 756260834 756350708 756415863 756417542 756341553 756200790
2238 756200790 756029205 755870285 755762711 755729370 755771484 755868378 755983276 756072311 756096802 756034775 755889587
2249 755889587 755689545 755480957 755312271 755217819 755205002 755251465 755313721 755342636 755299911 755169678 754962463
2260 754962463 754710007 754455338 754239426 754090271 754013672 753991699 753986893 753953781 753854599 753672333 753417740
$$ packed form
2183G59179535j21307j19400q0109j6403N1574J02845J20544R8801M4174k6016q8730
2194G59145508j21842j12915o3858R613Q1559J27487J29852Q6975R918p9956j58920
2205G59053421k06299k11105j72348j03073k5482L4256N5389K9373l4103j13602j81580
2216G58124847k16064k08283j63955j00098l7002N645J5107j2513p1182j45264k12555
2227G56978683k49710k41775j86615r8877n417O4545Q9874O5155J679p5989j40763
2238G56200790j71585j58920j07574l3341M2114R6894J14898Q9035K4491o2027j45188
2249G55889587k00042k08588j68686r4452j2817M6463O2256K8915m2725j30233k07215
2260G54962463k52456k54669k15912j49155p6599k1973m806l3112r9182j82266k54593
$$ plain form
2271 753417740 753126831 752849121 752632446 752509003 752488708 752560196 752697372 752867508 753036118 753172531
2281 753172531 753251953 753260651 753199768 753087997 752955322 752831039 752729874 752642822 752540970 752388611 752161560
2292 752161560 751858826 751501999 751125107 750759659 750425797 750129242 749863892 749614334 749358749 749069824
2302 749069824 748719330 748285980 747761078 747150345 746471405 745749512 745017624 744315872 743687744 743166504
2312 743166504 742753448 742399826 742007294 741453323 740637665 739527206 738178635 736726837 735339813
2321 735339813 734158249 733242645 732549057 731945877 731271133 730407867 729343643 728180161 727081909
2330 727081909 726187363 725533295 725042343 724580002 724040756 723397141 722669449 721845627 720827026 719480667
2340 719480667 717793732 716040573 714815521 714852600 716680756 720287781 724998169 729662857 733084946
$$ packed form
2271G53417740k90909k77710k16675j23443k0295P1488J37176J70136J68610J36413
2281G53172531P9422Q698o0883j11771j32675j24283j01165q7052j01852j52359k27051
2292G52161560l02734l56827l76892l65448l33862k96555k65350k49558k55585k88925
2302G49069824l50494m33350n24902o10733o78940p21893p31888p01752o28128n21240
2312G43166504m13056l53622l92532n53971q15658j110459j348571j451798j387024
2321G35339813j181564r15604o93588o03180o74744q63266j064224j163482j098252
2330G27081909q94546o54068m90952m62341n39246o43615p27692q23822j018601j346359
2340G19480667j686935j753159j225052L7079J828156L607025M710388M664688L422089
$$ plain form
2349 733084946 734469299 733670425 731138229 727627029 723855133 720285645 717101746 714319611 711923676
2358 711923676 709933319 708387375 707295151 706612625 706263428 706182861 706347275 706767960 707463684 708434296
2368 708434296 709654770 711087112 712693329 714442062 716306229 718263474 720298996 722411346 724607315
2377 724607315 726887360 729227066 731566772 733820419 735894547 737710190 739215775 740389252 741234055 741775742
2387 741775742 742060928 742154083 742129364 742057800 741993637 741965714 741975632 742004471 742020798 741992569 741896744 741727142
2399 741727142 741499023 741244125 741001205 740801926 740660400 740568848 740501785 740426025 740310669 740137939
2409 740137939 739907227 739636002 739354706 739096756 738887863 738735580 738628387 738539276 738436508 738293076
2419 738293076 738093719 737835846 737527847 737187119 736835022 736494446 736182785 735905380 735652161 735399857
$$ packed form
2349G33084946J384353p98874k532196l511200l771896l569488l183899k782135k395935
2358G11923676j990357j545944j092224o82526l49197q0567J64414M20685O95724R70612
2368G08434296J220474J432342J606217J748733J864167J957245K035522K112350K195969
2377G24607315K280045K339706TK253647K074128J815643J505585J173477Q44803N41687
2387G41775742K85186R3155k4719p1564o4163k7923R918K8839J6327k8229r5825j69602
2399G41727142k28119k54898k42920j99279j41526r1552o7063p5760j15356j72730
2409G40137939k30712k71225k81296k57950k08893j52283j07193q9111j02768j43432
2419G38293076j99357k57873l07999l40728l52097l40576l11661k77405k53219k52304
$$ plain form
2429 735399857 735119247 734786377 734393463 733950577 733482437 733019180 732586823 732201462 731868134 731583176
2439 731583176 731338196 731123199 730928650 730747223 730575409 730416031 730276260 730165634 730089951 730045624
2449 730045624 730018997 729990158 729940414 729859467 729748917 729617844 729477921 729336853 729196091 729053345 728904724
2460 728904724 728747101 728578339 728395157 728194504 727975235 727740707 727500610 727267227 727050247 726852112
2470 726852112 726665878 726479263 726280518 726066513 725844879 725632172 725448227 725309067 725221710 725184784
2480 725184784 725189438 725224228 725278168 725343246 725414429 725490265 725574341 725673981 725797195 725948334 726123734
2491 726123734 726310196 726488647 726640930 726758041 726842880 726909027 726974030 727053680 727156601 727284241 727431793
2502 727431793 727589111 727742691 727878265 727984009 728054962 728095551 728118591 728139648 728170547 728214340 728264160
$$ packed form
2429G35399857k80610l32870l92914m42886m68140m63257m32357l85361l33328k84958
2439G31583176k44980k14997j94549j81427j71814j59378j39771j10626p5683m4327
2449G30045624k6627k8839m9744q0947j10550j31073j39923j41068j40762j42746j48621
2460G28904724j57623j68762j83182k00653k19269k34528k40097k33383k16980j98135
2470G26852112j86234j86615j98745k14005k21634k12707j83945j39160q7357l6926
2480G25184784M654L4790N3940O5078P1183P5836Q4076R9640J23214J51139J75400
2491G26123734J86462J78451J52283J17111Q4839O6147O5003P9650J02921J27640J47552
2502G27431793J57318J53580J35574J05744P0953M0589K3040K1057L0899M3793M9820
$$ plain form
2513 728264160 728307114 728329544 728322678 728284073 728218155 728133850 728042908 727957764 727888565 727841110 727813416 727795868
2525 727795868 727773132 727728653 727650681 727536697 727394485 727238693 727085266 726943817 726814575 726688080
2535 726688080 726548767 726381378 726175919 725931244 725654984 725361481 725066986 724785843 724526291 724289169
2545 724289169 724068222 723853378 723634262 723402939 723155289 722890549 722609406 722313309 722002945 721678314
2555 721678314 721337204 720975418 720586777 720165710 719710007 719224014 718718185 718206329 717700882 717210388
2565 717210388 716737823 716283569 715847321 715429230 715029449 714647598 714283447 713939896 713624573 713349609
2575 713349609 713126831 712962265 712852173 712783813 712741241 712711716 712690125 712678223 712681503 712703400 712743607
2586 712743607 712797699 712858734 712918320 712967987 713000107 713011169 713001938 712980347 712956848 712939529 712929382 712920303
$$ packed form
2513G28264160M2954K2430o866l8605o5918q4305r0942q5144o9199m7455k7694j7548
2525G27795868k2736m4479p7972j13984j42212j55792j53427j41449j29242j26495
2535G26688080j39313j67389k05459k44675k76260k93503k94495k81143k59552k37122
2545G24289169k20947k14844k19116k31323k47650k64740k81143k96097l10364l24631
2555G21678314l41110l61786l88641m21067m55703m85993n05829n11856n05447m90494
2565G17210388m72565m54254m36248m18091l99781l81851l64151l43551l15323k74964
2575G13349609k22778j64566j10092o8360m2572k9525k1591j1902L280K1897M0207
2586G12743607N4092O1035N9586M9667L2120J1062r231k1591k3499j7319j0147r079
$$ plain form
2598 712920303 712902985 712871017 712826462 712778702 712739792 712718811 712717209 712731934 712758713 712796021 712845612 712909317
2610 712909317 712986908 713076019 713173828 713280258 713399353 713536224 713693771 713868484 714051514 714231567
2620 714231567 714398575 714546204 714673157 714782410 714880981 714978409 715084763 715207062 715345001 715489426
2630 715489426 715624237 715729980 715791702 715803223 715768051 715696564 715601654 715493011 715374374 715242081 715085983
2641 715085983 714892883 714650040 714350433 713994217 713591385 713159256 712717438 712283020 711864471 711459579
2651 711459579 711056213 710636597 710184479 709691467 709161148 708608780 708057785 707532501 707053223 706630859
2661 706630859 706266022 705949249 705664139 705392456 705119705 704841690 704565201 704306870 704085464 703912201
2671 703912201 703785858 703691635 703605804 703505630 703374710 703205719 702999191 702760696 702498016 702220840
$$ packed form
2598G12920303j7318l1968m4555m7760l8910k0981j602J4725K6779L7308M9591O3705
2610G12909317P7591Q9111R7809J06430J19095J36871J57547J74713J83030J80053
2620G14231567J67008J47629J26953J09253R8571R7428J06354J22299J37939J44425
2630G15489426J34811J05743O1722J1521l5172p1487r4910j08643j18637j32293j56098
2641G15085983j93100k42843k99607l56216m02832m32129m41818m34418m18549m04892
2651G11459579m03366m19616m52118m93012n30319n52368n50995n25284m79278m22364
2661G06630859l64837l16773k85110k71683k72751k78015k76489k58331k21406j73263
2671G03912201j26343r4223q5831j00174j30920j68991k06528k38495k62680k77176
$$ plain form
2681 702220840 701937790 701655121 701373138 701085129 700779572 700444565 700074615 699672165 699245987 698807373
2691 698807373 698366013 697929459 697506104 697106628 696743698 696427536 696159592 695932159 695729218 695536652
2701 695536652 695349274 695174713 695029373 694930725 694888306 694900742 694956665 695041046 695140381 695245285 695351028
2712 695351028 695454712 695555038 695651016 695742874 695830917 695915604 695994339 696062469 696112823 696137390 696130066 696087189
2724 696087189 696009216 695902405 695776978 695645752 695520935 695410309 695315170 695231247 695152130 695073013 694992447 694913330
2736 694913330 694839401 694774017 694719696 694679413 694656677 694655304 694677048 694718170 694768829 694815140 694844055 694846497
2748 694846497 694820633 694770584 694702911 694623947 694538422 694447632 694351654 694248962 694137497 694014435 693876877
2759 693876877 693723068 693554382 693375015 693193436 693018036 692855530 692707214 692567825 692426758 692270813
$$ packed form
2681G02220840k83050k82669k81983k88009l05557l35007l69950m02450m26178m38614
2691F98807373m41360m36554m23355l99476l62930l16162k67944k27433k02941j92566
2701F95536652j87378j74561j45340r8648m2419J2436N5923Q4381R9335J04904J05743
2712F95351028J03684J00326R5978R1858Q8043Q4687P8735O8130N0354K4567p324m2877
2724F96087189p7973j06811j25427j31226j24817j10626r5139q3923p9117Tq0566p9117
2736F94913330p3929o5384n4321m0283k2736j373K1744M1122N0659M6311K8915K442
2748F94846497k5864n0049o7673p8964q5525r0790r5978j02692j11465j23062j37558
2759F93876877j53809j68686j79367j81579j75400j62506j48316j39389j41067j55945
$$ plain form
2769 692270813 692087173 691865616 691601639 691294708 690949326 690572739 690172806 689755859 689322662 688869324
2779 688869324 688386154 687861404 687286072 686655655 685972672 685246506 684491882 683726578 682969131 682234344
2789 682234344 681531754 680863190 680221558 679595718 678973999 678348083 677716064 677080994 676448975 675826416
2799 675826416 675217743 674626083 674051361 673491211 672941360 672396011 671851196 671307373 670771942 670259018
2809 670259018 669786301 669370117 669020844 668740234 668520584 668347473 668204727 668077850 667959213 667849731
2819 667849731 667759171 667702560 667693787 667739792 667836151 667967834 668114319 668255386 668377838 668478012 668559494
2830 668559494 668630600 668700256 668776093 668862610 668960419 669064865 669164734 669244690 669287643 669280777 669217300 669098206
2842 669098206 668928757 668716431 668466110 668181000 667862167 667510986 667128448 666717834 666282959 665828247
$$ packed form
2769F92270813j83640k21557k63977l06931l45382l76587l99933m16947m33197m53338
2779F88869324m83170n24750n75332o30417o82983p26166p54624p65304p57447p34787
2789F82234344p02590o68564o41632o25840o21719o25916o32019o35070o32019o22559
2799F75826416o08673n91660n74722n60150n49851n45349n44815n43823n35431n12924
2809F70259018m72717m16184l49273k80610k19650j73111j42746j26877j18637j09482
2819F67849731r0560n6611q773M6005R6359J31683J46485J41067J22452J00174Q1482
2830F68559494P1106O9656P5837Q6517R7809J04446R9869P9956M2953o866o3477j19094
2842F69098206j69449k12326k50321k85110l18833l51181l82538m10614m34875m54712
$$ plain form
2852 665828247 665357513 664871750 664366608 663831863 663254013 662620010 661921768 661157990 660332565 659451599
2862 659451599 658520126 657544403 656534958 655511169 654503555 653549271 652684326 651933975 651307068
2871 651307068 650791702 650358887 649968414 649578247 649152527 648667984 648116455 647503815 646846161 646165009
2881 646165009 645482635 644818192 644184265 643583832 643010101 642447891 641878281 641285172 640659485 639998245
2891 639998245 639301147 638564529 637777557 636923752 635987053 634960747 633853874 632695427 631531487
2900 631531487 630417976 629411507 628557739 627883263 627391014 627060394 626853561 626721573 626613083 626479492
2910 626479492 626280060 625984955 625578880 625062180 624448891 623762131 623026733 622263756 621487122 620705948
2920 620705948 619927597 619160690 618415909 617704086 617034874 616415253 615849838 615340157 614881210 614457855
$$ packed form
2852F65828247m70734m85763n05142n34745n77850o34003o98242p63778q25425q80966
2862F59451599r31473r75723j009445j023789j007614r54284q64945p50351o26907
2871F51307068n15366m32815l90473l90167m25720m84543n51529o12640o57654o81152
2881F46165009o82374o64443o33927o00433n73731n62210n69610n93109o25687o61240
2891F39998245o97098p36618p86972q53805r36699j026306j106873j158447j163940
2900F31531487j113511j006469q53768o74476m92249l30620k06833j31988j08490j33591
2910F26479492j99432k95105m06075n16700o13289o86760p35398p62977p76634p81174
2920F20705948p78351p66907p44781p11823o69212o19621n65415n09681m58947m23355
$$ plain form
2930 614457855 614040642 613590965 613071251 612463417 611785736 611098747 610496941 610083542 609939766 610095291
2940 610095291 610517311 611116295 611769981 612354927 612772522 612965202 612917900 612650108 612201881 611620026
2950 611620026 610947800 610217628 609448624 608646469 607807388 606923637 605989876 605007706 603988075 602949066
2960 602949066 601912918 600900230 599927864 599004364 598129272 597291679 596469345 595629501 594729729 593721161
2970 593721161 592554092 591182175 589572220 587714767 585637856 583419952 581193962 579137650 577444496
2979 577444496 576282883 575753136 575859718 576509132 577535133 578743782 579962349 581077042 582050591
2988 582050591 582918396 583766708 584701233 585814247 587156563 588722115 590448685 592233124 593955879
2997 593955879 595507431 596807709 597812729 598511009 598913345 599040489 598915176 598556824 597981720
$$ packed form
2930F14457855m17213m49677n19714o07834o77681o86989o01806m13399j43776J55525
2940F10095291M22020N98984O53686N84946M17595J92680m7302k67792m48227n81855
2950F11620026o72226p30172p69004q02155q39081q83751r33761r82170j019631j039009
2960F02949066j036148j012688r72366r23500q75092q37593q22334q39844q99772j008568
2970E93721161j167069j371917j609955j857453k076911k217904k225990k056312j693154
2979E77444496j161613n29747J06582O49414J026001J208649J218567J114693R73549
2988E82050591Q67805Q48312R34525J113014J342316J565552J726570J784439J722755
2997E93955879J551552J300278J005020O98280M02336J27144j25313l58352n75104
$$ plain form
3006 597981720 597205200 596244659 595122375 593867073 592512321 591094475 589649124 588207512 586794815
3015 586794815 585426826 584109993 582841148 581614189 580429192 579304276 578283348 577436790 576849556
3024 576849556 576600609 576740875 577274246 578150673 579269295 580495720 581683388 582699547 583445702
3033 583445702 583870010 583967590 583771706 583336220 582720833 581978683 581153755 580282402 579398003 578532410
3043 578532410 577716980 576976471 576324539 575758057 575254021 574771614 574258957 573664093 572946625 572086029
3053 572086029 571082954 569953766 568720131 567401466 566010551 564556465 563050385 561509514 559958496
3062 559958496 558425522 556935692 555505066 554137459 552824936 551550560 550295258 549041634 547778702
3071 547778702 546502571 545215149 543920326 542620506 541316071 540004501 538680649 537336502 535959435
$$ packed form
3006E97981720p76520r60541j122284j255302j354752j417846j445351j441612j412697
3015E86794815j367989j316833j268845j226959j184997j124916j020928q46558n87234
3024E76849556k48947J40266N33371Q76427J118622J226425J187668J016159P46155
3033E83445702M24308R7580j95884m35486o15387p42150q24928q71353q84399q65593
3043E78532410q15430p40509o51932n66482n04036m82407n12657n94864p17468q60596
3053E72086029j003075j129188j233635j318665j390915j454086j506080j540871j551018
3062E59958496j532974j489830j430626j367607j312523j274376j255302j253624j262932
3071E47778702j276131j287422j294823j299820j304435j311570j323852j344147j377067
$$ plain form
3080 535959435 534530640 533027000 531426735 529714508 527888565 525959015 523943138 521857567 519712334
3089 519712334 517510986 515255127 512950211 510607262 508241882 505868530 503497620 501136551 498795929
3098 498795929 496496010 494269714 492160034 490210762 488457069 486917915 485593224 484467468 483514977
3107 483514977 482707214 482016525 481417885 480886993 480397453 479919167 479419785 478868828 478243713 477535095
3117 477535095 476749382 475907173 475040207 474185753 473381844 472662430 472052879 471564674 471194572 470926552
3127 470926552 470738258 470610809 470537376 470526886 470601044 470785942 471100731 471549568 472118912 472781105
3137 472781105 473502693 474252701 475009956 475763741 476513748 477265968 478028603 478809929 479615059 480443382
3147 480443382 481285629 482124405 482935753 483695221 484384537 484995766 485531731 486001434 486415138 486778564
$$ packed form
3080E35959435j428795j503640j600265j712227j825943j929550k015877k085571k145233
3089E19712334k201348k255859k304916k342949k365380k373352k370910k361069k340622
3098D98795929k299919k226296k109680j949272j753693j539154j324691j125756r52491
3107D83514977q07763o90689n98640n30892m89540m78286m99382n50957o25115p08618
3117D77535095p85713q42209q66966q54454q03909p19414o09551m88205l70102k68020
3127D70926552j88294j27449p3433j0490P4158J84898L14789M48837N69344O62193
3137D72781105P21588P50008P57255P53785P50007P52220P62635P81326Q05130Q28323
3147D80443382Q42247Q38776Q11348P59468O89316O11229N35965M69703M13704L63426
$$ plain form
3157 486778564 487092705 487356606 487568893 487730484 487841835 487900696 487900200 487831345 487687416 487469254 487187691
3168 487187691 486860046 486503220 486125832 485724754 485288925 484808235 484282303 483724670 483158112 482606049
3178 482606049 482082672 481589737 481119080 480661125 480210838 479768524 479336739 478914375 478494339 478063469
3188 478063469 477605896 477105560 476548729 475923958 475224152 474448700 473605118 472708664 471779480 470837936
3198 470837936 469901390 468982506 468088608 467221146 466374741 465537071 464689522 463812103 462887115 461902962
3208 461902962 460853729 459738197 458557434 457315216 456019592 454683380 453322525 451952629 450585785
3217 450585785 449229622 447889862 446572342 445283165 444026146 442799683 441596260 440405464 439220581
3226 439220581 438042526 436880264 435744743 434641800 433567314 432508392 431449127 430378418 429294777
$$ packed form
3157D86778564L14141K63901K12287J61591J11351N8861m96o8855j43929k18162k81563
3168D87187691l27645l56826l77388m01078m35829m80690n25932n57633n66558n52063
3178D82606049n23377m92935m70657m57955m50287m42314m31785m22364m20036m30870
3188D78063469m57573n00336n56831o24771o99806p75452q43582q96454r29184r41544
3198D70837936r36546r18884q93898q67462q46405q37670q47549q77419r24988r84153
3208D61902962j049233j115532j180763j242218j295624j336212j360855j369896j366844
3217D50585785j356163j339760j317520j289177j257019j226463j203423j190796j184883
3226D39220581j178055j162262j135521j102943j074486j058922j059265j070709j083641
$$ plain form
3235 429294777 428206139 427124176 426058273 425011215 423978615 422952995 421927986 420900879 419872055
3244 419872055 418841133 417803764 416749840 415666084 414538765 413358040 412119598 410823250 409470749
3253 409470749 408061867 406594009 405061150 403455353 401767960 399991722 398120461 396150169 394078522
3262 394078522 391906090 389636459 387278252 384843788 382349434 379813194 377252884 374686432 372132950
3271 372132950 369613800 367153091 364774590 362497330 360332222 358281364 356340332 354504509 352772827
3280 352772827 351149864 349643936 348262672 347011681 345893898 344913750 344080505 343409081 342917595
3289 342917595 342621651 342528267 342633591 342924843 343385620 344001465 344762039 345660973 346690063 347834969
3299 347834969 349073448 350374985 351704178 353024826 354302826 355512428 356638718 357680931 358651390
$$ packed form
3235D29294777j088638j081963j065903j047058j032600j025620j025009j027107j028824
3244D19872055j030922j037369j053924j083756j127319j180725j238442j296348j352501
3253D09470749j408882j467858j532859j605797j687393j776238j871261j970292k071647
3262C94078522k172432k269631k358207k434464k494354k536240k560310k566452k553482
3271C72132950k519150k460709k378501k277260k165108k050858j941032j835823j731682
3280C52772827j622963j505928j381264j250991j117783r80148q33245o71424m91486
3289C42917595k95944r3384J05324K91252M60777O15845P60574Q98934J029090J144906
3299C47834969J238479J301537J329193J320648J278000J209602J126290J042213R70459
$$ plain form
3308 358651390 359570961 360462189 361342201 362221413 363104897 363996620 364902039 365826912 366773491 367737770
3318 367737770 368711319 369684219 370651016 371612549 372572441 373532600 374489174 375431824 376345634 377215652
3328 377215652 378028603 378774147 379444771 380037498 380554543 381004448 381399994 381754684 382078705 382376442
3338 382376442 382647743 382890091 383103867 383294373 383471947 383649635 383839455 384048882 384279366 384528122
3348 384528122 384791107 385067406 385361824 385684624 386049118 386467056 386945229 387482643 388071289 388697891
3358 388697891 389347534 390008507 390675011 391348839 392037392 392749825 393492622 394267540 395071487 395897713
3368 395897713 396738167 397584076 398426437 399257164 400072823 400876846 401679955 402495499 403333244 404192657
3378 404192657 405063286 405930290 406783142 407621269 408455086 409298859 410162582 411047211 411945152 412845345
$$ packed form
3308C58651390R19571Q91228Q80012Q79212Q83484Q91723R05419R24873R46579R64279
3318C67737770R73549R72900R66797R61533R59892R60159R56574R42650R13810Q70018
3328C77215652Q12951P45544O70624N92727N17045M49905L95546L54690L24021K97737
3338C82376442K71301K42348K13776J90506J77574J77688J89820K09427K30484K48756
3348C84528122K62985K76299K94418L22800L64494M17938M78173N37414N88646O26602
3358C88697891O49643O60973O66504O73828O88553P12433P42797P74918Q03947Q26226
3368C95897713Q40454Q45909Q42361Q30727Q15659Q04023Q03109Q15544Q37745Q59413
3378D04192657Q70629Q67004Q52852Q38127Q33817Q43773Q63723Q84629Q97941R00193
$$ plain form
3388 412845345 413740425 414629059 415517235 416412811 417323151 418251572 419198151 420161018 421137428 422124786
3398 422124786 423120537 424120483 425120430 426116867 427107811 428093300 429073792 430048752 431016006 431973419
3408 431973419 432923317 433873940 434837265 435823097 436830406 437844048 438839111 439793243 440699463 441573067
3418 441573067 442447662 443360672 444338417 445386162 446488876 447620430 448756485 449881859 450992775
3427 450992775 452093544 453191414 454293900 455406532 456531982 457669449 458813210 459955444 461089592
3436 461089592 462214622 463335724 464458618 465582581 466695709 467778854 468817177 469814568 470798302
3445 470798302 471811447 472893753 474061508 475299644 476569748 477829132 479049339 480224495 481363182
3454 481363182 482476540 483567390 484630394 485659866 486658897 487641487 488626976 489630547 490656242
$$ packed form
3388D12845345Q95080Q88634Q88176Q95576R10340R28421R46579R62867R76410R87358
3398D22124786R95751R99946R99947R96437R90944R85489R80492R74960R67254R57413
3408D31973419R49898R50623R63325R85832J007309J013642R95063R54132R06220Q73604
3418D41573067Q74595R13010R77745J047745J102714J131554J136055J125374J110916
3427D50992775J100769J097870J102486J112632J125450J137467J143761J142234J134148
3436D61089592J125030J121102J122894J123963J113128J083145J038323R97391R83734
3445D70798302J013145J082306J167755J238136J270104J259384J220207J175156J138687
3454D81363182J113358J090850J063004J029472R99031R82590R85489J003571J025695
$$ plain form
3463 490656242 491694908 492728043 493732643 494686852 495573654 496387024 497135353 497843513 498545151
3472 498545151 499269638 500026817 500799484 501549187 502233963 502830162 503343697 503806381 504256134 504714584
3482 504714584 505176544 505615883 506005783 506336517 506619682 506875725 507114449 507323494 507476692 507554855
3492 507554855 507563629 507532921 507495499 507459602 507399139 507270546 507048454 506754532 506457481 506240463 506157341
3503 506157341 506207390 506347198 506530571 506748848 507044868 507489433 508140221 509009285 510058899 511225204
3513 511225204 512449608 513698387 514960861 516236343 517519875 518800774 520066948 521311569 522532349
3522 522532349 523729477 524905052 526068993 527246704 528478127 529804115 531245155 532783890 534367027
3531 534367027 535929260 537429276 538874893 540323715 541850815 543501549 545253448 547012138 548648453
$$ packed form
3463D90656242J038666J033135J004600R54209Q86802Q13370P48329P08160P01638
3472D98545151P24487P57179P72667P49703O84776N96199N13535M62684M49753M58450
3482E04714584M61960M39339L89900L30734K83165K56043K38724K09045J53198P8163
3492E07554855Q774l0708l7422l5897o0463j28593k22092k93922k97051k17018q3122
3503E06157341N0049J39808J83373K18277K96020M44565O50788Q69064J049614J166305
3513E11225204J224404J248779J262474J275482J283532J280899J266174J244621J220780
3522E22532349J197128J175575J163941J177711J231423J325988J441040J538735J583137
3531E34367027J562233J500016J445617J448822J527100J650734J751899J758690J636315
$$ plain form
3540 548648453 550060730 551231575 552243385 553243637 554372978 555696526 557178001 558712196 560195656
3549 560195656 561591492 562946701 564354172 565888977 567564545 569340515 571170540 573043938 574979897
3558 574979897 576967850 578899460 580558777 581703987 582211037 582192116 582004356 582120514 582924004
3567 582924004 584539833 586796417 589331856 591775093 593896637 595657387 597160912 598567429 600031471
3576 600031471 601677742 603586349 605756950 608056374 610206909 611860657 612760124 612901535 612594223
3585 612594223 612353554 612669296 613777046 615564880 617666702 619674530 621338577 622641487 623730469
3594 623730469 624785309 625919266 627174225 628572807 630160637 631982307 634009438 636084251 637944260
3603 637944260 639330902 640123291 640414047 640480957 640673904 641279221 642422638 644039078 645894852
$$ packed form
3540E48648453J412277J170845J011810J000252J129341J323548J481475J534195J483460
3549E60195656J395836J355209J407471J534805J675568J775970J830025J873398J935959
3558E74979897J987953J931610J659317J145210N07050j8921j87760J16158Q03490
3567E82924004J615829K256584K535439K443237K121544J760750J503525J406517J464042
3576F00031471J646271J908607K170601K299424K150535J653748Q99467J41411l07312
3585F12594223k40669L15742J107750J787834K101822K007828J664047J302910J088982
3594F23730469J054840J133957J254959J398582J587830J821670K027131K074813J860009
3603F37944260J386642P92389K90756O6910J92947O05317J143417J616440J855774
$$ plain form
3612 645894852 647651367 648959122 649585953 649553833 649216156 649196701 650157013 652457352 655880127 659593735
3622 659593735 662436600 663422165 662224655 659378281 656067581 653607101 652879868 654024277 656503525
3631 656503525 659473801 662214203 664386368 666036224 667422409 668827591 670465698 672467270 674856873
3640 674856873 677467880 679851456 681315002 681172256 679131393 675592194 671618881 668526688 667277832
3649 667277832 668031616 670123672 672483673 674227066 675062103 675298996 675526657 676221619 677544327
3658 677544327 679392624 681576385 683925781 686254349 688272552 689603806 689956284 689333878 688091125
3667 688091125 686739197 685608673 684622803 683371582 681462097 678900604 676224518 674279099 673787231
3676 673787231 675001450 677643509 681118546 684801254 688188019 690864029 692413254 692444534 690780869
$$ packed form
3612F45894852J756515J307755O26831l2120l37677j9455R60312K300339L422775L713608
3622F59593735K842865R85565j197510k846374l310700k460480p27233J144409K479248
3631F56503525K970276K740402K172165J649856J386185J405182J638107K001572K389603
3640F74856873K611007K383576J463546j42746k040863l539199l973313l092193j248856
3649F67277832P53784K092056K360001J743393Q35037K36893K27661O94962J322708
3658F77544327J848297K183761K349396K328568K018203J331254L52478o22406j242753
3667F88091125j351928j130524r85870j251221j909485k561493k676086j945419m91868
3676F73787231J214219K642059L475037L682708L386765K676010J549225L1280j663665
$$ plain form
3685 690780869 687683868 683913498 680514069 678414383 678065109 679318008 681584549 684146652 686420288
3694 686420288 688059540 688921814 689004288 688435745 687513275 686698914 686497803 687234802 688840027 690785065
3704 690785065 692246780 692448120 691026306 688238525 684901886 682078018 680647888 680975189 682805252
3713 682805252 685430984 688021698 689941254 690912170 690990295 690420532 689494095 688481445 687636566
3722 687636566 687207184 687394485 688264847 689665909 691211929 692364578 692584457 691513596 689138260
3731 689138260 685890045 682621994 680405045 680149460 682169647 685913162 690068359 693085556 693897247
3740 693897247 692440338 689653320 686906281 685197144 684602661 684339523 683386612 681253510 678380051
3749 678380051 675907135 674979935 676048965 678619690 681575851 683835526 684906006 685022659 684853745
$$ packed form
3685F90780869l097001l770370l399429k099686l49274J252899K266541K562103K273636
3694F86420288J639252Q62274Q2474n68543r22470q14361k01111P36999J605225J945038
3704F90785065J461715K01340j421814k787781l336639k823868j430130L27301J830063
3713F82805252K625732K590714J919556R70916P8125n69763r26437j012650q44879
3722F87636566m29382J87301Q70362J401062J546020J152649K19879j070861k375336
3731F89138260l248215l268051k216949k55585K020187L743515M155197L017197Q11691
3740F93897247j456909k787018k747039j709137n94483k63138r52911k133102k873459
3749F78380051k472916r27200J069030K570725K956161K259675J070480J16653j68914
$$ plain form
3758 684853745 685023727 685768051 686885605 687937317 688510818 688393326 687605896 686354904 684968872
3767 684968872 683834076 683310623 683613129 684698563 686237411 687717514 688648376 688769455 688148193
3776 688148193 687120361 686110840 685438080 685197983 685276566 685463104 685593948 685648804 685748596 686064987
3786 686064987 686698074 687599564 688595581 689490891 690184784 690701675 691110153 691385193 691338272 690694504
3796 690694504 689292068 687259369 685021439 683094177 681795807 681084442 680657272 680252151 679925766
3805 679925766 680078506 681175995 683352432 686186523 688834686 690452728 690628738 689541016 687755890
3814 687755890 685832748 684025421 682274933 680455399 678651276 677235718 676686020 677276306 678873825
3823 678873825 680984116 683010330 684551315 685549316 686216660 686809158 687403107 687808456 687659912
$$ packed form
3758F84853745J69982P44324J117554J051712N73501j17492p87430j250992j386032
3767F84968872j134796n23453L02506J085434J538848J480103R30862J21079o21262
3776F88148193j027832j009521o72760k40097P8583J86538J30844N4856R9792L16391
3786F86064987O33087R01490R96017Q95310O93893N16891M08478K75040m6921o43768
3796F90694504j402436k032699k237930j927262j298370p11365m27170m05121l26385
3805F79925766J52740J097489K176437K834091K648163J618042J76010j087722j785126
3814F87755890j923142j807327j750488j819534j804123j415558n49698N90286J597519
3823F78873825K110291K026214J540985R98001O67344N92498N93949M05349j48544
$$ plain form
3832 687659912 686627808 684627838 681921082 679046631 676619720 675092468 674608841 675035095 676148148
3841 676148148 677850037 680242767 683468628 687386169 691299286 693983765 694102631 690861588 684561005
3850 684561005 676697464 669488525 665007553 664343948 667208405 672162933 677330093 681200714 683145294
3859 683145294 683437042 682863235 682197418 681820526 681643066 681295166 680431824 678972931 677175217 675527267
3869 675527267 674538498 674523315 675474014 677071381 678826675 680280914 681165009 681447678 681259689 680768509
3879 680768509 680090408 679296646 678474197 677763824 677314224 677176056 677235107 677263107 677086487 676753693
3889 676753693 676566391 676919861 678039093 679783096 681650620 682990723 683286514 682351532 680354309
3898 680354309 677704849 674902267 672423477 670660019 669872208 670134888 671306381 673061829 675000076
$$ packed form
3832F87659912j032104j999970k706756k874451k426911j527252m83627M26254J113053
3841F76148148J701889K392730L225861L917541L913117K684479J18866l241043o300583
3850F84561005p863541p208939m480972o63605K864457M954528N167160L870621J944580
3859F83145294K91748n73807o65817l76892j77460l47900q63342j458893j797714j647950
3869F75527267r88769j5183R50699J597367J755294J454239Q84095K82669j87989m91180
3879F80768509o78101p93762q22449p10373m49600j38168N9051K8000j76620l32794
3889F76753693j87302L53470J119232J744003J867524J340103K95791r34982j997223
3898F80354309k649460k802582k478790j763458p87811K62680J171493J755448J938247
$$ plain form
3907 675000076 676774979 678173904 679111710 679566727 679533615 679036713 678181152 677175980 676282578 675706329
3917 675706329 675503922 675574799 675742111 675865555 675908890 675925674 675984879 676096039 676183090 676121216 675811234
3928 675811234 675250244 674562531 673966522 673686295 673842621 674379501 675078278 675659409 675918198 675817108
3938 675817108 675473785 675066986 674727173 674485016 674295349 674098587 673862686 673585510 673281326 672980042
3948 672980042 672740173 672640610 672732239 672978821 673244705 673364410 673250961 672956085 672622223 672366638
3958 672366638 672194748 672026978 671807175 671582642 671466599 671509552 671612549 671580276 671287460 670801315
3968 670801315 670331268 670037460 669877319 669649734 669210587 668649673 668231430 668128128 668198624 668062363
3978 668062363 667447586 666491089 665666351 665335846 665331726 665015717 663861008 662047348 660428543 659730453
$$ packed form
3907F75000076J774903J398925R37806M55017l3112m96902q55561j005172q93402n76249
3917F75706329k02407P0877J67312J23444M3335J6784N9205J11160Q7051o1874l09982
3928F75811234n60990o87713n96009k80227J56326N36880O98777N81131K58789j01090
3938F75817108l43323m06799l39813k42157j89667j96762k35901k77176l04184l01284
3948F72980042k39869r9563R1629K46582K65884J19705j13449k94876l33862k55585
3958F72366638j71890j67770k19803k24533j16043M2953J02997l2273k92816m86145
3968F70801315m70047k93808j60141k27585m39147n60914m18243j03302P0496j36261
3978F68062363o14777r56497q24738l30505m120l16009j154709j813660j618805o98090
$$ plain form
3988 659730453 659633102 658703918 655551834 650396500 645484238 643313370 643317337 639314003 620215950
3997 620215950 574682541 497630882 394753418
4000 394753418
$$ packed form
3988F59730453r7351r29184l152084n155334m912262k170868L967m003334j9098053
3997F20215950m5533409p7051659j02877464
4000C94753418
##END=$$ End of the data block
