##TITLE=$$ Begin of the data block
##JCAMP-DX=5.00 $$ ACD/SpecManager v 10.08
##SPECTROMETER/DATA SYSTEM=16PC
##DATE=18 Jun 2013 14:38:16
##DATA TYPE=INFRARED SPECTRUM
##DATA CLASS=XYDATA
##ORIGIN=
##OWNER=
##NPOINTS=3601
##FIRSTX=400.00000000
##LASTX=4000.00000000
##MAXX=4000.00000000
##MINX=400.00000000
##MAXY=81.48874664
##MINY=28.06609154
##XFACTOR=1.0000000000
##YFACTOR=0.000000100000000
##FIRSTY=45.22518158
##DELTAX=1.00000000
##XUNITS=1/CM
##YUNITS=TRANSMITTANCE
##XYDATA=(X++(Y..Y))
400 452251816 565745392 653362579 708506165 734861450 742835617 743802185 745349731 749668732
408 749668732 755098038 759109192 760602493 760370178 760026321 760625229 762056656 763471527 764163666
417 764163666 764115829 763852234 763861084 764151993 764309540 763939056 763074875 762198792 761866684 762265472 763066101
428 763066101 763668289 763639526 763003387 762192154 761730804 761900864 762605057 763477859 764114914 764256363
438 764256363 763843079 762969437 761801834 760508347 759190216 757819977 756216888 754118881 751355057
447 751355057 748040085 744650726 741890869 740383530 740356827 741517792 743198471 744689865 745564041
456 745564041 745799408 745664902 745464783 745323334 745130234 744658432 743752670 742464066 741051712 739852676
466 739852676 739085770 738679581 738199234 736921616 734054642 729047546 721882477 713225174 704342422
475 704342422 696791534 691989899 690828400 693477554 699438400 707778854 717429810 727414627 736958389
484 736958389 745493698 752629013 758139496 761990891 764366455 765649033 766325912 766836700 767422791
493 767422791 768056183 768489990 768418655 767663727 766276627 764489365 762529755 760412903 757851791
502 757851791 754375458 749621506 743648453 737082825 730989685 726506805 724420166 724892349 727471542
511 727471542 731360016 735781784 740262299 744695587 749205704 753913269 758749466 763414688 767485504
520 767485504 770602722 772635269 773742523 774304428 774757462 775409546 776322556 777314072 778078766 778370361
530 778370361 778148956 777616882 777120514 776966019 777250900 777803268 778266678 778289261 777714539 776674271
540 776674271 775529404 774690247 774409027 774652939 775124664 775421295 775244980 774555664 773583527 772692566
550 772692566 772174911 772085190 772215118 772223892 771848297 771076813 770178833 769571838 769593887 770312805 771474457
561 771474457 772623520 773328629 773390350 772925186 772285461 771865082 771895142 772332382 772895737 773220673
571 773220673 773053513 772382126 771440201 770582123 770095291 770045395 770238800 770324249 769978104 769079208
581 769079208 767771988 766384735 765245056 764492950 763990173 763376617 762240143 760311279 757592010
590 757592010 754364319 751089554 748251038 746206589 745091248 744786606 744953003 745111923 744768219
599 744768219 743553314 741354446 738388443 735184631 732468872 730980988 731279068 733592224 737764664
608 737764664 743296509 749467163 755502167 760743866 764788208 767551422 769250412 770298538 771147995
617 771147995 772134018 773375473 774770813 776082611 777071381 777616959 777774353 777743301 777769928 778026352
627 778026352 778516388 779053879 779319077 778979568 777831879 775909424 773512497 771136856 769323273
636 769323273 768479462 768749008 769981461 771812744 773814392 775641937 777110672 778181305 778880157
645 778880157 779217224 779160004 778674927 777801895 776700211 775617599 774787369 774302597 774050446 773752594
655 773752594 773111725 771989899 770520020 769077911 768109665 767895203 768369827 769110184 769508514 769055634
665 769055634 767595062 765410538 763096466 761278229 760326996 760220032 760612335 761071625 761333008
674 761333008 761433411 761658173 762342453 763654480 765484772 767496796 769298706 770632858 771475754
683 771475754 772008514 772480545 773053818 773704605 774228287 774336548 773795853 772545319 770739365 768702164
693 768702164 766807785 765343399 764411697 763922424 763675690 763494339 763334503 763311768 763627472 764434357
703 764434357 765723114 767293625 768833542 770058060 770834732 771222992 771410065 771585083 771819992
712 771819992 772024078 771994171 771529617 770552673 769168930 767641373 766286163 765341721 764873123 764755402
722 764755402 764745178 764600372 764190445 763539276 762783051 762070618 761463242 760893707 760204697 759241028
732 759241028 757944489 756391525 754754944 753209763 751834106 750557251 749179840 747462540 745238571
741 745238571 742504730 739448242 736395645 733699570 731613464 730200729 729322815 728706818 728051682
750 728051682 727121353 725778503 723952332 721582336 718590088 714911041 710573273 705763931 700827179
759 700827179 696171417 692121124 688787079 686015167 683437500 680589142 677032089 672441330 666641006
768 666641006 659611206 651487961 642559509 633238297 623993607 615248032 607278366 600166588 593826141
777 593826141 588088570 582802162 577892685 573368988 569293365 565755768 562880669 560854912 559939423
786 559939423 560427704 562545662 566334686 571581116 577841034 584564171 591260376 597639084 603652306
795 603652306 609434967 615181236 621024513 626981354 632972221 638894043 644691238 650383835 656041031
804 656041031 661724243 667438583 673120422 678667831 683988953 689043655 693850174 698460846 702918243
813 702918243 707216263 711282043 714984894 718171082 720710983 722552414 723760071 724531555 725175323
822 725175323 726052017 727489014 729692917 732691498 736321487 740267715 744140930 747567673 750267487
831 750267487 752103424 753095932 753407669 753299103 753074265 753018112 753347931 754181442 755530548 757319794
841 757319794 759419937 761687012 763998184 766276321 768497238 770678406 772851639 775031433 777193146
850 777193146 779274216 781199570 782913971 784397888 785647049 786623993 787212982 787224731 786472244
859 786472244 784899445 782698669 780336914 778449860 777628479 778184052 780013275 782630081 785363388
868 785363388 787621918 789106064 789865112 790193787 790433426 790795288 791289215 791784210 792143097 792348480
878 792348480 792544098 792977829 793881607 795357971 797329559 799570618 801799622 803783875 805409241
887 805409241 806692657 807738037 808666458 809553223 810398788 811144485 811718674 812087555 812285080 812402496
897 812402496 812548065 812793808 813142624 813531265 813866119 814075470 814147415 814133987 814122620 814187469 814351425
908 814351425 814574966 814779205 814887466 814867401 814747391 814600830 814508743 814516373 814610214 814724274 814775162
919 814775162 814706345 814516220 814259644 814017258 813853226 813782043 813763123 813722305 813591080 813338699 812985001
930 812985001 812582779 812187729 811825256 811475830 811084137 810585632 809939804 809151764 808271179 807369385
940 807369385 806502838 805682144 804862671 803960648 802890015 801599274 800092239 798424377 796680450
949 796680450 794951324 793322449 791881485 790728989 789982071 789755402 790124435 791086807 792545166
958 792545166 794319839 796193390 797962570 799483719 800690536 801587219 802221680 802656403 802944412
967 802944412 803121719 803209457 803224716 803190689 803142395 803120651 803159943 803271408 803432312 803588791 803670807
978 803670807 803618011 803401489 803034058 802563095 802046890 801530151 801024475 800509033 799947433 799312592
988 799312592 798605881 797860031 797121811 796424332 795763245 795093002 794343491 793453140 792395935 791189194
998 791189194 789877701 788504944 787087250 785609283 784037552 782347031 780540009 778650742 776734390
1007 776734390 774852448 773062286 771410599 769928741 768617783 767435532 766290894 765064850 763658752
1016 763658752 762050934 760333252 758699570 757383804 756573181 756334839 756595917 757182922 757899933
1025 757899933 758603745 759241791 759838638 760449066 761106110 761793442 762449417 762994537 763360291 763507767
1035 763507767 763428726 763140793 762680664 762103577 761482925 760903778 760448151 760176163 760111237 760236893
1045 760236893 760507965 760867310 761263199 761653671 762004318 762277756 762426834 762394409 762122345 761564865
1055 761564865 760699844 759532166 758086624 756392136 754463501 752287292 749821243 747004013 743775177
1064 743775177 740090561 735927811 731274261 726105423 720361328 713935928 706680984 698424377 688989410
1073 688989410 678206863 665918503 651976089 636251640 618669090 599256897 578211861 555949936
1081 555949936 533123436 510587692 489317513 470290680 454369049 442201729 434172363 430381546
1089 430381546 430649910 434518623 441245232 449821281 459053879 467748985 474984856 480407181 484421692
1098 484421692 488172951 493261337 501259308 513191566 529175262 548364334 569215012 589958649
1106 589958649 609087029 625672073 639435577 650605469 659674149 667188110 673635330 679425583
1114 679425583 684904327 690348053 695925751 701658401 707421417 713012161 718256683 723105164 727661438
1123 727661438 732133102 736727753 741550140 746550522 751540680 756260910 760463181 763972549 766713333
1132 766713333 768700638 770012894 770757904 771043243 770949326 770511780 769716492 768509750 766828461
1141 766828461 764642487 761997833 759045563 756041718 753314362 751199341 749962769 749733429 750468445
1150 750468445 751962433 753899841 755927277 757722778 759042282 759734955 759738312 759059448 757750473
1159 757750473 755873566 753456192 750447464 746700439 742010498 736220474 729362717 721779556 714146957
1168 714146957 707365952 702332611 699672623 699540482 701571579 705008621 708953705 712648468 715675735
1177 715675735 718021622 719990234 722017899 724464722 727456284 730824127 734153519 736916580 738638763
1186 738638763 739043961 738133469 736178207 733635559 731022568 728787994 727217865 726388931 726171417
1195 726171417 726271133 726293716 725821152 724482651 722009277 718256607 713189697 706841812 699257965
1204 699257965 690452805 680391006 668995972 656173935 641839218 625932121 608426323 589333115
1212 589333115 568711243 546692085 523523140 499627991 475664101 452546005 431391869 413365135
1220 413365135 399423676 390041466 385014000 383454933 384033890 385403862 386669426 387714424 389244804
1229 389244804 392527771 398926849 409423027 424299278 443086395 464750023 488005409 511627731
1237 511627731 534655151 556456413 576696472 595257530 612164307 627532806 641535034 654367905
1245 654367905 666215515 677210312 687406006 696772156 705215759 712619247 718884888 723967819
1253 723967819 727885666 730704803 732509003 733367615 733319321 732377777 730559158 727918854 724573746
1262 724573746 720706024 716539841 712299881 708166122 704239807 700520325 696903534 693190155 689101791
1271 689101791 684302673 678425217 671106873 662039948 651036301 638098030 623475533 607688217
1279 607688217 591491737 575787659 561490097 549384651 540014153 533623695 530172882 529411392
1287 529411392 530989113 534567528 539898071 546842232 555330620 565282249 576523018 588742065
1295 588742065 601506386 614316025 626660309 638035088 647913895 655714874 660828400 662752228
1303 662752228 661318207 656914139 650577621 643864517 638498039 635911751 636865730 641287537 648389130
1312 648389130 656988983 665883331 674114380 681052780 686319046 689639740 690747452 689392166 685457764
1321 685457764 679124146 670988083 662080307 653747559 647424164 644348602 645304489 650461121 659356461
1330 659356461 671031036 684261017 697822113 710702896 722223816 732052460 740145340 746660233
1338 746660233 751866608 756071930 759558792 762534180 765098495 767249069 768921585 770058517 770667877
1347 770667877 770844650 770734863 770468674 770095749 769567719 768774796 767606430 765984268 763833008
1356 763833008 760995636 757158356 751866455 744678802 735433578 724508591 712934113 702247238
1364 702247238 694102936 689766617 689695053 693384399 699545975 706532898 712831192 717419434 719888306
1373 719888306 720324173 719069061 716495667 712891541 708469696 703451614 698144760 692959213 688348999
1382 688348999 684711609 682292633 681139374 681120148 681997986 683525238 685517883 687877960 690558548
1391 690558548 693493042 696535797 699445953 701936035 703754501 704768066 704993210 704569931 703692780
1400 703692780 702537613 701215210 699763412 698162460 696357193 694275589 691845474 689014130 685771790
1409 685771790 682161331 678263855 674160614 669890900 665437775 660758286 655849304 650816193 645901413
1418 645901413 641450195 637822952 635291824 633963661 633762398 634471092 635815353 637548027 639506378
1427 639506378 641618729 643863220 646202316 648527603 650648651 652334137 653391953 653744812 653461761
1436 653461761 652727890 651768951 650770035 649827881 648949280 648078384 647126617 645988312 644551163 642719498
1446 642719498 640456848 637822495 634964294 632043533 629114037 626031075 622459526 618019409 612510872
1455 612510872 606108055 599406548 593277130 588589172 585932159 585471649 586990471 590072289 594307709
1464 594307709 599412079 605213737 611553879 618191872 624789391 630987778 636525650 641321259 645470047
1473 645470047 649162827 652577286 655805054 658845901 661659698 664229736 666601105 668873444 671161499
1482 671161499 673551559 676083908 678763809 681598129 684632645 687970352 691753387 696105423 701051941
1491 701051941 706451950 711985550 717225418 721781616 725460739 728354797 730796738 733181534 735733719
1500 735733719 738342361 740557327 741758041 741407852 739266281 735460281 730410233 724688110 718909073
1509 718909073 713700256 709718170 707624130 707963791 710975723 716428223 723604050 731475220 739007034
1518 739007034 745450287 750497131 754246826 757037964 759253006 761182861 762986450 764709778 766326828
1527 766326828 767774200 768991013 769965897 770779953 771606903 772645340 774000854 775581741 777084503
1536 777084503 778097687 778283157 777541885 776068878 774273300 772605820 771387939 770723801 770520706
1545 770520706 770587387 770749969 770933533 771184692 771634979 772424088 773599777 775033646 776391068 777196579
1555 777196579 776994400 775553818 773022537 769934387 767038269 765008087 764168396 764370041 765085831
1564 765085831 765674057 765673904 764983521 763835373 762603531 761560516 760724869 759877777 758726578 757110443
1574 757110443 755128632 753118591 751504669 750603638 750491028 750991821 751779022 752518005 752976151
1583 752976151 753057632 752769852 752164383 751296539 750214081 748965225 747598648 746150513 744624023
1592 744624023 742983322 741170883 739139862 736880264 734422302 731819763 729122696 726355438 723502350
1601 723502350 720505219 717268219 713685074 709688950 705315628 700744400 696274872 692227402 688798447
1610 688798447 685951843 683413467 680789719 677753601 674193497 670236893 666140289 662110596 658171005
1619 658171005 654147263 649770279 644825592 639258118 633181992 626811371 620364990 613991890 607737083
1628 607737083 601528969 595173302 588361359 580716705 571892509 561695175 550176926 537638588
1636 537638588 524526176 511263695 498105507 485074425 472014656 458726463 445117226 431313705
1644 431313705 417702217 404900742 393684731 384888687 379308548 377617073 380300674 387611008
1652 387611008 399522820 415688324 435404205 457624321 481057625 504357224 526354294 546248398
1660 546248398 563670387 578592339 591146584 601458473 609589119 615597610 619652939 622089081
1668 622089081 623342819 623809204 623713570 623097954 621939163 620316048 618500671 616887398 615790405
1677 615790405 615223923 614813576 613906288 611833992 608190155 602975998 596543770 589376488 581824188
1686 581824188 573924599 565378342 555660362 544198151 530521736 514341698 495557632 474244232
1694 474244232 450663033 425315628 399008865 372864265 348220596 326419792 308537674 295166626
1702 295166626 286349773 281701717 280660915 282750092 287712574 295465775 305901413 318652782
1710 318652782 332955933 347677574 361501236 373183517 381784515 386802635 388206940 386394882
1718 386394882 382120438 376408234 370455856 365512886 362737350 363052063 367031517 374851112 386309166
1727 386309166 400915871 418020782 436944084 457075043 477915230 499062195 520154877 540820198
1735 540820198 560655594 579267921 596352234 611769066 625579567 638009605 649358521 659890671
1743 659890671 669754257 678963089 687434769 695067902 701815720 707730408 712964478 717732697 722252884
1752 722252884 726687241 731103516 735466232 739659729 743535690 746968689 749907074 752401810 754606247
1761 754606247 756738663 759014740 761566544 764374161 767250443 769892883 771995392 773378067 774071274
1770 774071274 774310532 774439087 774766083 775449142 776462555 777650757 778832245 779885025 780777054
1779 780777054 781539078 782220917 782864304 783509979 784212723 785034027 786005096 787077713 788110733 788914719
1789 788914719 789343185 789379807 789167099 788951874 788974228 789361649 790080795 790972214 791838760 792539978
1799 792539978 793043365 793418121 793782959 794242935 794844437 795562820 796320038 797017822 797574234 797948914
1809 797948914 798152466 798240891 798297501 798409042 798643799 799033661 799566345 800188293 800824356 801406250
1819 801406250 801904602 802342682 802781219 803275681 803826599 804355774 804733658 804846191 804670029 804302063
1829 804302063 803924484 803716125 803767090 804046555 804446564 804866333 805280914 805741425 806311493 806983109
1839 806983109 807637634 808086929 808171310 807855530 807262115 806619110 806154480 805999451 806147995 806487656
1849 806487656 806871796 807186890 807385178 807475357 807493439 807476654 807453232 807446976 807485046 807597427 807808838
1860 807808838 808123398 808510971 808905029 809212646 809340515 809228210 808873901 808341904 807742767 807193680
1870 807193680 806780014 806533127 806434250 806435699 806483841 806530762 806535492 806465683 806307907 806082535 805847855
1881 805847855 805682526 805642014 805720749 805839539 805879059 805741577 805406647 804945602 804484482 804137115
1891 804137115 803947449 803875809 803830261 803722382 803510742 803213043 802885971 802591400 802369537 802227554
1901 802227554 802139893 802056198 801913376 801655502 801261444 800768967 800277634 799921722 799815598 800000305
1911 800000305 800420456 800948029 801443939 801822281 802081451 802286377 802514572 802802048 803120193 803397522
1921 803397522 803569107 803620911 803601379 803596191 803678055 803866959 804119720 804354019 804495926 804520187 804466629
1932 804466629 804423141 804482651 804696808 805047684 805451355 805789795 805962601 805929184 805725708 805447006
1942 805447006 805202637 805068207 805054474 805110474 805157013 805130692 805017090 804854660 804708786 804631577 804631348
1953 804631348 804668427 804678421 804610901 804460144 804271164 804118347 804066391 804136429 804293289 804460678 804560089
1964 804560089 804546509 804432068 804278564 804167099 804159927 804270477 804459229 804654541 804788971 804830856 804798508
1975 804798508 804746399 804734802 804798126 804927368 805078583 805198212 805255203 805257111 805245590 805270233 805357513
1986 805357513 805492172 805620041 805675430 805613708 805436630 805194550 804965210 804818039 804784317 804843903 804937668
1997 804937668 804996262 804972076 804859161 804692917 804529724 804419098 804380112 804394531 804419022 804407883 804339142
2008 804339142 804223709 804101562 804019470 804005890 804054642 804126129 804165726 804130249 804011078 803839417 803672180
2019 803672180 803565979 803550949 803616943 803720169 803804474 803828659 803783951 803695984 803609619 803564606 803576355
2030 803576355 803628769 803682098 803695526 803646011 803541870 803416138 803311691 803257599 803253174 803268127 803257751
2041 803257751 803185654 803043213 802855072 802667770 802526321 802451401 802429504 802420273 802376480 802268372 802097015
2052 802097015 801894836 801708374 801575623 801507797 801484604 801463394 801400909 801274185 801092148 800892563 800723495
2063 800723495 800620422 800589676 800605850 800626984 800617065 800566330 800497742 800453568 800473633 800571365 800726166 800891037
2075 800891037 801017303 801078262 801082230 801068192 801084976 801165924 801311722 801490021 801650238 801748047 801766663
2086 801766663 801723175 801659698 801621475 801634903 801693726 801764526 801803818 801782608 801702194 801594772 801509018 801484604
2098 801484604 801532669 801629715 801729355 801785126 801774597 801710281 801632156 801588058 801607742 801687012 801789322 801863785
2110 801863785 801870575 801801834 801685638 801572418 801509933 801518784 801584473 801664429 801711197 801696854 801626968 801536102
2122 801536102 801468048 801453629 801493225 801557617 801603851 801598434 801535568 801441727 801362839 801341782 801397018 801512375
2134 801512375 801644745 801744461 801779556 801750336 801687622 801636810 801633453 801686096 801772079 801850967 801885986 801862259
2146 801862259 801794434 801717682 801668091 801664886 801700058 801744461 801763306 801735764 801665344 801579361 801515732 801503372
2158 801503372 801548004 801628342 801706467 801743851 801720963 801644440 801543884 801456375 801409073 801406784 801431274 801452179
2170 801452179 801445160 801403656 801344147 801297531 801293106 801342697 801434326 801536255 801612701 801641541 801624985 801589279
2182 801589279 801569672 801593094 801661835 801752319 801824722 801844101 801797791 801702499 801596298 801520309 801498947 801526413
2194 801526413 801572037 801594238 801561890 801469574 801339417 801210480 801119080 801081390 801085968 801100388 801088257 801027679
2206 801027679 800922165 800798187 800691681 800628815 800613098 800623779 800626450 800591125 800506821 800387115 800261993
2217 800261993 800161972 800101700 800072098 800043945 799982910 799867172 799698944 799506454 799329834 799203262 799137650
2228 799137650 799116058 799102173 799059448 798970871 798847733 798723526 798637161 798611984 798643723 798703003 798750534
2239 798750534 798756561 798716049 798649521 798592834 798578491 798620071 798705292 798802032 798873291 798894577 798865891 798810425
2251 798810425 798762436 798749161 798776245 798824081 798859634 798855057 798802719 798722610 798650131 798618622 798640747 798701782
2263 798701782 798767700 798801422 798782501 798715439 798626251 798550491 798514328 798523483 798559265 798587570 798575134 798506470
2275 798506470 798395081 798279953 798209991 798220139 798313980 798458405 798599396 798686066 798694611 798638229 798555450
2286 798555450 798488617 798460693 798464890 798470917 798444519 798364563 798236084 798085556 797948608 797855225 797817230 797826004
2298 797826004 797859116 797892532 797912750 797923431 797940826 797982254 798049774 798121490 798158264 798120499 797994690 797806244
2310 797806244 797617569 797504272 797519836 797664642 797875824 798041992 798043518 797802048 797319031 796684952
2320 796684952 796050949 795566864 795312424 795254669 795257874 795149536 794808731 794234161 793545380 792918701
2330 792918701 792489014 792280197 792203217 792120590 791926270 791582108 791085205 790398941 789415817 788012543
2340 788012543 786185379 784189987 782569580 782014084 783080368 785905838 790069809 794692535 798737106
2349 798737106 801377258 802255478 801527786 799701233 797369766 794991226 792787857 790784454 788914413
2358 788914413 787119217 785391922 783766251 782285004 780976105 779850082 778909073 778150940 777566376
2367 777566376 777137222 776841507 776667938 776627197 776751251 777076721 777623901 778384171 779324646 780403519
2377 780403519 781586151 782846909 784161072 785491867 786784210 787972488 788997345 789821396 790437546
2386 790437546 790866928 791149139 791330261 791452179 791544800 791620636 791677475 791703873 791691666 791645279 791584854
2397 791584854 791538544 791527939 791556396 791605759 791644897 791647263 791603317 791525726 791439362 791368866 791324615 791299591
2409 791299591 791275864 791234970 791169739 791086426 791002350 790935059 790894165 790876389 790866776 790847244 790805664 790743103
2421 790743103 790673447 790617447 790592957 790606003 790648193 790699997 790739594 790751953 790735092 790699921 790664368 790644760
2433 790644760 790648346 790668640 790687866 790685730 790648422 790576324 790484314 790393982 790323105 790275116 790238190 790191422
2445 790191422 790117264 790011444 789886093 789764328 789667664 789607544 789579849 789569244 789557266 789531631 789491501
2456 789491501 789446106 789408646 789389038 789386826 789389114 789375458 789326782 789234009 789105072 788962555 788833389 788735886
2468 788735886 788669968 788617706 788553009 788456192 788324661 788174820 788032303 787919312 787841873 787789154 787739944
2479 787739944 787674942 787587891 787485886 787386780 787306671 787251816 787213745 787173157 787110138 787013397 786887665
2490 786887665 786751785 786629562 786537399 786475525 786427078 786366272 786272354 786139908 785983047 785827255 785697098
2501 785697098 785603256 785537338 785478363 785403442 785300674 785175400 785047684 784941559 784874115 784846802 784845276
2512 784845276 784846268 784828110 784779892 784706497 784623108 784548874 784494324 784457550 784424362 784376221 784299927 784194946
2524 784194946 784074554 783959351 783867950 783808212 783773727 783747635 783710327 783649521 783565598 783471375 783385620
2535 783385620 783325653 783297958 783296661 783305740 783306808 783288269 783250809 783206863 783173981 783165817 783183136 783213425 783234177
2548 783234177 783225250 783178558 783101807 783016052 782945938 782906342 782896881 782901840 782899017 782871780 782816772 782745132 782675476
2561 782675476 782623367 782593918 782579956 782566986 782542343 782500992 782448044 782394333 782349777 782318192 782294693 782269135
2573 782269135 782229462 782168350 782085114 781986542 781882782 781783905 781694031 781610031 781522293 781419907 781296310
2584 781296310 781153336 781000977 780852127 780716324 780593262 780474396 780347595 780205460 780051270 779898224
2594 779898224 779763947 779661255 779590530 779539108 779486160 779411926 779305649 779170990 779020767 778872986 778740158
2605 778740158 778625946 778524551 778425598 778321152 778209686 778097153 777992020 777899933 777820663 777746429 777667618
2616 777667618 777576752 777474442 777368622 777271118 777192535 777136078 777096558 777061920 777017899 776955719 776875839
2627 776875839 776789474 776714859 776669159 776659470 776679306 776710205 776729202 776720963 776684494 776633606 776589203 776568222
2639 776568222 776573410 776593018 776606903 776597366 776559753 776504059 776450577 776418610 776417007 776438904 776465149 776473465 776448975
2652 776448975 776391525 776315613 776242905 776191711 776167679 776160965 776151505 776119461 776055679 775966797 775870438 775786591
2664 775786591 775726242 775685654 775648346 775594482 775511093 775398788 775272293 775152893 775059128 774997406 774960785
2675 774960785 774930420 774884949 774808655 774698410 774563904 774422913 774293137 774184113 774094086 774011536 773922424
2686 773922424 773818436 773701248 773580780 773469467 773373642 773289948 773205719 773106003 772982025 772835312 772678299
2697 772678299 772526779 772391739 772273026 772159805 772035980 771889420 771718140 771532211 771348419 771181641
2707 771181641 771036224 770904007 770767212 770607224 770414047 770189590 769947052 769702682 769467468 769241409
2717 769241409 769014053 768770676 768499146 768198395 767876968 767549057 767226334 766910172 766591263 766253967
2727 766253967 765886765 765490417 765082092 764691010 764348221 764074631 763873672 763730469 763621063 763522110
2737 763522110 763420868 763317947 763222427 763144608 763086777 763041229 762993927 762930527 762845459 762742920 762634735
2748 762634735 762532196 762438202 762344284 762233658 762089615 761904526 761684875 761448288 761216583 761004562
2758 761004562 760814209 760634689 760447998 760239334 760004044 759749832 759491959 759246063 759019775 758808517
2768 758808517 758597717 758367767 758104935 757806015 757481003 757149658 756831436 756537018 756264191 755997925
2778 755997925 755720901 755421448 755101395 754774246 754457550 754161987 753884430 753607254 753307419 752968140
2788 752968140 752587509 752181168 751775055 751394348 751053085 750750046 750471878 750202484 749932404 749662857
2798 749662857 749403915 749167099 748957520 748768921 748587570 748397369 748190002 747967606 747741318 747523956
2808 747523956 747321472 747129898 746936493 746727600 746496048 746246185 745992508 745753021 745541153 745358505
2818 745358505 745195312 745033646 744856949 744656830 744436188 744207001 743982391 743768005 743557205 743331604
2828 743331604 743068771 742752075 742378387 741958008 741509399 741046982 740573959 740077896 739536362 738927460
2838 738927460 738239822 737479324 736666031 735825653 734978027 734128418 733265762 732368927 731419525 730412369
2848 730412369 729362030 728297272 727249680 726239319 725265198 724308167 723340683 722343140 721313705
2857 721313705 720268478 719232025 718222580 717241974 716275406 715300980 714301987 713280029 712253723
2866 712253723 711252213 710300217 709406738 708560562 707734604 706898880 706032028 705129471 704202423 703269501
2876 703269501 702344055 701426010 700498657 699536209 698513870 697419281 696256256 695041046 693792496
2885 693792496 692521439 691224747 689887085 688490753 687025909 685498962 683931427 682351990 680783005
2894 680783005 679231720 677686691 676124878 674524765 672881012 671210403 669548492 667938232 666413727
2903 666413727 664990005 663660202 662401505 661183243 659974670 658745728 657465973 656103058 654627151
2912 654627151 653020554 651288605 649468155 647624817 645841141 644197845 642752991 641531525 640521088
2921 640521088 639680824 638954086 638283272 637619934 636931839 636203575 635436249 634645996 633862152 633124657
2931 633124657 632476768 631958084 631594353 631391106 631333084 631388893 631520424 631693153 631882019 632072754
2941 632072754 632257919 632430573 632578163 632678604 632700577 632607765 632366982 631959305 631389809 630694885
2951 630694885 629941711 629218788 628620453 628227539 628090286 628221054 628594208 629155655 629835892 630562744
2961 630562744 631268234 631892776 632384872 632701836 632811432 632695732 632355080 631805573 631072998 630182686
2971 630182686 629151497 627988548 626705589 625335770 623949242 622659607 621611137 620950127 620789604
2980 620789604 621178703 622090569 623430939 625064735 626849747 628666611 630434761 632115974 633705482
2989 633705482 635220337 636689606 638149185 639642181 641216583 642921906 644800339 646876297 649147568
2998 649147568 651582794 654125824 656705551 659248886 661690292 663979187 666081161 667976685 669657822
3007 669657822 671124191 672380753 673435440 674298630 674982071 675499115 675862732 676084137 676172256 676134186
3017 676134186 675977402 675712280 675353165 674916763 674416962 673861389 673250198 672582092 671862640 671113968
3027 671113968 670378189 669710464 669165573 668779144 668556137 668467407 668458405 668466415 668436966 668335571 668147583
3038 668147583 667870865 667503891 667037506 666455994 665743637 664895325 663923721 662856064 661724091 660551147
3048 660551147 659343338 658090668 656777573 655397110 653961868 652504044 651066437 649686050 648382111
3057 648382111 647148972 645961609 644784164 643584290 642339630 641039429 639680099 638258286 636765976
3066 636765976 635191841 633526306 631769524 629935417 628049126 626138306 624221382 622298431 620350838
3075 620350838 618348465 616263161 614080048 611803703 609454765 607062225 604653320 602248688 599860306
3084 599860306 597494507 595155792 592848969 590580215 588357048 586187630 584081306 582048187 580097885
3093 580097885 578237343 576467094 574780769 573164024 571598740 570068321 568562279 567079773 565627899
3102 565627899 564217987 562860374 561560707 560319633 559136581 558014603 556963844 556001968 555150795
3111 555150795 554431839 553861389 553448219 553192558 553088341 553123550 553284492 553558731 553939362 554429398
3121 554429398 555041771 555796661 556713409 557801819 559055824 560452652 561958961 563541145 565175858
3130 565175858 566854858 568582497 570367088 572210121 574098206 576002884 577886543 579714088 581462746
3139 581462746 583127556 584720497 586263390 587779465 589284973 590785637 592273560 593729630 595125961
3148 595125961 596432419 597622528 598680611 599605064 600407715 601107521 601721916 602260170 602720566
3157 602720566 603093300 603366394 603530502 603581161 603517761 603340950 603052330 602656441 602163467 601590996
3167 601590996 600960579 600292816 599600029 598882828 598132324 597337036 596491814 595603867 594692116 593779716
3177 593779716 592883720 592006035 591131859 590235863 589293747 588293228 587238350 586145401 585032120
3186 585032120 583907585 582765083 581586418 580348740 579035988 577644348 576182098 574665985 573113670
3195 573113670 571538887 569949799 568349304 566737976 565114403 563477173 561824150 560151711 558454361
3204 558454361 556724701 554954338 553136749 551268425 549350471 547386856 545381508 543334618 541241722
3213 541241722 539095764 536891670 534632187 532331543 530012627 527702637 525424652 523190918 521001549
3222 521001549 518846970 516716843 514606590 512523537 510485878 508515472 506628227 504826279 503096352
3231 503096352 501416245 499767265 498144798 496563492 495052986 493647499 492374878 491250381 490278397
3240 490278397 489459190 488795929 488298073 487980042 487856216 487937431 488229828 488736877 489463577 490417900
3250 490417900 491610794 493052826 494751091 496705894 498909225 501346779 503999100 506845131 509864655
3259 509864655 513039246 516352310 519788170 523331070 526962509 530661659 534403572 538159904 541899796
3268 541899796 545594063 549218597 552759018 556211357 559580536 562875404 566102409 569262657 572351837
3277 572351837 575363350 578292274 581137352 583900070 586581268 589179611 591689034 594101715 596411209
3286 596411209 598615150 600717316 602726936 604655457 606512642 608301697 610018272 611651649 613190727
3295 613190727 614630051 615974884 617240028 618442917 619594612 620692596 621719856 622651405 623464928
3304 623464928 624149246 624709282 625161285 625525475 625818901 626049805 626219063 626325226 626369781 626360931
3314 626360931 626314850 626249504 626180153 626112328 626040611 625951767 625831451 625672226 625476265 625252762 625011444
3325 625011444 624755363 624478378 624168663 623817024 623421936 622993393 622546577 622095909 621647110 621195526
3335 621195526 620729485 620236473 619708405 619145241 618553047 617941589 617320404 616695480 616068230 615435715
3345 615435715 614790573 614122581 613419075 612666512 611853104 610970459 610018272 609003830 607941475 606847649
3355 606847649 605736351 604615402 603487015 602352943 601219826 600103111 599026108 598013687 597084694
3364 597084694 596246033 595491142 594803200 594161034 593545303 592942123 592344284 591750870 591164513 590589142
3374 590589142 590026131 589472122 588918571 588352013 587758293 587126160 586452599 585744095 585016365 584290276
3384 584290276 583583641 582906113 582254753 581616364 580974655 580319328 579653625 578995056 578369179 577800598
3394 577800598 577303696 576880798 576522903 576216202 575945435 575696182 575455360 575211525 574956093 574686012
3404 574686012 574403839 574116020 573829575 573549995 573281250 573027306 572792358 572577133 572375069 572170258
3414 572170258 571941605 571672935 571363831 571032753 570711212 570430336 570207596 570041008 569914284 569808464
3424 569808464 569711494 569622955 569549217 569497414 569470100 569466019 569482536 569519958 569581451 569672432 569796906 569957161
3436 569957161 570152092 570377083 570623283 570877037 571122894 571348763 571553230 571748734 571959534 572212791
3446 572212791 572527695 572907906 573341484 573807869 574287758 574771042 575256348 575746841 576242828 576737747
3456 576737747 577220955 577684784 578130684 578571205 579025993 579512558 580038834 580599747 581179848 581760712
3466 581760712 582326088 582866096 583379326 583872566 584360008 584861488 585396271 585974159 586589127 587218628
3476 587218628 587832985 588409920 588946342 589460907 589980927 590527458 591104698 591703224 592311859 592931328
3486 592931328 593574333 594254875 594973907 595714226 596450882 597170258 597882500 598615646 599392967 600209351
3496 600209351 601023941 601779480 602434044 602989426 603490410 604001160 604568062 605197105 605858116 606509857
3506 606509857 607132263 607739906 608373909 609076920 609869041 610739479 611654892 612578468 613485565 614368553
3516 614368553 615231094 616077461 616904068 617697372 618437691 619107246 619699898 620228043 620725517 621242943
3526 621242943 621834450 622541275 623374557 624309082 625289421 626254272 627163467 628020859 628876419 629802208
3536 629802208 630853043 632026825 633252487 634412041 635393677 636146965 636709366 637188721 637706337
3545 637706337 638339233 639090347 639905701 640723724 641520386 642322845 643184052 644144745 645214386 646383057
3555 646383057 647652893 649051666 650604401 652275238 653923111 655313950 656208572 656484299 656225128
3564 656225128 655718079 655351334 655458450 656193237 657492218 659134293 660856781 662458267 663854141
3573 663854141 665071716 666214142 667418518 668816910 670494385 672442322 674523315 676481934 678020325
3582 678020325 678923264 679174194 678994904 678771439 678896637 679601059 680868835 682473068 684106903
3591 684106903 685531921 686665955 687576065 688406525 689298706 690349045 691611328 693114243 694856186
3600 694856186 696778717 698738937 700525665 701926422 702822723 703260956 703452530 703702621 704293518
3609 704293518 705377884 706918411 708692245 710356216 711559296 712082291 711963577 711551590 711428604
3618 711428604 712192688 714165497 717163925 720476685 723103638 724176865 723360977 721027451 718100281
3627 718100281 715653915 714469376 714772263 716253357 718316879 720389557 722130356 723480530 724590378
3636 724590378 725715408 727126083 729030380 731478119 734259567 736870728 738621445 738897324 737471237
3645 737471237 734689178 731392212 728585434 727008820 726842422 727700195 728895264 729813385 730184708
3654 730184708 730131073 730016403 730224762 730999832 732398224 734321747 736566162 738851700 740858154
3663 740858154 742295380 743003159 743021851 742567520 741896667 741137543 740199127 738840256 736869431 734352951
3673 734352951 731693878 729517746 728426971 728761978 730489426 733254700 736528473 739746704 742388306
3682 742388306 744008713 744287186 743120956 740727081 737663956 734710083 732618103 731855011 732454987
3691 732454987 734059906 736106110 738047791 739509506 740323257 740494766 740163803 739592514 739146042
3700 739146042 739215546 740060120 741633148 743507080 744981232 745362930 744294815 741956024 739022217
3709 739022217 736397476 734851837 734742432 735934372 737928543 740099258 741918640 743081055 743518295
3718 743518295 743341522 742767792 742057877 741474915 741249313 741542969 742411194 743764114 745341263 746721802
3728 746721802 747402420 746954651 745234604 742550964 739677505 737635498 737289658 738929825 742061920
3737 742061920 745567169 748181610 749073486 748203583 746264114 744231415 742793274 741993942 741298599
3746 741298599 740025711 737863388 735141678 732693100 731390915 731658325 733240128 735363464 737167358
3755 737167358 738138885 738305435 738112411 738094711 738557434 739437561 740387039 740987625 740957718 740257034
3765 740257034 739071045 737724304 736578369 735941162 735991440 736717606 737897491 739148026 740054169
3774 740054169 740331955 739948273 739125366 738220291 737543564 737220230 737170639 737211914 737207031 737158508 737194443
3785 737194443 737465439 738035278 738844528 739765396 740697556 741621323 742561646 743490906 744252243 744581757
3795 744581757 744235001 743145065 741497498 739658890 737996979 736701889 735735397 734942856 734248581
3804 734248581 733792877 733895798 734857559 736717758 739140472 741513748 743214874 743884735 743545074
3813 743545074 742504959 741130829 739647446 738093491 736441727 734772186 733352737 732554321 732650146
3822 732650146 733639221 735219574 736938019 738420944 739542160 740416794 741241074 742081299 742761612
3831 742761612 742925491 742232742 740579453 738198242 735584335 733289566 731705399 730959244 730977249
3840 730977249 731655655 733013000 735198212 738314285 742150345 746000061 748734131 749169998 746606598
3849 746606598 741260986 734354324 727745209 723245697 721924362 723729706 727603455 732008438 735594635
3858 735594635 737678833 738342590 738164062 737786713 737565002 737457886 737165451 736393433 735073929 733434219
3868 733434219 731900482 730905533 730709763 731310349 732468948 733827972 735046387 735900650 736311798
3877 736311798 736312408 735986862 735431519 734745636 734040451 733429947 732995987 732740021 732570343 732356567
3887 732356567 732031021 731679001 731541672 731907425 732939529 734538193 736324768 737767029 738383255
3896 738383255 737918930 736419144 734182053 731641235 729240189 727346344 726200943 725895538 726367645
3905 726367645 727422638 728789368 730195923 731431427 732368317 732942352 733123627 732912140 732363358
3914 732363358 731610870 730849380 730265808 729955978 729887085 729936371 729984818 729994888 730016327 730116272 730291519
3925 730291519 730435181 730389099 730047913 729439011 728725433 728128052 727824020 727876816 728228989 728740158
3935 728740158 729241714 729582977 729670334 729494705 729138947 728745651 728445358 728282166 728188324 728033371
3945 728033371 727724304 727280960 726830292 726519165 726411972 726453705 726525269 726539688 726496048 726448517 726423416
3956 726423416 726371155 726202393 725882187 725489960 725177536 725050354 725072479 725087204 724945526 724637375
3966 724637375 724298859 724084473 724011307 723924713 723631287 723090439 722482758 722068863 721945038 721916275
3976 721916275 721632919 720902100 719902496 719073944 718730316 718716660 718454971 717417984 715660324 713895264
3986 713895264 712923126 712793961 712457123 710399399 705983734 700423737 696257629 695094833 694774323
3995 694774323 687953644 663733368 612226944 530011063 423427582
4000 423427582
##END=$$ End of the data block
