##TITLE=$$ Begin of the data block
##JCAMP-DX=5.00 $$ ACD/SpecManager v 10.08
##SPECTROMETER/DATA SYSTEM=16PC
##DATE=18 Jun 2013 14:48:58
##DATA TYPE=INFRARED SPECTRUM
##DATA CLASS=XYDATA
##ORIGIN=
##OWNER=
##NPOINTS=3601
##FIRSTX=400.00000000
##LASTX=4000.00000000
##MAXX=4000.00000000
##MINX=400.00000000
##MAXY=79.19004059
##MINY=16.82103348
##XFACTOR=1.0000000000
##YFACTOR=0.000000100000000
##FIRSTY=44.39934540
##DELTAX=1.00000000
##XUNITS=1/CM
##YUNITS=TRANSMITTANCE
##XYDATA=(X++(Y..Y))
400D43993454J10840683Q7204819N6740646K8817749R998856J847381J443939L929215
408G44816742N394669M506683K272034N30929L81622J536713K790985L031082J990357
417G67251816K78930j183013j818772j674347j208801q60138p44629o81076m45328
426G58914642k899M58908O95191O01043K77329o5384k62756k87095k13546j21537l5858
437G59958038M9744R6741j1902m24500j215133k307816l488617m502716n157242n365753
447G37630844n118942m431687l329315j892090l12042J107483K036896K257385J763840
456G29712372P68814l95966j416702k099991k393646k342758k034607j569901j065902
465G17161713o71616n60837q98056j798019l280869n245971p445374r477539j0820694
$$ plain form
400 443993454 554834137 642038956 698779602 727597351 737596207 739443588 740887527 744816742
408 744816742 750211411 754718094 756990128 757521057 757902679 759439392 762230377 765261459 767251816
417 767251816 767530746 766347733 764528961 762854614 761645813 760785675 760041046 759359970 758914642
426 758914642 758911743 759370651 760065842 760666885 760944214 760878830 760616074 760328979 760115433 759993896 759958038
437 759958038 760007782 760104523 760092621 759668121 758452988 756145172 752656555 748153839 742996597 737630844
447 737630844 732511902 728080215 724750900 722858810 722546768 723654251 725691147 727948532 729712372
456 729712372 730481186 730085220 728668518 726568527 724174881 721832123 719797516 718227615 717161713
465 717161713 716490097 715929260 715031204 713233185 709952316 704706345 697260971 687783432 676962738
474F76962738j0930023r404221o166076j568451L645630Q542099J2281570J4371643
482F87734909J4775620J3845672J2127075J0144349Q254776O613616N222702M011231
490G62729950K903595J852264Q49152p4158q56857j433106j777954j952972k125855
499G60114059k534561l394623m781951o547394q312607r567032r839020q866729o702881
508F99567261l698654l78647K736053N279389P100143Q222275Q744659Q751679Q282623
517G44606781P373276O118774M709778L400192K420655J885528J749954J840897J941681
526G76047516J881866J590805J095124M83474j38397o69403j028290j157913j041489
535G77063293p17544k85568J19247L66898L78799J51978k48185p14874j135330j416092
$$ plain form
474 676962738 666032715 656628494 650462418 648893967 652539597 661081696 673363266 687734909
482 687734909 702510529 716356201 728483276 738627625 746882401 753496017 758718719 762729950
490 762729950 765633545 767485809 768334961 768260803 767403946 765970840 764192886 762239914 760114059
499 760114059 757579498 754184875 749402924 742855530 734542923 724975891 715136871 706270142 699567261
508 699567261 695868607 695489960 698226013 703505402 710605545 718827820 727572479 736324158 744606781
517 744606781 751980057 758098831 762808609 766208801 768629456 770514984 772264938 774105835 776047516
526 776047516 777929382 779520187 780615311 781098785 780960388 780290985 779262695 778104782 777063293
535 777063293 776345749 776060181 776179428 776546326 776925125 777077103 776828918 776114044 774978714 773562622
545G73562622j495895j356507j026077n84106j45264J69296K77024J64642j05209m20228
555G69040298o65512p64007o93665m78592j66626J92566N50614Q58459J059647J097641
565G70030823R30938N54963J3733o02570j175461j584778j743469j619720j256638
574G63547821p63473k91138J2131M6157k10800o99997j308136j909179k401657k731095
584G53290634k895431k939530k944641l011169l226166l617096m109421m514694m581909
593G21450577m108963l071671j701278m50821J70059j73187j441117l167724m596939
602G02908936m970246l839340j263351K196350N689010Q390427R787903R814224Q796387
611G37510300P262268N709076M438858L514175K826386K219467J596832R64508M01535
$$ plain form
545 773562622 772066727 770710220 769684143 769100037 768954773 769124069 769401093 769565735 769460526 769040298
555 769040298 768374786 767610779 766917114 766438522 766271896 766464462 767015076 767873535 768933182 770030823
565 770030823 770961761 771516724 771530457 770927887 769752426 768167648 766424179 764804459 763547821
574 763547821 762784348 762493210 762505341 762551498 762340698 761640701 760332565 758423386 756021729 753290634
584 753290634 750395203 747455673 744511032 741499863 738273697 734656601 730547180 726032486 721450577
593 721450577 717341614 714269943 712568665 712117844 712287903 712114716 710673599 707505875 702908936
602 702908936 697938690 694099350 692835999 695032349 700721359 709111786 718899689 728713913 737510300
611 737510300 744772568 750481644 754920502 758434677 761261063 763480530 765077362 766041870 766443405
620G66443405m654k17056k65274k19956j45187p2632j2741K899j14517n00107j263656
631G63630524k386093l645707m637069m904328m142379k370224J5487K360001L991394
640G47911606M483948L811950K329560N91964q87680j820221k192306k181702k010345
649G50036774j826477j668930j519700j376342j293869j357346j611252j996689k350692
658G35035477k478333k259598j732177j093445o14929n12543q38471j451416k085418
667G21969147k472534k460709k062683j419830p11136n9052N11475J046829J599045
676G15940552K159347K644120K930679K922592K606201K060471J424866Q36563L79181
685G33904572N9433j81351m29459p60574j205979j738815k278824k714996k938156
$$ plain form
620 766443405 766438751 766221695 765956421 765736465 765591278 765518646 765505905 765508804 765394287 764894180 763630524
631 763630524 761244431 757598724 752961655 748057327 743914948 741544724 741560211 743920212 747911606
640 747911606 752395554 756207504 758537064 759129028 758241348 756421127 754228821 752047119 750036774
649 750036774 748210297 746541367 745021667 743645325 742351456 740994110 739382858 737386169 735035477
658 735035477 732557144 730297546 728565369 727471924 726856995 726344452 725505981 724054565 721969147
667 721969147 719496613 717035904 714973221 713553391 712842255 712783203 713294678 714341507 715940552
676 715940552 718099899 720744019 723674698 726597290 729203491 731263962 732688828 733525391 733904572
685 733904572 733964005 733782654 733353195 732592621 731386642 729647827 727369003 724654007 721715851
694G21715851k879334k532730j955719j244125m92783K35367R15299J538467K081680
703G17381973K485581K668380K562027K159043J532440Q19855J73111l00064n73044
712G28909302o99921p77893q96072j095810j356049j610489j780853j812134j693420
721G17186661j460495j178513r18731p34711o50940o62842p53174r04770j112060j377793
731G07432632j698379k050095k385025k642822k782135k804031k766343k763443k882385
740F84657974l154754l526459l868561m025192l882752l425140k747116k022324j443939
749F56561737j161194j246338j694183k442551l394165m427414n397567o146203o531181
758F24120941o471481n988121n214844m367676l685760l367844l532524m206848n335312
$$ plain form
694 721715851 718836517 716303787 714348068 713103943 712611160 712846527 713761826 715300293 717381973
703 717381973 719867554 722535934 725097961 727257004 728789444 729609299 729782410 729482346 728909302
712 728909302 728209381 727431488 726535416 725439606 724083557 722473068 720692215 718880081 717186661
721 717186661 715726166 714547653 713628922 712894211 712243271 711580429 710827255 709922485 708810425 707432632
731 707432632 705734253 703684158 701299133 698656311 695874176 693070145 690303802 687540359 684657974
740 684657974 681503220 677976761 674108200 670083008 666200256 662775116 660028000 658005676 656561737
749 656561737 655400543 654154205 652460022 650017471 646623306 642195892 636798325 630652122 624120941
758 624120941 617649460 611661339 606446495 602078819 598393059 595025215 591492691 587285843 581950531
767E81950531o788750q369674r823494j0877762j1310272j1024933j0097084q751755
775E04906807p276535n910568m764786l818703k984047k194023j450729q06923k97928
784D75402565J23749N93376J269951K239685L443107M683533N707779O321221O470489
793E06255455O254540N864334N493583N269699N229760N343933N554161N805893O057052
802E57128410O274948O431466O505241O488953O392860O238747O049804N844155N633125
811F12987709N426254N228539N031547M800492M471245L973541L270645K404556J516419
820F49110947Q19778N36499Q09631J639252K862625M193421N303116N915222N878753
829F77069244N202332M041367K647476J301574K41623l83911n36423k71835K95639
$$ plain form
767 581950531 575161781 566792107 556968613 546090851 534780579 523755646 513658562 504906807
775 504906807 497630272 491719704 486954918 483136215 480152168 477958145 476507416 475700493 475402565
784 475402565 475526314 476119690 477389641 479629326 483072433 487755966 493463745 499784966 506255455
793 506255455 512509995 518374329 523867912 529137611 534367371 539711304 545265465 551071358 557128410
802 557128410 563403358 569834824 576340065 582829018 589221878 595460625 601510429 607354584 612987709
811 612987709 618413963 623642502 628674049 633474541 637945786 641919327 645189972 647594528 649110947
820 649110947 649930725 650467224 651276855 652916107 655778732 659972153 665275269 671190491 677069244
829 677069244 682271576 686312943 688960419 690261993 690503616 690119705 689583282 689311447 689607086
838F89607086J039276J847763K635727L331757L868408M181290M226684M009323L595429
847G18342743L100738K655106K357101K241669K275391K370529K411652K275848J851959
856G39882736J067810o8893j428452k745285l664703l853607l139801j618958L45307
865G24776154K233123L560562M058838L756180K927475J944046J106110N43823K27356
874G45133667N5923l4027j6327K01188O96716J456375K348785L163224L692703L813705
884G60511932L526383K942123K232819J568527J072617P99179P35779Q20388R64661
893G75174408J078339J089477R60465O96106L39660l9367l62931n63965o03180m78134
903G77290878k25982Q5601L73841N63507O04095M85382K37732p8888l91159o32476
$$ plain form
838 689607086 690646362 692494125 695129852 698461609 702330017 706511307 710737991 714747314 718342743
847 718342743 721443481 724098587 726455688 728697357 730972748 733343277 735754929 738030777 739882736
856 739882736 740950546 740881653 739453201 736707916 733043213 729189606 726049805 724430847 724776154
865 724776154 727009277 730569839 734628677 738384857 741312332 743256378 744362488 744906311 745133667
874 745133667 745189590 745155563 745139236 745340424 746037140 747493515 749842300 753005524 756698227 760511932
884 760511932 764038315 766980438 769213257 770781784 771854401 772653580 773389359 774209747 775174408
893 775174408 776252747 777342224 778302689 778998795 779338455 779299088 778936157 778372192 777769012 777290878
903 777290878 777064896 777150497 777524338 778087845 778691940 779177322 779415054 779336166 778945007 778312531
913G78312531p56150p44324o07986l83987j27716R7808K34147K41928J10855j36109
923G76240997m46930p52716r86328j098862j074600r31167p18613n03159l52554l18603
933G69057465m26102o66123j000137j367493j700363j939621k048721k023468j894989
942G55990448j722565j580200j536560j635742j881027k226487k582244k828598k842484
951G37154541k529984j856079q64181L22189J525574K553024L248062L526688L395615
960G46475449K939529K289581J583405R34296M14505N8441j30463j68228q7433O3324
970G54372406K24304L31650L33328K07825k9526l27453o15998q30002r29718r11407
980G51825409q08334o75431n74112n53207o38351q25501j084976j367340j618042j790238
$$ plain form
913 778312531 777556381 776812057 776204071 775820084 775692368 775790176 776024323 776266251 776377106 776240997
923 776240997 775794067 775041351 774055023 772956161 771881561 770950394 770231781 769728622 769376068 769057465
933 769057465 768631363 767965240 766965103 765597610 763897247 761957626 759908905 757885437 755990448
942 755990448 754267883 752687683 751151123 749515381 747634354 745407867 742825623 739997025 737154541
951 737154541 734624557 732768478 731904297 732226486 733752060 736305084 739553146 743079834 746475449
960 746475449 749414978 751704559 753287964 754222260 754636765 754695206 754564743 754396515 754309082 754372406
970 754372406 754596710 754928360 755261688 755469513 755439987 755112534 754496536 753666534 752736816 751825409
980 751825409 751017075 750341644 749767532 749214325 748575974 747750473 746665497 745298157 743680115 741889877
990G41889877j856613j818390j702957j557541j436844j390304j453095j638565j935196
999G27100372k306137k693252l028107l248596l316879l231888l025589k748261k445526
1008G01056137k144089j856689j599274j410293j353302j486512j821594k283172k710190
1017F84391022k902146k701339k069550j116714o7902Q26263J386185J567688J459580
1026F80773087J225738J022873R35287R54819J007614J002655Q77381O20117K61993
1035F88681564j41754n34668q69903j114121j245346j252518j138153r22012o38886
1044F80824203l37753p2708J05515J57089N9357j86921n59921j017227j507340j980972
1054F75483322k403335k763672l073273l362122l667373m021836m448776m955139n533371
$$ plain form
990 741889877 740033264 738214874 736511917 734954376 733517532 732127228 730674133 729035568 727100372
999 727100372 724794235 722100983 719072876 715824280 712507401 709275513 706249924 703501663 701056137
1008 701056137 698912048 697055359 695456085 694045792 692692490 691205978 689384384 687101212 684391022
1017 684391022 681488876 678787537 676717987 675601273 675533371 676359634 677745819 679313507 680773087
1026 680773087 681998825 683021698 683956985 684911804 685919418 686922073 687799454 688419571 688681564
1035 688681564 688539810 688005142 687135239 686021118 684775772 683523254 682385101 681463089 680824203
1044 680824203 680486450 680413742 680519257 680676346 680735703 680548782 679988861 678971634 677464294 675483322
1054 675483322 673079987 670316315 667243042 663880920 660213547 656191711 651742935 646787796 641254425
1063F41254425o165619o828499p502899q180504q869590r595299j0394402j1305427
1071E72412186j2359963j3571014j4928398j6393814j7899933j9351960k0631256k1607627
1079D35668221k2154351k2166710k1578827k0367927j8550491j6167088j3271275r926452
1087B91485100o222439k302971J605473N189647Q086167R965000J0643902J0193729
1095C28643608Q986588P645835O895371P338028R245682J2439270J6321373K0055771
1103D17571526K2833442K4122010K3800430K2140045J9652443J6888122J4277154J2062721
1111E73347893J0330124R079475Q282509P892876P823562P927437Q020401P947426
1119F40651703P654877P224807O836167O671600O811752P180558P568359P721786P454529
$$ plain form
1063 641254425 635088806 628260307 620757408 612576904 603707314 594112015 583717613 572412186
1071 572412186 560052223 546481209 531552811 515158997 497259064 477907104 457275848 435668221
1079 435668221 413513870 391347160 369768333 349400406 330849915 314682827 301411552 291485100
1087 291485100 285262661 282959690 284565163 289754810 297840977 307805977 318449879 328643608
1095 328643608 337630196 345276031 352171402 359509430 368755112 381194382 397515755 417571526
1103 417571526 440404968 464526978 488327408 510467453 530119896 547008018 561285172 573347893
1111 573347893 583678017 592757492 601040001 608932877 616756439 624683876 632704277 640651703
1119 640651703 648306580 655531387 662367554 669039154 675850906 683031464 690599823 698321609 705776138
1128G05776138O719666N616073M331513L059845J934509J002960K44751l94210r70994
1137G27320251j531906k115020k749253l444748m166946m819565n247574n273437m762650
1146F93209152l691559k183609m96673J044540K142945K614212K430343J706543O44608
1155F97420502n36194j660690k628251l421096m095917m764862n561218o587906p852097
1164F60312271r210739j0361328j0903893j0468254q864708o195984k871475M93012
1172F01928902L259277M965706N465622M951439L867454K740708K000160J844559K195816
1181F33219643K753143L118629K950516K093811O35300j125565k787018l986167m518128
1190F32354164m390602l798180l035240k392578k078285k186279k712098l593063m747620
$$ plain form
1128 705776138 712495804 718111877 722443390 725503235 727437744 728440704 728685455 728291245 727320251
1137 727320251 725788345 723673325 720924072 717479324 713312378 708492813 703245239 697971802 693209152
1146 693209152 689517593 687333984 686837311 687881851 690024796 692639008 695069351 696775894 697420502
1155 697420502 696884308 695223618 692595367 689174271 685078354 680313492 674752274 668164368 660312271
1164 660312271 651101532 640740204 629836311 619368057 610503349 604307365 601435890 601928902
1172 601928902 605188179 610153885 615619507 620570946 624438400 627179108 629179268 631023827 633219643
1181 633219643 635972786 639091415 642041931 644135742 644771042 643645477 640858459 636872292 632354164
1190 632354164 627963562 624165382 621130142 618737564 616659279 614473000 611760902 608167839 603420219
1199F03420219o098861p579880r131432j0699958j2239266j3718719j5123711j6454773
1207E12373619j7717094j8910637k0021668k1019020k1852531k2451172k2719421k2533379
1215C45148697k1746521k0211277j7827549j4602871j0709877o504231k475891Q67939
1223B51938419L161927M321594M600639M527989M734249N732650P738209J0601902
1231B97357578J3877945J6996556J9458160K0977516K1526413K1280708K0516091J9501304
1239D51492271J8436165J7437973J6560364J5819283J5209426J4703713J4250374J3777733
1247E77687302J3206405J2471772J1538047J0404549R098015P659416O133575M561921
1255F52761002K984542J438828l8452j413193k654877l734588m622116n285492n698471
$$ plain form
1199 603420219 597321358 589741478 580610046 569910088 557670822 543952103 528828392 512373619
1207 512373619 494656525 475745888 455724220 434705200 412852669 390401497 367682076 345148697
1215 345148697 323402176 303190899 285363350 270760479 260050602 253546371 251070480 251938419
1223 251938419 255100346 259421940 264022579 268550568 273284817 279017467 286755676 297357578
1231 297357578 311235523 328232079 347690239 368667755 390194168 411474876 431990967 451492271
1239 451492271 469928436 487366409 503926773 519746056 534955482 549659195 563909569 577687302
1247 577687302 590893707 603365479 614903526 625308075 634406090 642065506 648199081 652761002
1255 652761002 655745544 657184372 657145920 655732727 653077850 649343262 644721146 639435654 633737183
1264F33737183n852204n772934n531463n242005n046921n090141n489464o313934p570305
1273E81827812r196129j1063385j2985229j4734650j6073265j6786499j6725006j5832520
1281D68431129j4160842j1861763r158135o302147l525352r93462J226463L169403
1289D26825294M946290O685943Q469925J0284119J2013931J3481560J4509239J4968300
1297E12184601J4789276J3929024J2334900R942321O741906K887649j213379m905739
1305E66690559p422943q128891o762657l574524P19757N161667Q848839J1188965J2002983
1314E78723755J1459846R899483P648735M919815J822968j537094m953919q066749
1322E99916840j0395890j1452026j0878182q567962m725151J56517N390014J0238572
$$ plain form
1264 633737183 627884979 622112045 616580582 611338577 606291656 601201515 595712051 589398117 581827812
1273 581827812 572631683 561568298 548583069 533848419 517775154 500988655 484263649 468431129
1281 468431129 454270287 442408524 433250389 426948242 423422890 422429428 423655891 426825294
1289 426825294 431771584 438457527 446927452 457211571 469225502 482707062 497216301 512184601
1297 512184601 526973877 540902901 553237801 563180122 569922028 572809677 571596298 566690559
1305 566690559 559267616 551138725 544376068 540801544 541521301 546682968 555531807 566720772 578723755
1314 578723755 590183601 600083084 607731819 612651634 614474602 612937508 607983589 599916840
1322 599916840 589520950 578068924 567190742 558622780 553897629 554054146 559444160 569682732
1330E69682732J4074783J6507988J7443619J7061920J5727081J3864441J1851502R952011
1338F86166077Q304977O947937N850983M946518M150467L381958K589111J765900R55658
1347G25059586K25982l70102q28552j193695j532974j900177k326279k851639l576431
1356G10705719m682999o376342q747635j1616211j4447785j6432647j6733704j4817886
1364F16850510j0725747n142898P80296N793953Q948174R860038Q750725O267395L190232
1373F44572678J67923k419815m449578n942650o941299p438812p388382o764374n622902
1382E97772789m122734k491341r53331L40462J350670K135620K793884L395539L930282
1391F04151840M304924M385872M068489L337784K288666J096382m6578r95407j689605
$$ plain form
1330 569682732 583757515 600265503 617709122 634771042 650498123 664362564 676214066 686166077
1338 686166077 694471054 701418991 707269974 712216492 716366959 719748917 722338028 724103928 725059586
1347 725059586 725285568 724915466 724086914 722893219 721360245 719460068 717133789 714282150 710705719
1356 710705719 706022720 699646378 690898743 679282532 664834747 648402100 631668396 616850510
1364 616850510 606124763 600981865 601762161 607556114 616504288 626364326 635115051 641382446 644572678
1373 644572678 644740601 642320786 637871208 631928558 624987259 617548447 610160065 603395691 597772789
1382 597772789 593650055 591158714 590205383 590545845 591896515 594032135 596826019 600221558 604151840
1391 604151840 608456764 612842636 616911125 620248909 622537575 623633957 623587379 622591972 620902367
1400F20902367k150383k446175k656288k845192l059998l336296l698158m148865m656677
1409E91904335n155830n566025n827408n929069n911904n837364n741272n597496n318794
1418E41019173m794999l955993k819710j503029j87034R48333J788254K315140K596741
1427E35406876K738456K823563K870712K829972K613525K151642J438904N52177l66020
1436E53059807j158295j704597j959801j963081j816369j650657j589279j716118k055168
1445E37446442k561036l127059l620263l936081m057769m082566m192276m561882n245552
1454E02061958o102295o809196o977158o318550m783020k590713j40534K156525M032402
1463D74529419N426788O438904P211380P817574Q225326Q338394Q087654P498475O699180
$$ plain form
1400 620902367 618751984 616305809 613649521 610804329 607744331 604408035 600709877 596561012 591904335
1409 591904335 586748505 581182480 575355072 569426003 563514099 557676735 551935463 546337967 541019173
1418 541019173 536224174 532268181 529448471 527945442 527758408 528706741 530494995 532810135 535406876
1427 535406876 538145332 540968895 543839607 546669579 549283104 551434746 552873650 553425827 553059807
1436 553059807 551901512 550196915 548237114 546274033 544457664 542807007 541217728 539501610 537446442
1445 537446442 534885406 531758347 528138084 524202003 520144234 516061668 511869392 507307510 502061958
1454 502061958 495959663 489150467 482173309 475854759 471071739 468481026 468340492 470497017 474529419
1463 474529419 479956207 486395111 493606491 501424065 509649391 517987785 526075439 533573914 540273094
1472E40273094N867157N150414M614639M239578L959885L718834L505096L353005L315735
1481E77997437L428993L684845M029884M387131M695625M944038N185204N509338N986252
1490F19848747O597786P207184P590256P534027O952286N955734M824066L879471L323593
1499F73713150L124313L020172K641221J688308P1945k045822m318618o333313p716065
1508F63845291q190613p595214n891877l198547J83639L774033O997528R330292J0456467
1517F69710999J0360336R306412P719192O025696M534454L390732K606888K117386
1525G15772095J831207J655502J508484J341171J158295J024857J035461J246033J606979
1534G28180084J946182K022400J642228P71942m17328j601029k436065k701874k388535
$$ plain form
1472 540273094 546140251 551290665 555905304 560144882 564104767 567823601 571328697 574681702 577997437
1481 577997437 581426430 585111275 589141159 593528290 598223915 603167953 608353157 613862495 619848747
1490 619848747 626446533 633653717 641243973 648778000 655730286 661686020 666510086 670389557 673713150
1499 673713150 676837463 679857635 682498856 684187164 684259109 682213287 677894669 671561356 663845291
1508 663845291 655654678 648059464 642167587 638969040 639152679 642926712 649924240 659254532 669710999
1517 669710999 680071335 689377747 697096939 703122635 707657089 711047821 713654709 715772095
1525 715772095 717603302 719258804 720767288 722108459 723266754 724291611 725327072 726573105 728180084
1534 728180084 730126266 732148666 733790894 734562836 734145508 732544479 730108414 727406540 725018005
1543G25018005j685257q84552k50244Q6441J63803J48850K40250N58166J065521J560364
1553G26021347J747437J372451L66440j079864k548981l555145l756104l121033j958389
1562G13488159p83233p4082n4092o02722j347962j882324j982651j707229j331482
1571G03722382j158600j335678j767502k178879k277145j913605j157761k53143N10178
1580F92190247R25674R41620O45828J94626k68326o63681r82361j258621j532669j824112
1590F88368225k121735k391662k594757k712555k758942k780914k837982k974015l194961
1599F64000702l472138l766937m062195m371566m719162n091973n408439n528946n322380
1608F22256966m752274l932495l107796k559433k479744k885208l615722m421998n088157
$$ plain form
1543 725018005 723332748 722448196 722197952 722284393 722448196 722597046 722837296 723395462 724460983 726021347
1553 726021347 727768784 729141235 729507675 728427811 725878830 722323685 718567581 715446548 713488159
1562 713488159 712704926 712630844 712576752 711974030 710626068 708743744 706761093 705053864 703722382
1571 703722382 702563782 701228104 699460602 697281723 695004578 693090973 691933212 691680069 692190247
1580 692190247 693115921 694057541 694703369 694897995 694629669 693965988 692983627 691725006 690192337 688368225
1590 688368225 686246490 683854828 681260071 678547516 675788574 673007660 670169678 667195663 664000702
1599 664000702 660528564 656761627 652699432 648327866 643608704 638516731 633108292 627579346 622256966
1608 622256966 617504692 613572197 610464401 607904968 605425224 602540016 598924294 594502296 589414139
1617E89414139n525818n792351o034927o398087o949959p656173q406372r066735r532241
1626E24051476r766198r813957r797211r886550j0246621j0973549j2041015j3289147
1634D38237228j4467620j5324479j5700492j5585824j5109825j4473991j3857651j3343239
1642C20374107j2884121j2322807j1442146j0026398p917843n058365j510181K549000
1650B61761246O854381J1102581J5000916J8303261K0825843K2449227K3121071K2866363
1658D02284889K1796494K0101089J8009224J5727730J3391457J1048164Q697739O353111
1666E17409897M085998K019425K70347j113891k181511l036575l760987m355087m743538
1675E04594078m855843m722976m525337m543190n028153o066666p518653r076271j0406342
$$ plain form
1617 589414139 583888321 578095970 572061043 565662956 558712997 551056824 542650452 533583717 524051476
1626 524051476 514285278 504471321 494674110 484787560 474540939 463567390 451526375 438237228
1634 438237228 423769608 408445129 392744637 377158813 362048988 347574997 333717346 320374107
1642 320374107 307489986 295167179 283725033 273698635 265780792 260722427 259212246 261761246
1650 261761246 268615627 279718208 294719124 313022385 333848228 356297455 379418526 402284889
1658 402284889 424081383 444182472 462191696 477919426 491310883 502359047 511056786 517409897
1666 517409897 521495895 523515320 523785667 522671776 520490265 517453690 513692703 509337616 504594078
1675 504594078 499738235 495015259 490489922 485946732 480918579 474851913 467333260 458256989 447850647
1684D47850647j1309090j1799049j2076263j2416840j3040466j4032135j5336037j6805153
1692C41035614j8258743j9516144k0395260k0709858k0282154j8991318j6834354j3963242
1700A92084541j0672187p324334m246044j631641N01098K283535L912220N538922P185497
1709A87631607Q715077R872627J0377064J0029010Q792343O823616M440728K050304
1717B48732376N9433j200199j519699q29506Q06522L212529O132431R269237J2326412
1726B76989536J5052853J7272873J8904075J9949608K0475655K0576363K0341339J9834747
1734D29397049J9091721J8133621J6992035J5729522J4447022J3262367J2275314J1525765
1742E50854416J0972786J0507507R999046R355813Q569297P722283O948356O371956
$$ plain form
1684 447850647 436541557 424742508 412666245 400249405 387208939 373176804 357840767 341035614
1692 341035614 322776871 303260727 282865467 262155609 241873455 222882137 206047783 192084541
1700 192084541 181412354 174088020 169841976 168210335 168711433 170994968 174907188 180446110 187631607
1709 187631607 196346684 206219311 216596375 226625385 235417728 242241344 246682072 248732376
1717 248732376 248791809 247591610 246071911 245242405 246048927 249261456 255393887 264663124 276989536
1726 276989536 292042389 309315262 328219337 348168945 368644600 389220963 409562302 429397049
1734 429397049 448488770 466622391 483614426 499343948 513790970 527053337 539328651 550854416
1742 550854416 561827202 572334709 582333755 591689568 600258865 607981148 614929504 621301460
1750F21301460O050492N951271N972290N988235N899964N662536N286484M821320M336166
1759F71270218L907394L611145L506546L613587L886871M207687M411545M345322L935089
1768G06695404L227463K382126J612472J103592R43909J102905J458206J851273K147674
1777G22525024K268677K200546J982193J689530J414947J246338J239548J388626J618958
1786G37574387J805877J828537J632157J263122Q59528N84411N46341P39899J047745
1795G47882004J301880J371536J231689R71909P46918O90002Q46710J152878J472321
1804G57667847J664581J649857J436843J105271P61566M94308L46375L20358L92151
1813G65839157N32608P14798R10034J086655J211929J262818J236496J152038J038742
$$ plain form
1750 621301460 627351952 633303223 639275513 645263748 651163712 656826248 662112732 666934052 671270218
1759 671270218 675177612 678788757 682295303 685908890 689795761 694003448 698414993 702760315 706695404
1768 706695404 709922867 712304993 713917465 715021057 715964966 717067871 718526077 720377350 722525024
1777 722525024 724793701 726994247 728976440 730665970 732080917 733327255 734566803 735955429 737574387
1786 737574387 739380264 741208801 742840958 744104080 744963608 745548019 746094360 746834259 747882004
1795 747882004 749183884 750555420 751787109 752759018 753505936 754195938 755042648 756195526 757667847
1804 757667847 759332428 760982285 762419128 763524399 764285965 764780273 765126648 765447006 765839157
1813 765839157 766371765 767086563 767996597 769083252 770295181 771557999 772794495 773946533 774985275
1822G74985275R18274P93915O55060M95071L26996J87225J16196J31989K15149L16314
1832G79141464L87192M16260M35562N01938O47888Q48541J017990J052170Q90656N59158
1842G85898819J66397j48010k86026k37656q0032P4844J44425J20391O0883M6692J23825
1853G85884552K74506M28848N08423M76150L57666K27890J66016K10495L34396M58985
1863G89327927M94232L86581J46637j52893m12826n54352n52979m45709l07159k10495
1873G87718964j91574k38953l04947l38135l06015k08359p2326O4239J64566K00806
1883G86488266J58463L6849j45492l49655n23529o17295o05545m98199l37143j79977
1893G83426743p2861l8452p2251j54419k61306l72086m66614n26046n35355m94232
$$ plain form
1822 774985275 775903549 776697464 777352524 777847595 778174591 778361816 778478012 778610001 778825150 779141464
1832 779141464 779528656 779944916 780380478 780882416 781530304 782378845 783396835 784449005 785339661 785898819
1842 785898819 786065216 785917206 785631180 785393524 785313492 785388336 785532761 785653152 785714035 785760727 785884552
1853 785884552 786159058 786587906 787096329 787572479 787930145 788158035 788324051 788534546 788868942 789327927
1863 789327927 789822159 790208740 790355377 790202484 789789658 789235306 788682327 788236618 787929459 787718964
1873 787718964 787527390 787288437 786983490 786645355 786339340 786130981 786058655 786122894 786287460 786488266
1883 786488266 786646729 786683578 786538086 786188431 785664902 785047607 784442062 783943863 783606720 783426743
1893 783426743 783353882 783315430 783243179 783088760 782827454 782455368 781988754 781462708 780927353 780433121
1903G80433121m22211l51791l11661l05786Tk64817j45797N1040K84043M89654O18744
1914G79768753O61087O48804O33087O47964O90384P22428O97174N88608M10003K06604
1924G85674896L5095o4010p8812k4566O9580J75323K75116L62091M33197M85153N08652
1935G87851715M90799M20837K97089J35117l2730j64109k21863j90429q6060M6692
1945G88547058J52893J87683J36795J8769j24131k47039l19443l31650k91901k15377
1955G87513657j15967m654J06888K02789K62604K67639K10724J02920k5634j35041
1965G88385925j87225j60599n8670R2774K52380L77426M37775M22210L41034K19345
1975G90122375Q7891k4414r7122j18942q6213m272J13525K44599L58658M22897M12216
$$ plain form
1903 780433121 780010910 779659119 779347458 779041672 778735886 778471069 778325272 778376312 778660355 779150009 779768753
1914 779768753 780429840 781078644 781711731 782359695 783050079 783772507 784469681 785058289 785468292 785674896
1924 785674896 785709991 785645981 785567169 785542603 785612183 785787506 786062622 786424713 786857910 787343063 787851715
1935 787851715 788342514 788763351 789060440 789195557 789162827 788998718 788776855 788586426 788500366 788547058
1945 788547058 788699951 788887634 789024429 789043198 788919067 788672028 788352585 788020935 787729034 787513657
1955 787513657 787397690 787393036 787499924 787702713 787965317 788232956 788443680 788546600 788520966 788385925
1965 788385925 788198700 788038101 787979431 788072205 788324585 788702011 789139786 789561996 789903030 790122375
1975 790122375 790210266 790185852 790088730 789969788 789883575 789879303 789992828 790237427 790596085 791018982 791431198
1986G91431198L17154J52054m7302k32468l57590l92990l34778k06375m8446R4451
1996G90374908J85776K09046J67236P7438l5019j46179k36587k90985l00751k61460
2006G89743423j77078o1340O2408J64872K19116K08587J34354J4496j18713k29874
2016G89960251k88925k80915k08130q9645M4022J59607K29721K39105J87683R0179
2026G90042953k9449j42899k26516k62833k46353j82800q7509J7318J06583J59073
2036G89147568J59836J08032J2436j05515k20337l06244l46298l33404k74048j85623
2046G87656403r1095j4573K4338J6098l8757j28021k31705l26080l88337m03442l66287
2057G85708542k86102j81046p7743P6L5019K2125l1586j09100j87378k45743k64816
$$ plain form
1986 791431198 791748352 791900406 791853104 791620636 791263046 790870056 790535278 790328903 790280457 790374908
1996 790374908 790560684 790769730 790936966 791014404 790979385 790833206 790596619 790305634 790004883 789743423
2006 789743423 789566345 789505005 789567413 789732285 789951401 790159988 790294342 790308838 790190125 789960251
2016 789960251 789671326 789390411 789182281 789092636 789136658 789296265 789525986 789765091 789952774 790042953
2026 790042953 790013504 789870605 789644089 789381256 789134903 788952103 788864594 788881912 788988495 789147568
2036 789147568 789307404 789415436 789427872 789322357 789102020 788795776 788449478 788116074 787842026 787656403
2046 787656403 787565308 787550735 787575073 787591171 787552414 787424393 787192688 786866608 786478271 786074829 785708542
2057 785708542 785422440 785241394 785163651 785163727 785198746 785220871 785189285 785080185 784892807 784647064 784382248
2068G84382248k36282j59226m4174Q9798K17514L14484L61328L49426K84348J83181
2078G85742645P0572k7160q8578j02615o9351%Q5067J63651K14310K22396J83335J02310
2090G86496582n569j19782k17514k78168k87933k44293j56098m3640O6757J48850J84555
2101G85543747J67389J04217J2131q6365j69067k18887k25754j88751j15357k1667
2111G84801636P1640J42441J73416J55182R1629l663j08566j99737k57340k69470k34070
2122G84363098j59225n9738M2953J28250J77689J81579J38855O0654l4332j21994j80741
2133G84537048j96075j64566r4605l357Q7510J56707J89057J77231J23062L7918o1188
2144G84788742j52817k17895k42081k20261j58309p0801K1133R6741J38626J38321
$$ plain form
2068 784382248 784145966 783986740 783942566 784032364 784249878 784564362 784925690 785275116 785559464 785742645
2078 785742645 785813217 785786057 785697479 785594864 785525513 785525513 785610580 785774231 785988541 786210937 786394272 786496582
2090 786496582 786491013 786371231 786153717 785875549 785587616 785343323 785187225 785143585 785210342 785359192 785543747
2101 785543747 785711136 785815353 785827484 785741119 785572052 785353165 785127411 784938660 784823303 784801636
2111 784801636 784873276 785015717 785189133 785344315 785435944 785432281 785323715 785123978 784866638 784597168 784363098
2122 784363098 784203873 784144135 784187088 784315338 784493027 784674606 784813461 784874115 784839783 784717789 784537048
2133 784537048 784340973 784176407 784081802 784078445 784165955 784322662 784511719 784688950 784812012 784849930 784788742
2144 784788742 784635925 784418030 784175949 783955688 783797379 783726578 783747711 783844452 783983078 784121399
2154G84121399R5825K1057o8741j52740k11029k29492k04468j42746o1569J8921P8048
2165G83264465J03455R0561M3411k5635j02005j68991k12478k21939j94016j33209
2175G82443619n1041L5858J09864J57089J69067J45493R3994K6092m2495r6970j26648
2186G82863922j26190r8114n1804n34M1199O2790N7144K5253k7389r0256j51596j99280
2198G82305145k24533k23846j98975j56479j05819n6916j8539L662O561j0299m3030
2209G81276932q5221j28250j62506j81198j81808j66779j41830j15509r5749q9569
2219G79928513j00785j29699j72043k19727k61078k85797k86865k63748k21634j70212
2229G77816925j19095p6752m7531l2882l1357l9673n2109o2637o6147n8899m2496k0294
$$ plain form
2154 784121399 784217224 784238281 784169540 784016800 783805771 783576279 783371811 783229065 783167496 783186417 783264465
2165 783264465 783367920 783458481 783501892 783476257 783374252 783205261 782992783 782770844 782576828 782443619
2175 782443619 782392578 782428436 782538300 782695389 782864456 783009949 783103943 783130035 783087540 782990570 782863922
2186 782863922 782737732 782639618 782587814 782587280 782628479 782691269 782748413 782773666 782746277 782656021 782504425 782305145
2198 782305145 782080612 781856766 781657791 781501312 781395493 781338577 781320038 781323700 781330261 781319962 781276932
2209 781276932 781191711 781063461 780900955 780719757 780537949 780371170 780229340 780113831 780018082 779928513
2219 779928513 779827728 779698029 779525986 779306259 779045181 778759384 778472519 778208771 777987137 777816925
2229 777816925 777697830 777621078 777573547 777540665 777509308 777469635 777417526 777354889 777288742 777229843 777187347 777167053
2241G77167053K365K2583L9521N4855O9122P9422Q2245P2403M8447J3809k4872n8594
2253G77568359q0566q8120q2702o8894n0582l2578j5869k747O562J0757Q163k746k1210
2266G77147827m4174o5994q0567q3770p5684o1951m9057m2877m3411m5777m2495k9145
2278G76482925p858J4420K6703K1743j526l6926p3776j01624j14593j13525j04523
2289G75991440r7962j03302j25198j61972k03857k38114k52304k39868k02026j46103
2299G74220734q3008k2507K6550N7831O3324L6621k3498j10474k05688k83203l16468
2310G73360214k89001k02942q1177L6240J02463P9879m3564k41775m55170o08291o42167
2321G71014709n44128l63007j87149j04904j55868l07694m73938n62668n29098m00772
$$ plain form
2241 777167053 777169418 777192001 777231522 777286377 777355499 777434921 777517166 777589569 777638016 777651825 777626953 777568359
2253 777568359 777487793 777399673 777316971 777248077 777197495 777164917 777149048 777146301 777152863 777163620 777171783 777169037 777147827
2266 777147827 777103653 777037659 776957092 776873322 776797638 776735687 776686630 776643753 776600342 776554565 776512070 776482925
2278 776482925 776475067 776489487 776516190 776537933 776536407 776499481 776425705 776324081 776209488 776095963 775991440
2289 775991440 775893478 775790176 775664978 775503006 775299149 775061035 774808731 774568863 774366837 774220734
2299 774220734 774137726 774115219 774141769 774199600 774262924 774299545 774276047 774165573 773959885 773676682 773360214
2310 773360214 773071213 772868271 772787094 772823334 772925797 773005676 772962112 772720337 772265167 771656876 771014709
2321 771014709 770470581 770107574 769920425 769815521 769659653 769351959 768878021 768315353 767786255 767385483
2331G67385483k55661j71509j82190k69089l96881n57251p86896j127777j554565j922455
2341G60161209j985779j504593l90319J190414K829437M017716M356842L731079K355194
2350G74761200O72302q43124j870194k332611k366409k197189k016602j908112j856689
2359G60042572j803513j704711j556550j382522j204910j027756q39462o31638m12445
2368G49479065k03247k6016J14364K33155L56216N03311O79245Q71353J059494J223145
2378G54290085J346817J418762J428986J372299J250152J076050Q71887O63987M72793
2387G64191818L12042J85700R4376L7155J2893J6175L7460O2103P6371P1411M6615
2398G65144119R232l1281o5155q6899r4375q9493p6141o0349m7684m2953m6082n5236
$$ plain form
2331 767385483 767129822 766958313 766776123 766507034 766110153 765552902 764766006 763638229 762083664 760161209
2341 760161209 758175430 756670837 756280518 757470932 760300369 764318085 768674927 772406006 774761200
2350 774761200 775433502 774590378 772720184 770387573 768021164 765823975 763807373 761899261 760042572
2359 760042572 758239059 756534348 754977798 753595276 752390366 751362610 750523148 749891510 749479065
2368 749479065 749275818 749249802 749364166 749597321 749953537 750456848 751136093 752007446 753066940 754290085
2378 754290085 755636902 757055664 758484650 759856949 761107101 762183151 763055038 763719025 764191818
2387 764191818 764503860 764689560 764783936 764821091 764833984 764850159 764887619 764949722 765026093 765097504 765144119
2398 765144119 765153351 765122070 765056915 764970016 764875641 764786148 764710007 764649658 764601974 764559021 764512939 764457703
2410G64457703o6147p5836q4458r2621j01928j10779j14517j09330r4223p2097n0431
2421G63485336l5171l0060l3188l9978m4632m5090m0664l2883k3651j5717j0452j0681
2433G63123169j8387l4866n7526q1940j02233j14441j16806j11466j02005r2239q6899
2444G62204361q7433r5062j08643j24969j39237j45721j40762j23520r8038o9885m4937
2455G61026154k8534k1439k2812l1586m5089o2866q3237j03531j21307j33210j37329
2466G60235214j33972j25198j15052j07421j06125j12381j25733j43814j62353j76773
2476G58926392j83411j78375j60981j32675r8419o5536m2115l4103m3793o7596r8267
2487G57821121j26953j46866j55182j53961j46789j38855j33210j31454j35117j44043
$$ plain form
2410 764457703 764391556 764315720 764231262 764138641 764036713 763925934 763811417 763702087 763607864 763535767 763485336
2421 763485336 763450165 763420105 763386917 763346939 763302307 763257217 763216553 763183670 763160019 763144302 763133850 763123169
2433 763123169 763104782 763069916 763012390 762930450 762828217 762713776 762596970 762485504 762383499 762291260 762204361
2444 762204361 762116928 762021866 761913223 761788254 761649017 761503296 761362534 761239014 761140976 761071091 761026154
2455 761026154 760997620 760976181 760953369 760921783 760876694 760813828 760730591 760627060 760505753 760372543 760235214
2466 760235214 760101242 759976044 759860992 759753571 759647446 759535065 759409332 759265518 759103165 758926392
2476 758926392 758742981 758564606 758403625 758270950 758172531 758106995 758064880 758030777 757986984 757919388 757821121
2487 757821121 757694168 757547302 757392120 757238159 757091370 756952515 756819305 756687851 756552734 756408691
2497G56408691j58767j77002j95313k08893k13241k07138j91651j70211j47019j23825
2507G54615631j01852q2627o6986n8899o1035p4386r5826j21002j42364j55793j58386
2518G53496475j51138j37100j20087j03683r2011q6899q9874j00174j13831j26419
2528G52375259j32293j28937j15128r2926o6909m2267k3194j2664j1521j8997l2272
2539G51698151m6463n8899o6376o8817o6986o2561n7221n0888m4555l9216l6010l6927
2551G51063232m3411n4397o7597p9574q7891r1248r0255q6518q1787p7438p4234p3166
2563G50155716p5302q1940r3078j07117j21384j31607j34582j29700j18866j06735
2573G49055405r6970r2239r3308r7885j04294j10855j17493j25732j37100j52207j70288
$$ plain form
2497 756408691 756249924 756072922 755877609 755668716 755455475 755248337 755056686 754886475 754739456 754615631
2507 754615631 754513779 754431152 754364166 754305267 754244232 754169846 754074020 753953018 753810654 753654861 753496475
2518 753496475 753345337 753208237 753088150 752984467 752892456 752805557 752715683 752615509 752501678 752375259
2528 752375259 752242966 752114029 751998901 751905975 751839066 751796799 751773605 751760941 751749420 751730423 751698151
2539 751698151 751651688 751592789 751526413 751457596 751390610 751328049 751270828 751219940 751175385 751136169 751100159 751063232
2551 751063232 751019821 750965424 750897827 750818253 750730362 750639114 750548859 750462341 750380554 750303116 750228882 750155716
2563 750155716 750080414 749998474 749905396 749798279 749676895 749545288 749410706 749281006 749162140 749055405
2573 749055405 748958435 748866196 748772888 748675003 748570709 748459854 748342361 748216629 748079529 747927322 747757034
2584G47757034j89895k08741k25067k37655k45972k49405k47726k41242k30942k18505
2594G45461884k07139j98745j95542j98364k05688k15531k23541k25830k18582k01569
2604G43371353j76697j50375j29013j18713j21384j35498j56250j78375j96305k07367
2614G41801376k09121k00653j81351j52741j18332q5372o0807n0888n7144p7133j02005
2625G40505829j24207j35345j31912j14060q4305m8370j1597K0523M3030N1499M4021
2636G40015106K0294j5945n7526r5977j21460j27411j11695p9116l7766R92K7695L6315
2648G39453506K4949l357m3869q9951j34125j68838j86234j82266j55716j13449o6071
2659G38334579k6092n417r537l7918q4228j39008j91879k33460k55737k54517k30636
$$ plain form
2584 747757034 747567139 747358398 747133331 746895676 746649704 746400299 746152573 745911331 745680389 745461884
2594 745461884 745254745 745056000 744860458 744662094 744456406 744240875 744017334 743791504 743572922 743371353
2604 743371353 743194656 743044281 742915268 742796555 742675171 742539673 742383423 742205048 742008743 741801376
2614 741801376 741592255 741391602 741210251 741057510 740939178 740853806 740792999 740742111 740684967 740607834 740505829
2625 740505829 740381622 740246277 740114365 740000305 739916000 739867630 739856033 739876556 739919586 739971085 740015106
2636 740015106 740035400 740019455 739961929 739865952 739744492 739617081 739505386 739426270 739388504 739389496 739417191 739453506
2648 739453506 739478455 739475098 739431229 739341278 739207153 739038315 738852081 738669815 738514099 738400650 738334579
2659 738334579 738308487 738303070 738293533 738255615 738171387 738032379 737840500 737607040 737351303 737096786 736866150
2670G36866150j88980j40839r7656p0953o6681q5144j20621j64795k08740k45285k68479
2681G35207977k74048k60620k29797j86539j41296j05438q9646r9411j33667j84250
2691G33503265k38647k84195l10822l14483k96860k64511k28195j97296j80970j84402
2701G31002884k07596k46658k95182l43933l84369m09622m15344m01916l73688l37677
2711G27586899l05481k87399k90680l17994l64990m22210m76838n17273n37109n35431
2721G23531494n18646m97360m81110m78363m91791n18951n53284n84946o03561n98984
2731G18204498n65033n00793m12750l13111k17209j38778q6975o3019o2027p6752j00403
2742G15667648j28174j58386j88904k15911k35749k43988k40631k30102k19803k18506
$$ plain form
2670 736866150 736677170 736536331 736438675 736367722 736301041 736215897 736095276 735930481 735721741 735476456 735207977
2681 735207977 734933929 734673309 734443512 734256973 734115677 734010239 733920593 733821182 733687515 733503265
2691 733503265 733264618 732980423 732669601 732355118 732058258 731793747 731565552 731368256 731187286 731002884
2701 731002884 730795288 730548630 730253448 729909515 729525146 729115524 728700180 728298264 727924576 727586899
2711 727586899 727281418 726994019 726703339 726385345 726020355 725598145 725121307 724604034 724066925 723531494
2721 723531494 723012848 722515488 722034378 721556015 721064224 720545273 719991989 719407043 718803482 718204498
2731 718204498 717639465 717138672 716725922 716412811 716195602 716056824 715969849 715906830 715844803 715768051 715667648
2742 715667648 715539474 715381088 715192184 714976273 714740524 714496536 714255905 714025803 713806000 713587494
2752G13587494k30942k58636k95868l35312l69110l90930l98941l94211l80554l64228
2762G10168762l50799l45154l50647l67127l93295m25568m59594m91028n15442n29175
2772G05940933n29938n18188m96368m71573m50897m40827m45480m63105m88281n14526
2782G01121750n35202n48706n54657n56488n56565n55267n51758n44204n32837n19028
2792F95667038n05905m96292m89350m81109m65775m38690l98636l50265l02048k64282
2802F91474686k45056k48719k73742l15094l64075m11759m48684m66919m63410m38842
2812F87798386l99475l55149l16086k90985k83279k92053l13111l40500l68576l92685
2822F84446487m10385m18930m18472m11987m04969m04968m20990m58832n19943o01196
$$ plain form
2752 713587494 713356552 713097916 712802048 712466736 712097626 711706696 711307755 710913544 710532990 710168762
2762 710168762 709817963 709472809 709122162 708755035 708361740 707936172 707476578 706985550 706470108 705940933
2772 705940933 705410995 704892807 704396439 703924866 703473969 703033142 702587662 702124557 701636276 701121750
2782 701121750 700586548 700037842 699483185 698926697 698370132 697814865 697263107 696718903 696186066 695667038
2792 695667038 695161133 694664841 694175491 693694382 693228607 692789917 692391281 692041016 691738968 691474686
2802 691474686 691229630 690980911 690707169 690392075 690028000 689616241 689167557 688700638 688237228 687798386
2812 687798386 687398911 687043762 686727676 686436691 686153412 685861359 685548248 685207748 684839172 684446487
2822 684446487 684036102 683617172 683198700 682786713 682381744 681976776 681555786 681096954 680577011 679975815
2832F79975815o93588p86057q67767r30100r68933r86862r91135r93652j006088j037216
2842F70714417j090470j162033j242828j322251j390152j441421j473770j488877j490249
2851F58612366j480942j465988j451874j445160j453476j479874j522293j571350j613693
2860F45127716j635666j627960j588211j520996j435890j344643j258354j187515j140709
2869F32387772j123772j138039j177368j228714j274910j300468j298714j274300j243286
2878F21328201j225815j239547j290436j375237j480484j591644j695633j785927j859665
2887F07783813j916351j955681j977501j983490j977195j968041j965904j979561k012291
2896E90047798k060585k111740k150040k157707k122383k039680j914788j762542j604043
$$ plain form
2832 679975815 679282227 678496170 677628403 676698303 675729370 674742508 673751373 672757721 671751633 670714417
2842 670714417 669623947 668461914 667219086 665896835 664506683 663065262 661591492 660102615 658612366
2851 658612366 657131424 655665436 654213562 652768402 651314926 649835052 648312759 646741409 645127716
2860 645127716 643492050 641864090 640275879 638754883 637318993 635974350 634715996 633528481 632387772
2869 632387772 631264000 630125961 628948593 627719879 626444969 625144501 623845787 622571487 621328201
2878 621328201 620102386 618862839 617572403 616197166 614716682 613125038 611429405 609643478 607783813
2887 607783813 605867462 603911781 601934280 599950790 597973595 596005554 594039650 592060089 590047798
2896 590047798 587987213 585875473 583725433 581567726 579445343 577405663 575490875 573728333 572124290
2905E72124290j463699j365089j326752j359596j462136j619262j804009j979561k108688
2914E57635498k160912k120780j991272j792946j556816j316529j102600r35592q26684
2923E43831367p77091p80602q21991q80165r29833r44633r05190q03375o47773m60206
2933E35880508k71682j10245N226P2937J04141J17913J30577J49612J69106J74408
2943E36422501J47323P5379m5624k08969l99056n92956p64427q84819r26705q68339
2953E31954308p00341m29649q4038K92168O46057R26819J095848J136169J051369Q63113
2963E36751823O03524L06472Q78k92320n62287q05054j022720j219940j400070j560478
2973E30799828j688767j759300j736107j578064j255188p59735j19667O03027J321106
$$ plain form
2905 572124290 570660591 569295502 567968750 566609154 565147018 563527756 561723747 559744186 557635498
2914 557635498 555474586 553353806 551362534 549569588 548012772 546696243 545593643 544658051 543831367
2923 543831367 543054276 542273674 541451683 540571518 539641685 538697052 537791862 536988487 536340714 535880508
2933 535880508 535608826 535498581 535503807 535576744 535680885 535798798 535929375 536078987 536248093 536422501
2943 536422501 536569824 536645203 536599579 536390610 535991554 535398598 534634171 533749352 532822647 531954308
2953 531954308 531253967 530824318 530740280 531032448 531678505 532605324 533701172 534837341 535888710 536751823
2963 536751823 537355347 537661819 537662697 537370377 536808090 536003036 534980316 533760376 532360306 530799828
2973 530799828 529111061 527351761 525615654 524037590 522782402 522022667 521903000 522506027 523827133
2982E23827133J943741K398987K652092K710800K619057K441864K244949K082100J986923
2991E44907646J974106K043648K187156K389107K629128K880096L109780L285713L380089
3000E68786469L378257L281327L105506K877388K625046K370568K125320J889877J657067
3009E92096825J418380J167908R06181O39573L78227J33056q5792k71187m20341n33333
3019E95429497o15654o76499p26585p77245q34617q97026r54247r88655r80797r17167
3029E87061005p96051o30074m44183k68555j30386m9286l2997q0872j86615l40309
3039E84101677n30586p42188r56802j154137j316376j433944j508942j553345j585884
3048E73319473j623382j675568j740723j807022j858177j878471j859360j802330j718140
$$ plain form
2982 523827133 525770874 528169861 530821953 533532753 536151810 538593674 540838623 542920723 544907646
2991 544907646 546881752 548925400 551112556 553501663 556130791 559010887 562120667 565406380 568786469
3000 568786469 572164726 575446053 578551559 581428947 584053993 586424561 588549881 590439758 592096825
3009 592096825 593515205 594683113 595589294 596228867 596607094 596740150 596654358 596383171 595962830 595429497
3019 595429497 594813843 594137344 593410759 592633514 591798897 590901871 589947624 588958969 587978172 587061005
3029 587061005 586264954 585634880 585190697 584922142 584791756 584742470 584709473 584628601 584441986 584101677
3039 584101677 583571091 582828903 581872101 580717964 579401588 577967644 576458702 574905357 573319473
3048 573319473 571696091 570020523 568279800 566472778 564614601 562736130 560876770 559074440 557356300
3057E57356300j624221j539803j480293j456642j471749j524353j609916j722336j853028
3066E43073959j991691k125054k237320k316703k357102k363968k351684k340241k348022
3075E22642174k385025k450562k534408k621880k699470k756920k789383k793923k769851
3084D98840752k718087k642974k553025k460365k376442k306976k249298k191506k120514
3093D77221565k027855j914711j793441j681176j591682j530075j491013j462097j432266
3102D62297249j395645j353112j308708j264381j216431j155090j069336r51157p99789
3111D51783600o22368m31099k40402o2332R4986K28653L42445M44984N48935O68145
3121D52755547Q13140R87626J185646J393432J592827J766396J903572K003288K072372
$$ plain form
3057 557356300 555732079 554192276 552711983 551255341 549783592 548259239 546649323 544926987 543073959
3066 543073959 541082268 538957214 536719894 534403191 532046089 529682121 527330437 524990196 522642174
3075 522642174 520257149 517806587 515272179 512650299 509950829 507193909 504404526 501610603 498840752
3084 498840752 496122665 493479691 490926666 488466301 486089859 483782883 481533585 479342079 477221565
3093 477221565 475193710 473278999 471485558 469804382 468212700 466682625 465191612 463729515 462297249
3102 462297249 460901604 459548492 458239784 456975403 455758972 454603882 453534546 452583389 451783600
3111 451783600 451161232 450730133 450489731 450427399 450522385 450751038 451093483 451538467 452087402 452755547
3121 452755547 453568687 454556313 455741959 457135391 458728218 460494614 462398186 464401474 466473846
3130D66473846K122002K163086K200966K233925K256088K259789K241630K203064K150841
3139D86305237K094459K041817J996651J958313J922378J883126J835556J776046J703072
3148E03516655J616020J516609J408310J294937J180573J066666R52453Q34847P10067
3157E14097137N76516M35485K90795J47323R194j21880k45247l60984m68674n66483
3167E13793182o53267p27882p92046q47167q95272r37309r71756r97620j013679j021195
3177E04935989j023635j026803j036186j056785j090393j135979j190758j250534j311150
3186D94813766j369590j423989j473999j519928j563987j608048j653595j701240j749230
3195D80750160j795006j834755j866226j888962j905288j918755j933861j953468j978073
$$ plain form
3130 466473846 468595848 470758934 472959900 475193825 477449913 479709702 481951332 484154396 486305237
3139 486305237 488399696 490441513 492438164 494396477 496318855 498201981 500037537 501813583 503516655
3148 503516655 505132675 506649284 508057594 509352531 510533104 511599770 512552223 513387070 514097137
3157 514097137 514673653 515109138 515399933 515547256 515556450 515434570 515189323 514828339 514359665 513793182
3167 513793182 513139915 512412033 511619987 510772820 509877548 508940239 507968483 506970863 505957184 504935989
3177 504935989 503912354 502885551 501849365 500792580 499702187 498566208 497375450 496124916 494813766
3186 494813766 493444176 492020187 490546188 489026260 487462273 485854225 484200630 482499390 480750160
3195 480750160 478955154 477120399 475254173 473365211 471459923 469541168 467607307 465653839 463675766
3204D63675766k007065k038040k070160k102699k136955k174302k216224k263184k313194
3213D44353943k361679k403298k431984k443733k437935k418060k389412k358742k329254
3222D22779846k300911k269478k228431k171479k097663k010079j917686j830330j755333
3231D04198456j694374j640282j581459j505165j402779j274109j125526r67407q07534
3240C92199821o47964m85497l12690j24436Q1024L02086N34783P76443J026726J285782
3250C94636078J552391J823578K093887K359390K617417K868957L115959L358765L593941
3259D18020363L814926M014320M186440M330139M446259M538612M608421M655152M676742
3268D57291374M671707M642640M595718M540596M486694M438744M395332M349060M290581
$$ plain form
3204 463675766 461668701 459630661 457560501 455457802 453320847 451146545 448930321 446667137 444353943
3213 444353943 441992264 439588966 437156982 434713249 432275314 429857254 427467842 425109100 422779846
3222 422779846 420478935 418209457 415981026 413809547 411711884 409701805 407784119 405953789 404198456
3231 404198456 402504082 400863800 399282341 397777176 396374397 395100288 393974762 393007355 392199821
3240 392199821 391551857 391066360 390753670 390629234 390710258 391012344 391547127 392323570 393350296 394636078
3250 394636078 396188469 398012047 400105934 402465324 405082741 407951698 411067657 414426422 418020363
3259 418020363 421835289 425849609 430036049 434366188 438812447 443351059 447959480 452614632 457291374
3268 457291374 461963081 466605721 471201439 475742035 480228729 484667473 489062805 493411865 497702446
3277D97702446M213104M116707M008598L900071L801651L717346L644714L575478L501739
3286E32181854L418427L326225L229446L132782L038369K945518K850723K751847K648926
3295E59524117K544136K441940K345390K256165K172661K090416K003860J906700J795540
3304E79080925J670113J535034J398773J270714J158333J065139R89800R27391Q73985
3313E89970207Q26798P86667P54966P31545P13196O93054O64558O24466N76019N28298
3323E96869774M92592M76837M81338M97742N11513N09834M86107M43993L94706L52097
3333F01516533L26538L19710L26423L37143L43399L41034L30353L14636K97966K82364
3343F04736099K66876K48909K24877J89323J40190P5913l05q2016j61400k30980k86293
$$ plain form
3277 497702446 501915550 506032257 510040855 513940926 517742577 521459923 525104637 528680115 532181854
3286 532181854 535600281 538926506 542155952 545288734 548327103 551272621 554123344 556875191 559524117
3295 559524117 562068253 564510193 566855583 569111748 571284409 573374825 575378685 577285385 579080925
3304 579080925 580751038 582286072 583684845 584955559 586113892 587179031 588168831 589096222 589970207
3313 589970207 590797005 591583672 592338638 593070183 593783379 594476433 595140991 595765457 596341476 596869774
3323 596869774 597362366 597839203 598320541 598818283 599329796 599839630 600325737 600769730 601164436 601516533
3333 601516533 601843071 602162781 602489204 602826347 603169746 603510780 603841133 604155769 604453735 604736099
3343 604736099 605002975 605251884 605476761 605666084 605806274 605882187 605881882 605799866 605638466 605407486 605121193
3354F05121193l27606l57781l79448l92799l93639l76091l31916k56577j49536j4916
3364F02140884J37139K93083M36821N53322O31599O68984O69555O44875O06766N65376
3374F07348404N24559M81796M32663L73116L03917K31018J62887J07994O9619M5967
3384F10081940L0098J3771q354l5172n8479o7787n3139j1444N3367J30539K07634K75193
3396F10558167L28102L66249L91388M06036M11186M08135L97415L80707L57551L28713
3406F14333649K94990K59323K27547K06299J99318K05116K14195K14806J96648J59111
3416F16511002J10130O4583L5629K9221M1275O1035P7820Q3923P9765O9580N9967N6420
3428F17280350O0882P3891R4109J20048J49345J80283K11487K41890K69432K90756
$$ plain form
3354 605121193 604793587 604435806 604056358 603663559 603269920 602893829 602561913 602305336 602155800 602140884
3364 602140884 602278023 602571106 603007927 603561249 604192848 604861832 605531387 606176262 606783028 607348404
3374 607348404 607872963 608354759 608787422 609160538 609464455 609695473 609858360 609966354 610035973 610081940
3384 610081940 610112038 610125809 610117455 610082283 610023804 609956017 609902878 609891434 609944801 610075340 610282974 610558167
3396 610558167 610886269 611252518 611643906 612049942 612461128 612869263 613266678 613647385 614004936 614333649
3406 614333649 614628639 614887962 615115509 615321808 615521126 615726242 615940437 616155243 616351891 616511002
3416 616511002 616621132 616685715 616721344 616750565 616791840 616852875 616930695 617014618 617094383 617163963 617223930 617280350
3428 617280350 617341232 617415123 617509232 617629280 617778625 617958908 618170395 618412285 618681717 618972473
3438F18972473K99187K87285K51274J94244J29051P5570N3062P2021J27907K04315
3448F20666389K78702L33557L62168L69148L65829L61214L58734L54080L42179L20396
3458F24112396K92168K66113K51427K53334K71759L00827L31802L54615L62930L53546
3468F27150917L29819L01933K82097K80724K99758L30468L56178L61633L40386L00293
3478F30334206K59704K36397K39258K63595K95182L21273L36419L45344L56064L71780
3488F33359222L89252M02451M09126M16794M35982M72450N17349N47943N40123M83284
3498F37973976L91312K96631K34108K22435K53448K98843L29934L33252L18756L10058
3508F40962753L27683L76587M42428N03540N44129N62973N70221N78384N90668N99365
$$ plain form
3438 618972473 619271660 619558945 619810219 620004463 620133514 620209084 620262146 620334167 620462074 620666389
3448 620666389 620945091 621278648 621640816 622009964 622375793 622737007 623095741 623449821 623792000 624112396
3458 624112396 624404564 624670677 624922104 625175438 625447197 625748024 626079826 626434441 626797371 627150917
3468 627150917 627480736 627782669 628064766 628345490 628645248 628975716 629331894 629693527 630033913 630334206
3478 630334206 630593910 630830307 631069565 631333160 631628342 631949615 632286034 632631378 632987442 633359222
3488 633359222 633748474 634150925 634560051 634976845 635412827 635885277 636402626 636950569 637490692 637973976
3498 637973976 638365288 638661919 638896027 639118462 639371910 639670753 640000687 640333939 640652695 640962753
3508 640962753 641290436 641667023 642109451 642612991 643157120 643720093 644290314 644868698 645459366 646058731
3518F46058731N88608N46722M71878L74070K71835J86081J35040J31226J79138K70080
3528F49213409L83835M88663N56030N72281N49698N24902N39246O14548P33490Q43277
3538F55019379Q77533P95898O08597L77502J86539R9106J24588K19650L16162L63465
3548F58988419L56369L29666L32184L90167M97207O27823P64008R11331J083603J271439
3558F65552216J412963J406708J160507O59256L281o13098r79385r67484n90439L052
3568F67047577O01120J022339J182251J108322R03854O95267N87921O40946Q59680
3577F74649277J189270J518936J703262J614151J205445N58548j28861o17294p33948
3586F80958786m58069O9046O14929R70688J042252Q74786O04477L74527K72675L15246
$$ plain form
3518 646058731 646647339 647194061 647665939 648040009 648311844 648497925 648632965 648764191 648943329 649213409
3528 649213409 649597244 650085907 650641937 651214218 651763916 652288818 652828064 653442612 654176102 655019379
3538 655019379 655896912 656692810 657301407 657678909 657865448 657964554 658089142 658308792 658624954 658988419
3548 658988419 659344788 659674454 660006638 660396805 660894012 661521835 662285843 663197174 664280777 665552216
3558 665552216 666965179 668371887 669532394 670191650 670194931 669581833 668602448 667634964 667044525 667047577
3568 667047577 667648697 668671036 669853287 670961609 671865463 672560730 673148651 673789597 674649277
3577 674649277 675838547 677357483 679060745 680674896 681880341 682438889 682310028 681692734 680958786
3586 680958786 680500717 680569763 681184692 682155380 683197632 684072418 684676895 685051422 685324097 685639343
3596F85639343M72870P06177R79309J249847J455384J518402J378402J036606N71900
3605F95008240J26190j48773j52970J19858N73578J033783J302185J225052P64236
3614F99851379M4480o57196r97925p20444J95694J464691K569886K978286K395020
3623G07123871R31244r16901k481766l220443k944260j870422m78135P32651J447067
3632F98322906J618577J412811J086807Q73947R21936J272965J855011K480163K867737
3641G12712860K725525J886749M32282j274185k703858l383255l122558k109223q18710
3650G04345627K21786O77033N35278O0578l77503m95300k00730M13361J154175J818924
3660G08153229K252044K363434K133866J620712R56726L13110j72653m69284o73904
$$ plain form
3596 685639343 686112213 686818390 687797699 689047546 690502930 692021332 693399734 694436340 695008240
3605 695008240 695134430 694985657 694832687 694952545 695526123 696559906 697862091 699087143 699851379
3614 699851379 699895859 699238663 698240738 697520294 697715988 699180679 701750565 704728851 707123871
3623 707123871 708055115 707138214 704656448 701436005 698491745 696621323 696143188 696875839 698322906
3632 698322906 699941483 701354294 702441101 703315048 704236984 705509949 707364960 709845123 712712860
3641 712712860 715438385 717325134 717757416 716483231 713779373 710396118 707273560 705164337 704345627
3650 704345627 704567413 705244446 705779724 705840302 705462799 704967499 704766769 705180130 706334305 708153229
3660 708153229 710405273 712768707 714902573 716523285 717480011 717793121 717620468 717151184 716477280
3669G16477280r50928j414337k023850k570800k769013k407150j467819j45646J237717
3678G03965454K365799L022919L121261K668457J735306M55017r55276k197113k956162
3687G11225662l016968k368087j227875L7308J062851J619567J667481J319122P54013
3696G11073074J52283l27835n48782m07257J11007Q73032J590576J907806J564179
3705G15988083N48096q52127k148667k859726k724838j808548m57382Q66241J774063
3714G08325195K081452J828003J209793M74701j65711n80063p16781n82352k16370
3723G11657867L17383R24912J468734J766205J629334R46808k17133j567917k628479
3732G14297714k914428k167817n38025J415024K934113L412933K695160J158829m82331
$$ plain form
3669 716477280 715526352 714112015 712088165 709517365 706748352 704341202 702873383 702727737 703965454
3678 703965454 706331253 709354172 712475433 715143890 716879196 717334213 716378937 714181824 711225662
3687 711225662 708208694 705840607 704612732 704650040 705712891 707332458 708999939 710319061 711073074
3696 711073074 711225357 710897522 710348740 709941483 710052490 710925522 712516098 714423904 715988083
3705 715988083 716536179 715684052 713535385 710675659 707950821 706142273 705684891 706551132 708325195
3714 708325195 710406647 712234650 713444443 713919144 713753433 713173370 712456589 711874237 711657867
3723 711657867 711975250 712900162 714368896 716135101 717764435 718711243 718494110 716926193 714297714
3732 714297714 711383286 709215469 708677444 710092468 713026581 716439514 719134674 720293503 719811172
3741G19811172j557083j784057j389237r23767q99582j462860k304230k857360k655106
3750G03977890j624985j43966J171875J808624J622085Q81043Q0795l44620k42843
3759G07185898K22473P07016Q95157O56967Q0109o07682j159210j401291j272201q17032
3769G04490204j63345N04684R88541J133346Q93402L65677k38724o87484q39157p06788
3779G05740356m34570k01187j07193j26266j41755m1427K00653N13763P89566R65195
3789G07157135J057739J126938J197052J204834J026688N69458j34278r09271j516876
3798G10779419j789246j724090j472244j223908j069488r33762o37360m2724Q13827
3807G02700424J695862K277298K317963J797866R22471K136p15180j152191j388168
$$ plain form
3741 719811172 718254089 716470032 715080795 714157028 713257446 711794586 709490356 706632996 703977890
3750 703977890 702352905 702208939 703380814 705189438 706811523 707692566 707773361 707428741 707185898
3759 707185898 707408371 708115387 709010544 709667511 709747620 709139938 707980728 706579437 705307236 704490204
3769 704490204 704326859 704831543 705820084 706953430 707846832 708212509 707973785 707286301 706447144 705740356
3779 705740356 705305786 705104599 704997406 704871140 704729385 704687958 704888611 705402374 706191940 707157135
3789 707157135 708214874 709341812 710538864 711743698 712770386 713339844 713205566 712296295 710779419
3798 710779419 708990173 707266083 705793839 704569931 703500443 702566681 701929321 701886597 702700424
3807 702700424 704396286 706673584 708991547 710789413 711711884 711714020 710998840 709846649 708458481
3816G08458481j550446j687545j723099j514664r76181j72424O80999J324616J596298
3825G04436035J516953J264648J050644R75418R61380Q06275L27911m93774j467667
3834G09377823k273941k630844k441101j828537j039734k76947M21905J172180K093049
3843G02573853L124389L934479M017868K952881O95267k278748n075378o725235o603165
3852F96616211m721298j739655J308975L457566M187622L586273K218552Q07113j15661
3861G05605698m05121k82212j32370k53372o94275j255951j631546j590805j104126
3870F98255920l42178M26712R73053J194992J124268Q65860N23147J60141j89209m91333
3880G02501373o97403p63168o86111n25666l81546l35693l92990m64707m10003j18866
$$ plain form
3816 708458481 706908035 705220490 703497391 701982727 701006546 700834122 701515121 702839737 704436035
3825 704436035 705952988 707217636 708268280 709243698 710205078 711011353 711339264 710845490 709377823
3834 709377823 707103882 704473038 702031937 700203400 699163666 698886719 699308624 700480804 702573853
3843 702573853 705698242 709632721 713650589 716603470 717298737 715019989 709944611 703219376 696616211
3852 696616211 691894913 690155258 691464233 694921799 699109421 702695694 704914246 705721359 705605698
3861 705605698 705200577 704918365 704785995 704532623 703838348 702582397 700950851 699360046 698255920
3870 698255920 697913742 698340454 699313507 700508499 701632767 702498627 703021774 703181915 702992706 702501373
3880 702501373 701803970 701040802 700354691 699829025 699447479 699111786 698718796 698254089 697844086 697725220
3890F97725220M12903J057891J596299J803131J539383Q12149k25373j322479k211380
3899G01187744k687530k666703k197418j431961n65109K29111Q37326J215972J366883
3908F95288315J310196J068802O78329K00653k69012o27060p98569p68890n90287l51104
3918F95141373j34812J3886R2850J23672J26343J02920M0512p2403k32772m13590n65643
3929F94222336o29807n58395l39737j9455L00751N00335M92783K80533l9978l22266
3939F93887100m51965m09546k73056j61133j49536k27051l16467l41721k86712k01264
3949F91068649j50146j56021j82724j74485j17187n7144o4469j62124k93579l58353
3959F89352417k95944j45874k4033l2272j67160l16467l51639k43454r8801p2937k30713
$$ plain form
3890 697725220 698138123 699196014 700792313 702595444 704134827 704946976 704721603 703399124 701187744
3899 701187744 698500214 695833511 693636093 692204132 691639023 691868134 692705460 693921432 695288315
3908 695288315 696598511 697667313 698345642 698546295 698277283 697650223 696851654 696082764 695492477 695141373
3918 695141373 695006561 695020447 695113297 695236969 695363312 695466232 695506744 695434341 695201569 694787979 694222336
3929 694222336 693592529 693034134 692694397 692674942 692975693 693476028 693968811 694249344 694209366 693887100
3939 693887100 693435135 693025589 692752533 692591400 692441864 692214813 691898346 691556625 691269913 691068649
3949 691068649 690918503 690762482 690579758 690405273 690288086 690230942 690166473 690004349 689710770 689352417
3959 689352417 689056473 688910599 688886566 688854294 688687134 688370667 688019028 687775574 687676773 687603836 687373123
3970F87373123m70428n93491m78134k05994k0981j33285n16434q93860r48181o08597
3980F82503738j63574o0119n19562j283188j750336j475982o45676q8654o83975k529449
3990F73303223m562683n140229l421707o99844n96543p587661k4389572m9640732p7410088
3999D99854164r9167366
4000D00686798
$$ plain form
3970 687373123 686902695 686309204 685831070 685625076 685604095 685470810 684954376 684060516 683112335 682503738
3980 682503738 682340164 682280045 681760483 680477295 678726959 677250977 676605301 676516647 675832672 673303223
3990 673303223 668740540 663600311 660178604 659478760 658882217 651294556 626904984 577264252 499854164
3999 499854164 400686798
4000 400686798
##END=$$ End of the data block
