##TITLE=m_NBZCH3-G1 $$ Begin of the data block
##JCAMP-DX=5.00 $$ ACD/SpecManager v 10.08
##SPECTROMETER/DATA SYSTEM=Alpha
##DATE=29 Oct 2013 08:56:10
##DATA TYPE=INFRARED SPECTRUM
##DATA CLASS=XYDATA
##ORIGIN=
##OWNER=
##NPOINTS=1765
##FIRSTX=399.75695801
##LASTX=3997.56933594
##MAXX=3997.56933594
##MINX=399.75695801
##MAXY=1.02380908
##MINY=0.10974397
##XFACTOR=1.0000000000
##YFACTOR=0.000000010000000
##FIRSTY=1.00000000
##DELTAX=2.03957629
##XUNITS=1/CM
##YUNITS=ARBITRARY UNITS
##XYDATA=(X++(Y..Y))
$$ plain form
399.8 100000000 99479848 101007342 102380908 102124548 100967503 100224078 100124264 100000000 99991763 99040085
420.2 99040085 98363453 98649460 99419701 99758142 99214387 98294348 97926438 98373210 98986584 98981786
440.5 98981786 98217779 97393835 97308278 97871816 98273146 97874600 96962279 96356964 96478498 96951294
460.9 96951294 97004139 96235508 95106626 94456726 94500989 94550753 93732256 91916680 89649469 87378770
481.3 87378770 84999651 82606536 80891299 80624801 82498294 86405379 90878469 94238591 95806730
499.7 95806730 96107852 96244925 96938205 97917187 98345190 97880518 97085994 96803004 97281694 97923642
520.1 97923642 97971576 97318065 96557283 96408516 96941924 97500998 97397673 96661061 95994562 96012050
540.5 96012050 96603292 97066903 96824116 96064240 95561010 95801991 96481103 96858609 96532047 95827270
$$ packed form
399.8A00000000n20152J527494J373566k56360j157045p43425r9814j24264q237r51678
420.2I9040085o76632K86007P70241L38441n43755r20039l67910M46772O13374m798
440.5I8981786p64007q23944q5557N63538M01330l98546r12321o05315J21534M72796
460.9I6951294N2845p68631j128882o49900M4263M9764q18497j815576k267211k270699
481.3H7378770k379119k393115j715237k66498J873493L907085M473090L360122J568139
499.7I5806730L01122J37073O93280R78982M28003m64672p94524k82990M78690O41948
520.1I7923642M7934o53511p60782j48767N33408N59074j03325p36612o66499J7488
540.5I6012050N91242M63611k42787p59876n03230K40981O79112L77506l26562p04777
$$ plain form
560.9 95827270 95466775 95790035 96376532 96506280 95958424 95217311 94911796 95186174 95591009 95572001
581.3 95572001 95032418 94469804 94421613 94888753 95329118 95217741 94631481 94158190 94280314 94888759
601.7 94888759 95400864 95329124 94789857 94387829 94578212 95171589 95556515 95352596 94804364 94509852
622.1 94509852 94802564 95421755 95726597 95402420 94766265 94433105 94662631 95076197 95067924 94413614
642.5 94413614 93394923 92307615 90514737 87729752 86973059 89795530 92467695 92736018 91505873
660.8 91505873 89494234 87986040 88564146 91233528 93018121 93791693 94162774 93930113 93200815
679.2 93200815 92511958 92295617 92418426 92352289 91705304 90643561 89659381 89022708 88486522 87598711
699.6 87598711 86167127 84337813 82274574 79737282 75896186 69625622 60325813 48864943
$$ packed form
560.9I5827270l60495L23260N86497J29748n47856p41113l05515K74378M04835j9008
581.3I5572001n39583n62614m8191M67140M40365j11377n86260m73291J22124O08445
601.7I4888759N12105p1740n39267m02028J90383N93377L84926k03919n48232k94512
622.1I4509852K92712O19191L04842l24177o36155l33160K29526M13566q273o54310
642.5I4413614j018691j087308j792878k784985p56693K822471K672165K68323j230145
660.8I1505873k011639j508194N78106K669382J784593P73572L71081k32661p29298
679.2I3200815o88857k16341J22809o6137o46985j061743r84180o36673n36186q87811
699.6H7598711j431584j829314k063239k537292l841096o270564r299809j1460870
$$ plain form
715.9 48864943 37931067 30541235 27237791 26353809 28176534 35465625 48917058 64619595
732.2 64619595 77293205 84991133 89044231 91206145 92643148 94026041 95377463 96304810 96563876
750.6 96563876 96425116 96439344 96862799 97426522 97610956 97227091 96596861 96180218 95876402 94756001
771 94756001 91654629 86049592 78232932 71590185 72735518 81438130 89308816 92484033 93253613
789.3 93253613 93649697 94199610 94655490 94656724 94224697 93763125 93588465 93575710 93262213 92292154
809.7 92292154 90714478 88733113 86066443 81438768 73138225 62476885 57415867 62565374
826 62565374 70191705 75654942 82789326 90284687 94281811 95560580 96123117 96537942 96605390
844.4 96605390 96229643 95670378 95342398 95360059 95465755 95288867 94817305 94445080 94441760 94654834
$$ packed form
715.9D8864943j0933876p389832l303444q83982J822725P289091J3451433J5702537
732.2F4619595J2673610P697928M053098K161914J437003J382893J351422R27347K59066
750.6I6563876j38760J4228M23455N63723J84434l83865o30230m16643l03816j120401
771I4756001l101372n605037p816660o642747J145333Q702612P870686L175217P69580
789.3I3253613L96084N49913M55880J234m32027m61572j74660j2755l13497r70059
809.7I2292154j577676j981365k666670m627675q300543j0661340n061018N149507
826F2565374P626331N463237P134384P495361L997124J278769N62537M14825O7448
844.4I6605390l75747n59265l27980J7661J05696j76888m71562l72225l320K13074
$$ plain form
864.8 94654834 94684428 94195735 93107778 91568595 89453888 86371320 83351266 83392930 87096256
883.1 87096256 91122419 93266481 94018024 94002163 93500018 93108475 93294382 93948805 94611681 94882506
903.5 94882506 94634849 94088113 93617654 93356043 93048424 92224753 90538812 87696433 82827407
921.9 82827407 75891346 72205943 76872164 84804630 89201558 90509075 91007847 91228694 91065562
940.2 91065562 90542668 89939129 89535248 89323795 88998932 88281024 87175667 85930437 84859371
958.6 84859371 84148741 83437884 82094872 79918379 76849955 72400570 65846318 57955843 53143263
977 53143263 56457508 67085254 78976655 87291199 91152775 92055625 91771746 91244912 90424597
995.3 90424597 88434345 84311700 80683655 82301950 87345326 90372837 90854692 90658623 90356046
$$ packed form
864.8I4654834K9594m88693j087957j539183k114707l082568l020054M1664L703326
883.1H7096256M026163K144062P51543j5861n02145l91543J85907O54423O62876K70825
903.5I4882506k47657n46736m70459k61611l07619q23671j685941k842379m869026
921.9H2827407o936061l685403M666221P932466M396928J307517M98772K20847j63132
940.2I1065562n22894o03539m03881k11453l24863p17908j105357j245230j071066
958.6H4859371p10630p10857j343012k176493l068424m449385o554252p890475m812580
977E3143263L314245J0627746J1891401Q314544L861576R02850k83879n26834q20315
995.3I0424597j990252m122645l628045J618295N043376L027511M81855j96069l02577
$$ plain form
1013.7 90356046 89943266 89577347 89391834 89249092 88945836 88459378 87991828 87738740 87683505 87582052
1034.1 87582052 87238789 86708814 86220509 85921705 85715890 85343957 84614474 83603269 82595962
1052.4 82595962 81854671 81321704 80668598 79627246 78127271 76137000 73497397 69941384 65456140
1070.8 65456140 61259496 60132205 63255519 67582428 70557141 73404127 76570326 78425050
1087.1 78425050 78570580 77736503 76169115 73674589 70159823 66315538 64224583 65720040 69395047
1105.4 69395047 71997476 72300828 71137822 69464296 67769074 66205817 64621753 62606484 59701890
1123.8 59701890 55610561 50218976 43524525 36008593 29539114 27518335 32620591 43466833
1140.1 43466833 55147165 63686448 68498176 71208519 73655915 76638180 79797101 82526267
$$ packed form
1013.7I0356046m12780l65919j85513j42742l03256m86458m67550k53088n5235j01453
1034.1H7582052l43263n29975m88305k98804k05815l71933p29483j011205j007307
1052.4H2595962p41291n32967o53106j041352j499975j990271k639603l556013m485244
1070.8F5456140m196644j127291L123314M326909K974713K846986L166199J854724
1087.1G8425050J45530q34077j567388k494526l514766l844285k090955J495457L675007
1105.4F9395047K602429L03352j163006j673526j695222j563257j584064k015269k904594
1123.8E9701890m091329n391585o694451p515932o469479k020779N102256J0846242
1140.1D3466833J1680332Q539283M811728K710343K447396K982265L158921K729166
$$ plain form
1156.4 82526267 84639233 86030924 86560798 86305088 85353494 83853734 82681632 82694215 83160466
1174.8 83160466 82873219 81706065 79960227 77752340 75059533 71683002 67283863 61923462 57527965
1193.1 57527965 57882339 64197344 72392297 77972823 80349690 81021529 81076574 80887282 80509496
1211.5 80509496 79906869 79048252 77974778 76801854 75668538 74685478 73866552 73075831 72139162
1229.9 72139162 71007437 69733280 68322748 66708559 64837128 62716180 60403895 57990623
1246.2 57990623 55608863 53472733 51748550 50171626 48043588 44745559 40050608 34133497
1262.5 34133497 27507603 21219148 17092435 17648877 25861913 41137713 54773670 57664692
1278.8 57664692 50842756 40798765 31122303 22956832 17199698 14424318 14749259 17916310
$$ packed form
1156.4H2526267K112966J391691N29874k55710r51594j499760j172102J2583M66251
1174.8H3160466k87247j167154j745838k207887k692807l376531m399139n360401m395497
1193.1E7527965L54374O315005Q194953N580526K376867O71839N5045j89292l77786
1211.5H0509496o02627q58617j073474j172924j133316r83060q18926p90721r36669
1229.9G2139162j131725j274157j410532j614189j871431k120948k312285k413272
1246.2E7990623k381760k136130j724183j576924k128038l298029m694951n917111
1262.5C4133497o625894o288455m126713N56442Q213036J5275800J3635957K891022
1278.8E7664692o821936j0043991r676462q165471n757134k775380L24941L167051
$$ plain form
1295.1 17916310 23147193 29379201 35829630 42066482 47669142 52178735 55249494 56916815
1311.4 56916815 57743895 58476543 59430486 60361779 61161137 62599593 65703422 70077610 73905504
1329.8 73905504 75766492 75434339 73187041 68911266 62048715 52571470 41129786 29103819
1346.1 29103819 18751983 12167656 10974397 15842584 25481951 36873597 47474495 56165367
1362.4 56165367 62279326 66047776 68543905 70636433 72906309 75360984 77518946 79463595
1378.7 79463595 81513745 83555520 85433066 86989892 87779778 87804180 87646836 87717903 88175315
1397.1 88175315 89078194 90174681 91278601 92389446 93239886 93656135 93672472 93297356 92524153
1415.5 92524153 91157728 88786256 85726058 82314128 78639007 75105786 71424776 66609740
$$ packed form
1295.1A7916310N230883O232008O450429O236852N602660M509593L070759J667321
1311.4E6916815Q27080P32648R53943R31293P99358J438456L103829M374188L827894
1329.8G3905504J860988l32153k247298m275775o862551r477245j1441684j2025967
1346.1B9103819j0351836o584327j193259M868187R639367J1391646J0600898Q690872
1362.4E6165367O113959L768450K496129K092528K269876K454675K157962J944649
1378.7G9463595K050150K041775J877546J556826P89886K4402j57344P1067M57412
1397.1H8175315R02879J096487J103920J110845Q50440M16249J6337l75116p73203
1415.5I2524153j366425k371472l060198l411930l675121l533221l681010m815036
$$ plain form
1431.8 66609740 60059679 51616615 44110203 40855926 40261418 40949342 43446192 48413530 55197471
1450.1 55197471 61993247 66881841 68775380 68697810 70135880 73785031 77872694 79866999 79450721
1468.5 79450721 78140575 77038771 76787853 77261144 78097445 79124719 80335742 81771940 83457339
1486.8 83457339 85095483 86019540 86039430 85529637 84631854 83301044 81850076 80658054 79896206
1505.2 79896206 79161251 77714658 75414842 72147995 67520773 61187410 53091025 42007798
1521.5 42007798 30123729 21152090 16228543 15057513 16866991 23221481 32427216 42140391
1537.8 42140391 54381454 66198832 74164701 79999423 84350860 87614518 89797491 90970361
1554.1 90970361 91619259 92591023 93637067 93816876 93778914 93846786 93905306 93766677 93223727 92356539
$$ packed form
1431.8F6609740o550061q443064p506412l254277n94508O87924K496850M967338O783941
1450.1E5197471O795776M888594J893539p7570J438070L649151M087663J994305m16278
1468.5G9450721j310146j101804k50918M73291Q36301J027274J211023J436198J685399
1486.8H3457339J638144R24057J9890n09793q97783j330810j450968j192022p61848
1505.2G9896206p34955j446593k299816l266847m627222o333363q096385j1083227
1521.5D2007798j1884069q971639m923547j171030J809478O354490R205735R713175
1537.8D2140391J2241063J1817378P965869N834722M351437L263658K182973J172870
1554.1I0970361O48898R71764J046044J79809l7962O7872N8520j38629n42950q67188
$$ plain form
1574.5 92356539 90853465 88193852 84152895 79607195 77793777 80406046 84667909 87429351
1590.9 87429351 88427931 88487238 87994707 87049568 85711223 84012651 81936300 79238552 75404078
1609.2 75404078 70199555 64414787 59802502 59199095 62921804 68311626 73770058 77699763 80135137
1627.6 80135137 81771594 82743335 83434105 84064358 84185201 83900857 83633965 83532715 83678162 83822137
1648 83822137 83743572 83849025 84056562 83789986 83501452 83501273 83753163 83887565 83653677 83163893 82283854
1670.4 82283854 80883688 79036629 77373224 76728749 76754826 76713872 76062006 74781090 73260325
1688.8 73260325 71614307 69990528 68187159 65957069 63041377 58995789 55145049 51554614
1705.1 51554614 47171262 41705406 35038972 27629387 20541990 15747626 14866483 16589616 19645105
$$ packed form
1574.5I2356539j503074k659613m040957m545700j813418K612269M261863K761442
1590.9H7429351R98580N9307m92531r45139j338345j698572k076351k697748l834474
1609.2G5404078n204523n784768m612285o03407L722709N389822N458432L929705K435374
1627.6H0135137J636457R71741O90770O30253J20843k84344k66892j01250J45447J43975
1648H3822137p8565J05453K07537k66576k88534j79K51890J34402k33888m89784q80039
1670.4H2283854j400166j847059j663405o44475K6077m0954o51866j280916j520765
1688.8G3260325j646018j623779j803369k230090k915692m045588l850740l590435
1705.1E1554614m383352n465856o666434p409585p087397m794364q81143J723133L055489
$$ plain form
1723.4 19645105 23340470 26440808 28285351 30623183 36773720 44922325 51067936 56851447
1739.7 56851447 62729573 67774135 72040695 75645703 78828532 81461251 83358908 84929538
1756.1 84929538 86307240 87353629 88271290 89079303 89888310 90825409 91719460 92506349 92988032
1774.4 92988032 93138915 93174243 93080652 92725754 92186081 91804236 92040861 93109739 94508195 95288301
1794.8 95288301 95445132 95463413 95627654 96032971 96579534 97100943 97510105 97832423 98091698 98313308
1815.2 98313308 98495793 98579395 98597550 98688453 98871791 99001408 99025387 98852998 98496014 98174554
1835.6 98174554 97994125 97886789 97696489 97083461 95804489 94769382 95118481 96469450 97541791
1854 97541791 97980130 98221153 98574126 99025166 99427086 99710900 99899638 99956238 99919486 99940413 100000000
$$ packed form
1723.4A9645105L695365L100338J844543K337832O150537Q148605O145611N783511
1739.7E6851447N878126N044562M266560L605008L182829K632719J897657J570630
1756.1H4929538J377702J046389R17661Q08013Q09007R37099Q94051P86889M81683
1774.4I2988032J50883L5328r3591l54898n39673l81845K36625J068878J398456P80106
1794.8I5288301J56831J8281J64241M05317N46563N21409M09162L22318K59275K21610
1815.2I8313308J82485Q3602J8155R0903J83338J29617K3979j72389l56984l21460
1835.6I8174554j80429j07336j90300o13028j278972j035107L49099J350969J072341
1854I7541791M38339K41023L52973M51040M01920K83814J88738N6600l6752K0927N9587
$$ plain form
1876.4 100000000 99981612 99845225 99696320 99655563 99752766 99918181 99981070 99872810 99742264 99684471
1896.8 99684471 99666381 99611419 99429011 99121130 98794001 98510683 98192227 97762746 97425228 97547406
1917.2 97547406 98087752 98639238 99020165 99160069 99071914 98887801 98718637 98606211 98518360 98387969
1937.6 98387969 98157454 97819763 97443879 97213989 97263294 97439396 97455388 97211564 96814960 96433401
1958 96433401 96179110 96016484 95890379 96001697 96590960 97469097 98228818 98664689 98815835 98841804
1978.4 98841804 98883927 98982686 99080008 99102229 99037540 98958820 98936105 98947346 98923761 98803890 98577958
2000.8 98577958 98309469 98053312 97783720 97420430 96920460 96319151 95738614 95461661 95781821 96591133
2021.2 96591133 97419935 97952545 98238683 98447853 98641419 98765117 98765993 98679852 98611081 98630345 98703080
$$ packed form
1876.4A00000000j8388j36387j48905m0757R7203J65415O2889j08260j30546n7793
1896.8I9684471j8090n4962j82408l07881l27129k83318l18456m29481l37518J22178
1917.2I7547406N40346N51486L80927J39904q8155j84113j69164j12426q7851j30391
1937.6I8387969k30515l37691l75884k29890M9305J76102J5992k43824l96604l81559
1958I6433401k54291j62626j26105J11318N89263Q78137P59721M35871J51146K5969
1978.4I8841804M2123R8759R7322K2221o4689p8720k2715J1241k3585j19871k25932
2000.8I8577958k68489k56157k69592l63290m99970o01309n80537k76953L20160Q09312
2021.2I6591133Q28802N32610K86138K09170J93566J23698Q76q6141o8771J9264P2735
$$ plain form
2043.6 98703080 98733395 98664171 98536754 98450863 98458302 98511046 98510176 98398602 98217165 98068649 98009241
2066.1 98009241 97993398 97935307 97797757 97638994 97570640 97642654 97783172 97875023 97863334 97772801 97668898
2088.5 97668898 97621232 97663283 97757858 97835118 97870457 97885215 97880083 97800016 97577262 97230297 96913689
2110.9 96913689 96822596 97026163 97394389 97712380 97878319 97952694 98035592 98147410 98225492 98209423 98112112
2133.4 98112112 98011065 97974539 97994411 97987252 97873455 97672170 97509503 97506034 97655547 97837818 97935486
2155.8 97935486 97929198 97895181 97897530 97897893 97806031 97595966 97355366 97225893 97282964 97476172 97684377
2178.2 97684377 97823107 97906411 98006052 98151076 98291945 98354006 98314840 98238599 98214096 98263973 98325241
2200.7 98325241 98313946 98211432 98086840 98028338 98059428 98122162 98137581 98083955 98009586 97962624 97927254
$$ packed form
2043.6I8703080L0315o9224j27417q5891P439N2744q70j11574j81437j48516n9408
2066.1I8009241j5843n8091j37550j58763o8354P2014J40518R1851j1689r0533j03903
2088.5I7668898m7666M2051R4575P7260L5339J4758n132q0067k22754l46965l16608
2110.9I6913689r1093K03567L68226L17991J65939P4375Q2898J11818P8082j6069r7311
2133.4I8112112j01047l6526J9872p159j13797k01285j62667l469J49513J82271R7668
2155.8I7935486o288l4017K349L63r1862k10065k40600j29473N7071J93208K08205
2178.2I7684377J38730Q3304R9641J45024J40869O2061l9166p6241k4503M9877O1268
2200.7I8325241j1295j02514j24592n8502L1090O2734J5419n3626p4369m6962l5370
$$ plain form
2223.1 97927254 97855115 97741419 97638518 97604710 97675830 97839886 98008597 98080581 98048222 97997355 98006719
2245.6 98006719 98073846 98123986 98094273 98000401 97905529 97852373 97826129 97762227 97611940 97411644 97272962
2268 97272962 97289616 97454780 97667456 97815901 97878301 97922421 97998160 98072881 98085624 98011857 97884810
2290.4 97884810 97781748 97746366 97739863 97688633 97568190 97425824 97326857 97289729 97264951 97180951 97011983
2312.9 97011983 96781492 96527910 96303231 96135646 95987439 95799035 95592391 95488864 95544851 95625389
2333.3 95625389 95584148 95449388 95357758 95433122 95727348 96116954 96215153 95915467 95538628 95399433
2353.6 95399433 95470005 95571762 95638704 95676166 95747232 95920205 96179628 96448040 96672398 96854150
2374 96854150 97031039 97223049 97400421 97503334 97496611 97413105 97336805 97323459 97346514 97328478 97214496
$$ packed form
2223.1I7927254p2139j13696j02901l3808P1120J64056J68711P1984l2359n0867R364
2245.6I8006719O7127N0140k9713r3872r4872n3156k6244o3902j50287k00296j38682
2268I7272962J6654J65164K12676J48445O2400M4120P5739P4721J2743p3767j27047
2290.4I7884810j03062l5382o503n1230j20443j42366r8967l7128k4778q4000j68968
2312.9I7011983k30491k53582k24679j67585j48207j88404k06644j03527N5987Q0538
2333.3I5625389m1241j34760r1630P5364K94226L89606R8199k99686l76839j39195
2353.6I5399433P0572J01757O6942L7462P1066J72973K59423K68412K24358J81752
2374I6854150J76889J92010J77372J02913o723q3506p6300j3346K3055j8036j13982
$$ plain form
2396.5 97214496 97014892 96789384 96597129 96462446 96394002 96403575 96482265 96598607 96712059 96759057 96668720
2418.9 96668720 96428233 96129429 95924079 95925933 96125770 96386492 96583062 96713835 96841455 96991235
2439.3 96991235 97125882 97189724 97167087 97101480 97057909 97059041 97066689 97031552 96944314 96847576 96800894 96830320
2463.8 96830320 96909320 96977365 96985346 96931404 96842140 96718884 96529406 96264368 95996171 95851630 95900691
2486.2 95900691 96104980 96369511 96603590 96767396 96886206 96999443 97106057 97172123 97177470 97141820
2506.6 97141820 97112674 97124785 97165537 97189367 97170025 97127444 97104025 97122633 97158521 97159195 97094882 96978211
2531.1 96978211 96841502 96709532 96593398 96510947 96482217 96494907 96522385 96552968 96568018 96532655 96428084
2553.5 96428084 96289688 96209127 96258146 96408969 96564400 96653992 96689522 96724689 96777862 96821088 96815252
$$ packed form
2396.5I7214496j99604k25508j92255j34683o8444R573P8690J16342J13452M6998r0337
2418.9I6668720k40487k98804k05350J854J99837K60722J96570J30773J27620J49780
2439.3I6991235J34647O3842k2637o5607m3571J132P648l5137q7238r6738m6682K9426
2463.8I6830320P9000O8045P981n3942q9264j23256j89478k65038k68197j44541M9061
2486.2I5900691K04289K64531K34079J63806J18810J13237J06614O6066N347l5650
2506.6I7141820k9146J2111M0752K3830j9342m2581k3419J8608L5888O74o4313j16671
2531.1I6978211j36709j31970j16134q2451k8730J2690K7478L0583J5050l5363j04571
2553.5I6428084j38396q0561M9019J50823J55431Q9592L5530L5167N3173M3226n836
$$ plain form
2576 96815252 96737367 96609819 96509993 96511525 96592265 96654791 96644008 96586484 96535444 96508932 96493787 96480894
2600.4 96480894 96467191 96455175 96454114 96464241 96465117 96443921 96427447 96453738 96530271 96633816 96723062 96762276
2624.9 96762276 96751541 96726447 96720397 96725762 96708512 96649301 96562505 96490228 96462822 96471876 96491951 96508610
2649.4 96508610 96535045 96599644 96704936 96818399 96898448 96927667 96932590 96956837 97009069 97056770 97070235
2671.8 97070235 97046089 97002774 96970296 96965390 96969330 96943885 96873277 96782011 96720302 96725726 96783036 96832359
2696.3 96832359 96834975 96810400 96792728 96785885 96760732 96689725 96584678 96489900 96445966 96456975 96491879 96517140
2720.8 96517140 96520126 96512944 96515352 96527708 96528709 96496701 96437603 96385485 96368849 96380204 96371359 96299744 96179891
2747.3 96179891 96068186 96010244 96005338 96003115 95957911 95882833 95826930 95822787 95857954 95885193 95868111 95814812
$$ packed form
2576I6815252p7885j27548r9826J532Q0740O2526j0783n7524n1040k6512j5145j2893
2600.4I6480894j3703j2016j061J0127Q76k1196j6474K6291P6533J03545Q9246L9214
2624.9I6762276j0735k5094o050N365j7250n9211q6796p2277k7406R054K0075J6659
2649.4I6508610K6435O4599J05292J13463Q0049K9219M923K4247N2232M7701J3465
2671.8I7070235k4146m3315l2478m906L940k5445p0608r1266o1709N424N7310M9323
2696.3I6832359K616k4575j7672o843k5153p1007j05047r4778m3934J1009L4904K5261
2720.8I6517140K986p182K408J2356J001l2008n9098n2118j6636J1355q845p1615j19853
2747.3I6179891j11705n7942m906k223m5204p5078n5903m143L5167K7239j7082n3299
$$ plain form
2771.8 95814812 95761257 95731837 95720875 95701933 95654166 95581794 95506185 95444405 95400918 95369631 95345545 95345008
2796.2 95345008 95392096 95478714 95563728 95604521 95586288 95528203 95455372 95374268 95270991 95135218 94991249
2818.7 94991249 94887686 94860119 94901490 94957173 94966942 94912267 94812059 94682074 94503981 94218642 93744504
2841.1 93744504 93030167 92122114 91253030 90858722 91228819 92063260 92746884 92981589 92806345 92265689
2861.5 92265689 91348696 90190172 89318883 89434928 90555567 91872072 92740971 93154329 93339276
2879.9 93339276 93468827 93618596 93777305 93903911 93973249 93981653 93937975 93845552 93686044 93448585 93178183
2902.3 93178183 92979133 92951673 93087649 93263894 93365437 93365365 93300068 93216264 93128014 93004060 92802578
2924.7 92802578 92519134 92221653 92029124 92009497 92110318 92229348 92297018 92258632 92062241 91658568
$$ packed form
2771.8I5814812n3555k9420j0962j8942m7767p2372p5609o1780m3487l1287k4086n37
2796.2I5345008M7088Q6618Q5014M0793j8233n8085p2831q1104j03277j35773j43969
2818.7I4991249j03563k7567M1371N5683R769n4675j00208j29985j78093k85339m74138
2841.1I3744504p14337r08053q69084l94308L70097Q34441O83624K34705j75244n40656
2861.5I2265689r16993j158524q71289J16045J120639J316505Q68899M13358J84947
2879.9I3339276J29551J49769J58709J26606O9338Q404m3678r2423j59508k37459k70402
2902.3I3178183j99050k7460J35976J76245J01543p2o5297q3804q8250j23954k01482
2924.7I2802578k83444k97481j92529j9627J00821J19030O7670l8386j96391m03673
$$ plain form
2945.1 91658568 90982252 89959627 88549030 86789155 84819579 82950133 81874335 82509154 85001308
2963.5 85001308 88257128 91021407 92872924 93992776 94633675 94968605 95120150 95166373 95128947
2981.8 95128947 95004761 94820637 94641119 94515228 94429940 94329309 94159472 93887001 93506199 93036836
3002.2 93036836 92504746 91925794 91301423 90635163 89983910 89534783 89537454 90037847 90777522 91437244
3022.6 91437244 91871446 92078829 92099118 91969568 91694188 91273338 90754449 90236932 89859790 89719558
3043 89719558 89808112 90104401 90621710 91270965 91810006 92048335 91982418 91697437 91271412 90778482
3063.4 90778482 90312284 89990103 89872009 89854902 89694858 89079916 87782925 86145180 85085046
3081.8 85085046 84691060 83673555 81099188 77882695 76199484 76817644 78036469 78687018 79658878
$$ packed form
2945.1I1658568o76316j022625j410597j759875j969576j869446j075798O34819K492154
2963.5H5001308L255820K764279J851517J119852O40899L34930J51545M6223l7426
2981.8I5128947j24186j84124j79518j25891q5288j00631j69837k72471l80802m69363
3002.2I3036836n32090n78952o24371o66260o51253m49127K671N00393P39675O59722
3022.6I1437244M34202K07383K0289j29550k75380m20850n18889n17517l77142j40232
3043H9719558Q8554K96289N17309O49255N39041K38329o5917k84981m26025m92930
3063.4I0778482m66198l22181j18094j7107j60044o14942j296991j637745j060134
3081.8H5085046l93986j017505k574367l216493j683211O18160J218825O50549R71860
$$ plain form
3100.1 79658878 81623930 83905405 85748911 87102067 88197458 89194465 90198696 91256022 92284137
3118.5 92284137 93128192 93703979 94048202 94242293 94332725 94337320 94283319 94193923 94078255 93936890 93766910
3140.9 93766910 93606383 93521613 93549716 93680561 93853343 93984634 94037241 94039738 94025165 94001663 93979186
3163.4 93979186 93980747 94024426 94106925 94206566 94295824 94353819 94374722 94357312 94314814 94282156 94268870 94248372
3187.8 94248372 94194335 94103587 93997967 93907428 93846244 93797725 93737286 93665177 93599540 93553859 93521768
3210.3 93521768 93478912 93405944 93302321 93194133 93108416 93032610 92945176 92842442 92725611 92604107 92495692
3232.7 92495692 92412180 92340255 92253572 92144924 92033488 91941786 91865689 91788268 91704464 91617423 91533703
3255.1 91533703 91461885 91403425 91344923 91271287 91183376 91100252 91038013 90987748 90928566 90842038 90724677
$$ packed form
3100.1G9658878J965052K281475J843506J353156J095391R97007J004231J057326J028115
3118.5I2284137Q44055N75787L44223J94091R0432M595n4001q9396j15668j41365j69980
3140.9I3766910j60527q4770K8103J30845J72782J31291N2607K497j4573k3502k2477
3163.4I3979186J561M3679Q2499R9641Q9258N7995K0903j7410m2498l2658j3286k0498
3187.8I4248372n4037r0748j05620r0539o1184m8519o0439p2109o5637m5681l2091
3210.3I3521768m2856p2968j03623j08188q5717p5806q7434j02734j16831j21504j08415
3232.7I2495692q3512p1925q6683j08648j11436r1702p6097p7421q3804q7041q3720
3255.1I1533703p1818n8460n8502p3636q7911q3124o2239n0265n9182q6528j17361
$$ plain form
3277.6 90724677 90602577 90502268 90416831 90327811 90227205 90114784 89997673 89875072 89742237 89598513
3298 89598513 89438856 89274776 89131808 89009327 88880414 88722527 88537645 88342148 88144392 87945020
3318.4 87945020 87738669 87513518 87263125 86988378 86701101 86424971 86169237 85928935 85693675 85442269
3338.8 85442269 85174841 84912759 84658331 84397042 84117752 83817202 83503366 83190686 82875001 82543337
3359.1 82543337 82195055 81837833 81490630 81162453 80835301 80494297 80149901 79820156 79516876 79241818
3379.5 79241818 78984171 78731072 78471214 78204554 77952027 77726758 77505571 77269727 77028477 76786411
3399.9 76786411 76545739 76310575 76075655 75822729 75523114 75160789 74737442 74274307 73859209 73624176
3420.3 73624176 73647410 73900455 74254787 74570811 74795562 74934894 75003821 75041932 75095904 75186962 75295550
$$ packed form
3277.6I0724677j22100j00309q5437q9020j00606j12421j17111j22601j32835j43724
3298H9598513j59657j64080j42968j22481j28913j57887j84882j95497j97756j99372
3318.4H7945020k06351k25151k50393k74747k87277k76130k55734k40302k35260k51406
3338.8H5442269k67428k62082k54428k61289k79290l00550l13836l12680l15685l31664
3359.1H2543337l48282l57222l47203l28177l27152l41004l44396l29745l03280k75058
3379.5G9241818k57647k53099k59858k66660k52527k25269k21187k35844k41250k42066
3399.9G6786411k40672k35164k34920k52926k99615l62325m23347m63135m15098k35033
3420.3G3624176K3234K53045L54332L16024K24751J39332O8927L8111N3972R1058J08588
$$ plain form
3442.8 75295550 75405049 75537127 75670892 75780612 75900060 76033938 76154971 76273996 76417667 76568216
3463.2 76568216 76694012 76814383 76958090 77122712 77298927 77466345 77608848 77751935 77919066 78080368
3483.6 78080368 78226471 78389382 78559548 78712195 78867513 79045123 79219866 79384488 79585892 79807436
3504 79807436 79972959 80120575 80307692 80503982 80695635 80893004 81087822 81276655 81488538 81720835
3524.4 81720835 81943268 82164937 82365978 82532156 82730579 82983810 83221012 83422899 83642113 83913726
3544.7 83913726 84185594 84373587 84556586 84819561 85062045 85247433 85459387 85701674 85924399 86235565
3565.1 86235565 86717695 87061977 87152290 87278968 87557524 87886846 88201171 88467473 88690060 89037257
3585.5 89037257 89595056 89998823 90136212 90356171 90716541 91043937 91356593 91665751 91887081 92127138
$$ packed form
3442.8G5295550J09499J32078J33765J09720J19448J33878J21033J19025J43671J50549
3463.2G6568216J25796J20371J43707J64622J76215J67418J42503J43087J67131J61302
3483.6G8080368J46103J62911J70166J52647J55318J77610J74743J64622K01404K21544
3504G9807436J65523J47616J87117J96290J91653J97369J94818J88833K11883K32297
3524.4H1720835K22433K21669K01041J66178J98423K53231K37202K01887K19214K71613
3544.7H3913726K71868J87993J82999K62975K42484J85388K11954K42287K22725L11166
3565.1H6235565M82130L44282R0313J26678K78556L29322L14325K66302K22587L47197
3585.5H9037257N57799M03767J37389K19959L60370L27396L12656L09158K21330K40057
$$ plain form
3605.9 92127138 92548859 93002373 93338996 93589276 93750262 94035715 94450730 94606459 94528979 94592476
3626.3 94592476 95196897 95841593 95895785 95853984 95952117 96074450 96200114 96260470 96254730 96457988 97116190
3648.8 97116190 97652042 97516996 97312462 97473139 97586948 97527975 97496212 97427261 97375047 97643328
3669.2 97643328 97952986 97943318 98203558 98516005 98337746 98086220 97905904 97758967 97919476 98406595
3689.6 98406595 98596954 98412019 98238218 98177892 98225135 98404509 98482066 98331827 98246902 98476088
3709.9 98476088 98871297 98901933 98592943 98376250 98385525 98499399 98595983 98636645 98517150 98350060 98456156
3732.4 98456156 98841584 99140948 98995668 98486531 98268408 98742288 98955041 98785853 99072367 99369276
3752.8 99369276 99157667 98914909 98963779 99032134 98909765 98852688 98926497 99076819 99216986 99133515 98948449
$$ packed form
3605.9I2127138M21721M53514L36623K50280J60986K85453M15015J55729p7480O3497
3626.3I4592476O04421O44696N4192m1801R8133J22333J25664O0356n740K03258O58202
3648.8I7116190N35852j35046k04534J60677J13809n8973l1763o8951n2214K68281
3669.2I7643328L09658r668K60240L12447j78259k51526j80316j46937J60509M87119
3689.6I8406595J90359j84935j73801o0326M7243J79374P7557j50239q4925K29186
3709.9I8476088L95209L0636l08990k16693R275J13874R6584M0662j19495j67090J06096
3732.4I8456156L85428K99364j45280n09137k18123M73880K12753j69188K86514K96909
3752.8I9369276k11609k42758M8870O8355j22369n7077P3809J50322J40167q3471j85066
$$ plain form
3775.2 98948449 98913884 99062121 99143076 99085498 99062586 99036658 98972732 98916215 98874438 98915648 98924875 98952264
3799.7 98952264 99252170 99321175 99188453 99272716 99155992 98791099 98652458 98915631 99077725 99161601
3820.1 99161601 99422944 99364227 99159420 99084496 99049282 99066168 99059957 99157065 99472755 99616379 99525148
3842.5 99525148 99408299 99190879 98841369 98641336 99188113 100000000 99866098 99342191 99082494 99157852
3862.9 99157852 99318379 99291837 99347728 99567431 99586880 99468768 99299735 99284875 99438792 99440056 99506879
3885.4 99506879 99557590 99447805 99539614 99622780 99423742 99289399 99417889 99634635 99814171 99841297
3905.7 99841297 99663371 99487931 99416804 99387670 99458224 99615914 99677688 99635357 99638993 99663615 99615330
3928.2 99615330 99607360 99697548 99728262 99667782 99630487 99669474 99783653 99866933 99884093 99941713 100000000 99989605
$$ packed form
3775.2I8948449l4565J48237Q0955n7578k2912k5928o3926n6517m1777M1210R227K7389
3799.7I8952264K99906O9005j32722Q4263j16724l64893j38641K63173J62094Q3876
3820.1I9161601K61343n8717k04807p4924l5214J6886o211R7108L15690J43624r1231
3842.5I9525148j16849k17420l49510k00033N46777Q11887j33902n23907k59697P5358
3862.9I9157852J60527k6542N5891K19703J9449j18112j69033j4860J53917J264O6823
3885.4I9506879N0711j09785R1809Q3166j99038j34343J28490K16746J79536K7126
3905.7I9841297j77926j75440p1127k9134P0554J57690O1774m2331L636K4622m8285
3928.2I9615330p970R0188L0714o0480l7295L8987J14179Q3280J7160N7620N8287j0395
$$ plain form
3952.7 99989605 99959272 99944431 99947959 99980140 100022101 100032163 100018525 100018144 100040698 100066614 100073099 100053871
3977.1 100053871 100029325 100024414 100040102 100056624 100063646 100071347 100071692 100054038 100043583 100061131
3997.5 100061131
$$ packed form
3952.7I9989605l0333j4841L528L2181M1961J0062j3638l81K2554K5916O485j9228
3977.1A00053871k4546m911J5688J6522P022P701L45j7654j0455J7548
3997.5A00061131
##END=$$ End of the data block
