##TITLE=$$ Begin of the data block
##JCAMP-DX=5.00 $$ ACD/SpecManager v 10.08
##SPECTROMETER/DATA SYSTEM=16PC
##DATE=16 Jul 2013 10:23:36
##DATA TYPE=INFRARED SPECTRUM
##DATA CLASS=XYDATA
##ORIGIN=
##OWNER=
##NPOINTS=3601
##FIRSTX=400.00000000
##LASTX=4000.00000000
##MAXX=4000.00000000
##MINX=400.00000000
##MAXY=36.71701050
##MINY=1.17580795
##XFACTOR=1.0000000000
##YFACTOR=0.000000100000000
##FIRSTY=32.14454651
##DELTAX=1.00000000
##XUNITS=1/CM
##YUNITS=TRANSMITTANCE
##XYDATA=(X++(Y..Y))
400C21445465O206970J625786j1718979j3544082q036614J268387K2868385K6307831
408C46423149J5041809N705147j0408402j5111923j1490364n390663J1370430J1904945
416C48044128k822151r783745j7606487j4813175K382736P355232M461518K896766
424C20114822j152267j630058K634525R00288p890721q769035j574040j919746j0236740
433B90477028r190788Q19912M051208L288975L132362R81083K633572R007683J0630149
442C15831184J0521164O072998p164497q783321M77314L162880K744674K789955K390137
451C28042488J610298O7711p72018j208306j511802k165337r68666L091545L760605
460C29946518J934509K82059l494988k873420K629547M555931N424499L616333k251853
$$ y = [321445465, 327652435, 329278221, 317559242, 304015160, 295978546, 297246933, 320115318, 346423149, 361464958, 367170105, 356761703, 341649780, 330159416, 324768753, 336139183, 348044128, 345221977, 335438232, 317831745, 303018570, 305401306, 312756538, 317218056, 320114822, 318962555, 317332497, 319967022, 320867310, 312976589, 304207554, 302633514, 300713768, 290477028, 281286240, 282106152, 286157360, 289446335, 292578697, 293559780, 296193352, 305201035, 315831184, 326352348, 332425346, 325260849, 316477528, 316954842, 320117722, 322862396, 325652351, 328042488, 329652786, 329720497, 328948479, 327740173, 326228371, 324063034, 323094368, 326185913, 329946518, 331881027, 332163086, 328668098, 325794678, 328424225, 332980156, 338404655, 342020988, 339769135]
469C39769135n029679p467270n714187K201538M541168K890587K644081K484550K283822
478C38603745K771110J156120l751754m402886q20885m61120k924652k351761J608353
487C29426270J690139j986732k636414j036873q62121j341591j884003l168106l072014
496C15128555j478920r81331q75701j385460l917446k624035L649482M434815o0559
505C11889400j98364L238430L742943K283096J493225J0491O50406M123420M769822
514C32002869L482818K348671L72658n55038m76380j115074k892265k400399P72973
523C31540833J567344M67529N93682J770973J576653k78931k14348J869659J992951
532C40886345N24292l4332j53771m55856j011391r18159q316J43509m57306k58179
$$ y = [339769135, 334739456, 327272186, 321557999, 323759537, 328300705, 331191292, 333835373, 336319923, 338603745, 341374855, 342530975, 338779221, 334376335, 333555450, 333094330, 330169678, 327817917, 329426270, 331116409, 329129677, 326493263, 325456390, 324594269, 323252678, 321368675, 318200569, 315128555, 313649635, 312668304, 311792603, 310407143, 306489697, 303865662, 307515144, 311949959, 311889400, 311691036, 314929466, 318672409, 320955505, 322448730, 322459221, 323109627, 327233047, 332002869, 335485687, 337834358, 338207016, 337651978, 337175598, 336060524, 333168259, 330767860, 331540833, 333108177, 333575706, 334169388, 335940361, 337517014, 337238083, 337023735, 338893394, 340886345, 341410637, 341376305, 341222534, 340766678, 339755287, 338837128, 338828812, 338972321, 338515015, 338256836]
542C38256836O92139J032562J086731R21478J32561K69432K200088R00765m899483
551C40593109n093613l93600J939774M470596M201164O12984j223831l368149k655716
560C39082718K107849K977142R67980l9597j341324j637458q94089n46684l2425j67618
570C40476494j459847j064987J598816J357803k076644k378464K6970N12352j89286
579C36803207l83148m69436n44320m85420o86416j399270j225242l37372N57899K533684
589C34364166K001038j699906k341766r12895L12805K767792K992897J068344J29204
598C38681679q31604r23882J66435K91329l93829l63388L79829L20892k95143r32922
608C36099396k476006j926651J395455J767883m44870r82056n85327n51681p44591
$$ y = [338256836, 338948975, 339981537, 341068268, 341989746, 342122307, 342391739, 344591827, 345492592, 340593109, 335499496, 335105896, 337045670, 341516266, 345717430, 346330414, 345106583, 341738434, 339082718, 341190567, 344167709, 345135689, 345096092, 343754768, 342117310, 341223221, 340676537, 340644112, 340476494, 339016647, 337951660, 339550476, 340908279, 338831635, 336453171, 336480141, 336992493, 336803207, 336420059, 335950623, 335406303, 334920883, 334234467, 332835197, 331609955, 331272583, 331830482, 334364166, 336365204, 334665298, 332323532, 331410637, 331723442, 334491234, 337484131, 338552475, 338681679, 337850075, 336926193, 337092628, 337383957, 336990128, 336626740, 337006569, 337327461, 337032318, 336099396, 333623390, 331696739, 333092194, 334860077, 334415207, 333433151, 332847824, 332296143, 331551552]
617C31551552m14391O68526Q34694J84097j6250N0087j49956o27060q08716o14853
627C30657730r39636k080917j955491p23114J68305J497993J594048M09126j95732
636C28432312p43408j004906j240044o42280J682281J351128j943817k590675j210442
645C22090149r33418j109581j209526j778603j167049Q56647J715164K208252J713257
654C22385292l81470j008720m13666o84280k009850j547584Q95729J703758K16942
663C19156151K689628J4132462Q245010k0977249k3218155j311302N759697O836186
671C11312428N536556k340317l610382J060028J149883k394428k839336q51384m98771
680C06524277j360188j055965J17302R65843K202759K169361Q61168m8161j313934
$$ y = [331551552, 331137161, 331805687, 332640381, 332824478, 332808228, 332858315, 332708359, 332081299, 331272583, 330657730, 329718094, 327637177, 325681686, 324958572, 325126877, 326624870, 328218918, 328628044, 328432312, 327688904, 326683998, 325443954, 324801674, 326483955, 327835083, 325891266, 323300591, 322090149, 321156731, 320047150, 318837624, 317059021, 315891972, 316748619, 318463783, 320672035, 322385292, 322003822, 320995102, 320581436, 319897156, 317887306, 316339722, 317235451, 318939209, 319156151, 321845779, 335978241, 344223251, 323246002, 300027847, 298716545, 304476242, 311312428, 316848984, 314508667, 310898285, 311958313, 313108196, 310713768, 307874432, 307023048, 306524277, 305164089, 304108124, 304225426, 305191269, 307394028, 309563389, 310424557, 310376396, 309062462]
689C09062462j590481p71999o27995m57058j298656l837338m297504k849827k588024
698B90743580l151894k890587j454353j893043m827500m725208j376152j153717l829003
707B65442123l944397j780281j674881l135204l798008l678551n081672p689934j0468483
716B24190712j3232727j7757416k5304069k9052735l1615734k9364586k1652460j4698267
724D1512718n531549J83344L303527O062031P690907R025335R305477J0735035J2537480
733I4824305J5613555K0739317K3906947K6283502K7205944K7179718K4846306J9486675
741B80086269J5334835J1141549P669220M573822K467384J198997P59354J835861J687737
750C26755028O27517J43052l22571l1014J718293J381645j413346j635780M38194Q80738
$$ y = [309062462, 307471981, 306699982, 306071987, 305614929, 304316273, 300478935, 296181431, 293331604, 290743580, 287591686, 284701099, 283246746, 281353703, 276526203, 271800995, 270424843, 269271126, 265442123, 261497726, 259717445, 258042564, 254907360, 251109352, 247430801, 242349129, 234659195, 224190712, 210957985, 193200569, 167896500, 138843765, 107228031, 77863445, 56210985, 41512718, 35981169, 36164513, 39468040, 45530071, 53220978, 62246313, 71551790, 82286825, 94824305, 110437860, 131177177, 155084124, 181367626, 208573570, 235753288, 260599594, 280086269, 295421104, 306562653, 314231873, 318805695, 321273079, 322472076, 323231430, 325067291, 326755028, 327382545, 327525597, 327203026, 327172012, 328890305, 330271950, 328858604, 327222824, 327661018, 328541756]
760C28541756M37011N3635n40009j208305k609482k248306K40326R00497L83377L7690
770C23988190o00815j024475j499672j471520o03428p97977k156258k373237j669884
779C11790924j470566j510620j425247j241684j217384j011849j729469l577957m625321
788B93980827n421638n698929n921116m501343j229763J465073M931946O202202O088752
797B89896011M309159q26588k278328r20048k97546R58671R14345p52449q22792M40369
807B90620804Q69026J264343N88417j824150k275238j159420n96523R5367L06855j78338
817B87711143J13488J246452J490097J245747O37760o19393j508255k700080k527714
826B85089245n81494j69296n92937j340618l280411l453255j756439j562347k396813
$$ y = [328541756, 328978767, 329032402, 328492393, 327284088, 324674606, 322426300, 322666626, 323567123, 323950500, 323988190, 323387375, 322362900, 320863228, 319391708, 318788280, 317990303, 315834045, 313460808, 311790924, 310320358, 308809738, 307384491, 306142807, 304925423, 303913574, 302184105, 298606148, 293980827, 288559189, 282860260, 276939144, 272437801, 271208038, 272673111, 277605057, 283807259, 289896011, 294205170, 293378582, 291100254, 290180206, 289882660, 290841331, 291755676, 291003227, 290180435, 290620804, 291489830, 292754173, 293342590, 291518440, 289243202, 288083782, 287487259, 287582626, 287889481, 287711143, 287824631, 289071083, 290561180, 291806927, 292444687, 291825294, 290317039, 287616959, 285089245, 284507751, 284338455, 283745518, 282404900, 279124489, 275671234, 273914795, 272352448, 269955635]
835B69955635k784729l196716l225327k653122k757797l578663l681660l182640l055572
844B41839409l376732k867470j770477l94821J979580K780666K189884K050152J873512
853B44303703J766205J702538J676330J932850J493454K81582m19388r53674j229515
862B50554085p51038j595726l580322n361805p014751r584904j4494190j5010109j3229142
871A79932098p500400N711803J0610810R361496R101162P464408O773243O775132O155490
880B34385242M922162M358043M461994L955613K873649K351761K301941J940002J317749
889B62868156J011124J164684O21796p98702j217118r93728n70069M90189Q80470N61962
899B64018764R95884K177697K661476K638340K788791K972107L069420L057709L145695
$$ y = [269955635, 267170906, 263974190, 260748863, 258095741, 255337944, 251759281, 248077621, 244894981, 241839409, 238462677, 235595207, 233824730, 233429909, 235409489, 238190155, 240380039, 242430191, 244303703, 246069908, 247772446, 249448776, 251381626, 252875080, 253156662, 252737274, 251783600, 250554085, 249803047, 248207321, 244626999, 239265194, 232250443, 222665539, 208171349, 193161240, 179932098, 172431698, 178143501, 188754311, 198115807, 207216969, 214681377, 221454620, 228229752, 234385242, 239307404, 243665447, 248127441, 252083054, 254956703, 257308464, 259610405, 261550407, 262868156, 263879280, 265043964, 265665760, 264867058, 263649940, 262656212, 262086143, 262576332, 263456802, 264018764, 265014648, 267192345, 269853821, 272492161, 275280952, 278253059, 281322479, 284380188, 287525883]
908B87525883L440151L305187K719879K403260K300739J910934J173973Q28247Q49724
917C06457977N94139J04447j47820l59077k18144N10216N73158J19458j92891o47792
927C06793671p71027n27382n35011q34961o47049J62830K74411k25525l67413k40078
937C03082466m59213j079312j266956j202354r98249m57287k58923l56674k59647J8844
947B96762695M1008q7967l52859p79152j282692k197037k272835j409778j259804j427173
957B85734406j845837k787838l231049l307342l513565l629208m041672m758587n364418
966B53254890o313095o205558n119553m144917l294696j428147J714707L951568O199341
975B38614540O969223O276360N548019M134884L203869K314091K061138L020515K293816
$$ y = [287525883, 290966034, 294271221, 296991100, 299394360, 301695099, 303606033, 304780006, 305608253, 306457977, 307052116, 307156563, 307008743, 306649666, 306431522, 306941738, 307514896, 307634354, 307441463, 306793671, 306022644, 305495262, 304960251, 304125290, 303478241, 303641071, 303915482, 303689957, 303322544, 303082466, 302623253, 301543941, 300276985, 299074631, 298076382, 297619095, 297360172, 297003498, 296743851, 296762695, 296803703, 296715736, 296362877, 295583725, 294301033, 292103996, 289831161, 288421383, 287161579, 285734406, 283888569, 281100731, 277869682, 274562340, 271048775, 267419567, 263377895, 258619308, 253254890, 246941795, 240736237, 235616684, 231471767, 228177071, 226748924, 228463631, 232415199, 238614540, 245583763, 251860123, 257408142, 261543026, 264746895, 267060986, 269122124, 272142639, 274436455]
984B74436455j54000j286277k007962j738796j21116Q31851J866589K007237J224994
993B75058975O09627k10991q38509j492996j692524j289844j358261j684914k049675
1002B65050888k613068k955684k814541l660908n545616o795177p117272r357452j3206234
1011B10984936j7057419k3076057k4209261k1787882j7541409r539127l774882K317906
1019I6316805M466295J541615K328872M263163Q816719J8938541K1357060J7936945
1027A75966015J4488697Q287659M421005J559257o9618J51863m75635j562596j971244
1036B00795403j836548j757126j683483j218319k08130L32584N29042Q93363J296044
1045A97142830J740932K217770K763271L521672L877639L952523L875236L579140L201027
$$ y = [274436455, 274282455, 272996178, 270988216, 269249420, 269128304, 269960155, 271826744, 273833981, 275058975, 275668602, 275457611, 274619102, 273126106, 271433582, 270143738, 268785477, 267100563, 265050888, 262437820, 259482136, 256667595, 253006687, 247461071, 240665894, 233548622, 224191170, 210984936, 193927517, 170851460, 146642199, 124854317, 107312908, 97773781, 93998899, 96316805, 100783100, 102324715, 104653587, 108916750, 117733469, 136672010, 158029070, 175966015, 190454712, 198742371, 203163376, 204722633, 204653015, 204804878, 204329243, 202766647, 200795403, 198958855, 197201729, 195518246, 194299927, 194091797, 194424381, 194953423, 195846786, 197142830, 198883762, 201101532, 203864803, 207386475, 211264114, 215216637, 219091873, 222671013, 225872040]
1054B25872040K701034K099266J219521P46250N99384M11988M93774l0289j205673
1063B32907295j976509k671242l035049k979527l115406l125686l669491m859676n585671
1072B01889038n954037o651401p582665q444786r492874j0012150j0021925j0161161
1080A33568039j0559321j0060071q464575p728100p447958p279396p593393p253647
1088F7181578o358862n650997m817009m368782m430056l994942l253698k452612j308441
1097C0546179p07865o29902k73466K86579N47648N02586O79255R58919J285791K056122
1107C5251846J739502L1472l21150M56571N15461L09706j31369j231670j325846m19140
1117C4875383j56641j71899k87772p99656p03811J8120K87294L40700L06606p5578
$$ y = [225872040, 228573074, 230672340, 231891861, 232638111, 233237495, 233649483, 234143257, 234112968, 232907295, 230930786, 228259544, 225224495, 222244968, 219129562, 216003876, 212334385, 207474709, 201889038, 195935001, 189283600, 181700935, 173256149, 163763275, 153751125, 143729200, 133568039, 123008718, 112948647, 104484072, 96755972, 89308014, 82028618, 74435225, 67181578, 60822716, 55171719, 50354710, 45985928, 41555872, 37560930, 34307232, 31854620, 30546179, 29838314, 29208412, 28934946, 29221525, 29769173, 30271759, 30951014, 31909933, 33195724, 35251846, 36991348, 37022820, 36701670, 37158241, 37673702, 37983408, 37852039, 36620369, 35294523, 34875383, 34718742, 34546843, 34259071, 33459415, 32755604, 32773724, 33061018, 33401718, 33708324, 33632746]
1127C3632746J05381Q25643J266003J518011K032757K595901L611803N103112O574392
1136E7265749Q496761R478092R459019J0066033J1304855J1523485J0858774J0415554
1144A38868322R849072R430408R104967Q817444Q898487Q079281O117115N250931N161285
1153B09577312M885426M849205M310608L179779K556572K212753J959801K018223J694679
1162B37244358J100292M83513k77977r44385j533261k215881l228893l457070l070583
1171B24100113k504597j588344n71728Q57353J697540K043248K517223L103008L243447
1180B32897263K932319K751827K608777K292404J776924J374721J046658O34422J54038
1189B48469353l03765p99408j184463j590729j642456j170158j227875j662254k032509
$$ y = [33632746, 33738127, 34563770, 35829773, 37347784, 39380541, 41976442, 45588245, 50691357, 57265749, 65762510, 75240602, 84699621, 94765654, 106070509, 117593994, 128452768, 138868322, 148717394, 158147802, 167252769, 176070213, 184968700, 193047981, 199165096, 204416027, 209577312, 214462738, 219311943, 223622551, 226802330, 229358902, 231571655, 233531456, 235549679, 237244358, 238344650, 238828163, 238550186, 237605801, 236072540, 233856659, 230627766, 227170696, 224100113, 221595516, 220007172, 219435444, 220292797, 221990337, 224033585, 226550808, 229653816, 232897263, 235829582, 238581409, 241190186, 243482590, 245259514, 246634235, 247680893, 248315315, 248469353, 248165588, 247366180, 246181717, 244590988, 242948532, 241778374, 240550499, 238888245, 236855736]
1198B36855736k593765k768269k577534k514381k395134k462883k825012k811432k490273
1207B13417053k260208j837501j958371k700557l017426l136883l196468k927551l269425
1216A89112663m210968m859924n536785n855560n906106n717277m977465m904747n341053
1225A41802778n701542o118774o650448p155418q142472r940385j0728598j0993481
1233G6371660j0612726r355783q269549o972790n944252n140543m256963l333807k517701
1242A9967546j724720j146078o99520n26190q51869o34194J96219L18050k10523l02553
1252A4386168q3924j40428m97580m68731p8678Q4162J99079J34945k15769k93016k23160
1263A2803068o3419L22580M43936K99930L84569P25508P17640M12226K05755j72854
$$ y = [236855736, 234261971, 231493702, 228916168, 226401787, 224006653, 221543770, 218718758, 215907326, 213417053, 211156845, 209319344, 207360973, 204660416, 201642990, 198506107, 195309639, 192382088, 189112663, 184901695, 180041771, 174504986, 168649426, 162743320, 157026043, 152048578, 147143831, 141802778, 136101236, 129982462, 123332014, 116176596, 108034124, 98093739, 87365141, 76371660, 65758934, 56403151, 48133602, 41160812, 35216560, 30076017, 25819054, 22485247, 19967546, 18242826, 17096748, 16397228, 15871038, 15019169, 14384975, 14581194, 14899244, 14688721, 14386168, 14302244, 14161816, 13664236, 13195505, 13116827, 13200989, 13400068, 13535013, 13319244, 13026228, 12803068, 12739649, 13062229, 13506165, 13806095, 14190664, 14916172, 15633812, 16046038, 16251793, 16078939]
1273A6078939l6954O81638J021385J260519J247645Q12769P84635J051188J230478
1282B4132242J393080J636744K035856K192020K114058K161741K163649K445936K891302
1291D3166628L641367N049229N557298N145312N448818O077289O957293Q624077R007930
1300I8675241Q219243P883787P629871P317305O827116O772279P170439P335663P675648
1309A65506592P242203N768299N269756N426178N502472N906334N740166M993209M604569
1318B15959778M461517M073391L387451L102551L221741L032684K996673J979123l0995
1327B42183914j858234l886223n758534p213821r654522j3352146j5820751j7961025
1335A66678658j8659115j8114329j6644954j4225722j0639906n533933n38588M882336
$$ y = [16078939, 16041985, 16723623, 17745008, 19005527, 20253172, 21065941, 21850576, 22901764, 24132242, 25525322, 27162066, 29197922, 31389942, 33504000, 35665741, 37829390, 40275326, 43166628, 46807995, 51857224, 57414522, 62559834, 68008652, 74085941, 81043234, 89667311, 98675241, 106894484, 114778271, 122408142, 129725447, 136552563, 143324842, 150495281, 157830944, 165506592, 172748795, 178517094, 183786850, 189213028, 194715500, 200621834, 206362000, 211355209, 215959778, 220421295, 224494686, 227882137, 230984688, 234206429, 237239113, 240235786, 242214909, 242183914, 240325680, 236439457, 230680923, 223467102, 213812580, 200460434, 184639683, 166678658, 148019543, 129905214, 113260260, 99034538, 88394632, 82860699, 82322111, 87204447]
1343H7204447J0213136J6542435K0030737K1662712K1336546J8335343J5628585J2034417
1351B22988358R307632P012596N134583L822097K494812J277428K49157r9430j812935
1360B50374298n309105o872635p279892p142524n740662n343189o243000n000820j508465
1369A99934006L58581J552811K139568J509419K032776L858795M017601K688865K121697
1378B20214119J976490J359234K05269l34511j99547p82738k370586k425671j363983
1387B16278076n8899K550850L092995K450218M62303m722366n538216j654625j960754
1396B10899582n780220o931782o318569o512165o257057q005391j2512912j4304161
1404A44277325j4975548j3616800r605885o342888l785133J294851R570599J5120268
$$ y = [87204447, 97417583, 113960018, 133990755, 155653467, 176990013, 195325356, 210953941, 222988358, 232295990, 239308586, 244443169, 248265266, 250760078, 252037506, 252286663, 252187233, 250374298, 245065193, 238192558, 230912666, 223770142, 218029480, 212686291, 206443291, 201442471, 199934006, 200292587, 201845398, 203984966, 205494385, 207527161, 211385956, 215403557, 218092422, 220214119, 222190609, 223549843, 223755112, 223420601, 223221054, 222438316, 220067730, 217642059, 216278076, 216219177, 218770027, 221863022, 224313240, 224775543, 220053177, 214514961, 212860336, 210899582, 205119362, 198187580, 191869011, 185356846, 179099789, 171094398, 158581486, 144277325, 129301777, 115684977, 106079092, 99736204, 95951071, 97245922, 106816521, 121936789]
1412A21936789J9395828K2509336K5848141K3749351J4733563J0380993P739773P035503
1420B53329277J0689735Q787156O28700j074314L115406K734680p21474k770176n338421
1429B69380569n203971j745949o72798L55949k313385j1732559j2041588l817558o12259
1438B31596451Q95500R70840j756668k070427l63807k80381j175651j987228l903847
1447B21924782l233452P19566J479149j156101R2983P296333M894257r674568j0606766
1456B11736183O8665M663467P534027Q942604R359856O638985j829853l462792J061192
1465B44712334J871109J026401J56651j443863k582550n239735k687702O996651R392242
1474B52201538O016979N220414N211124M803410M394283L580818J727581J776695M338513
$$ y = [121936789, 141332617, 163841953, 189690094, 213439445, 228173008, 238554001, 246293774, 253329277, 264019012, 272806168, 273434868, 272360554, 275475960, 278210640, 277489166, 274718990, 269380569, 264176598, 262430649, 261757851, 262113800, 259800415, 248067856, 236026268, 232208710, 231596451, 232491951, 233462791, 231706123, 229635696, 229271889, 228991508, 227815857, 225828629, 221924782, 218691330, 219410896, 220890045, 219733944, 219826927, 227123260, 232017517, 222342949, 211736183, 211804848, 216468315, 224002342, 232944946, 242304802, 248943787, 247113934, 243651142, 244712334, 246583443, 247609844, 247766495, 246322632, 243740082, 238500347, 235812645, 242809296, 252201538, 258218517, 263438931, 268650055, 273453465, 277847748, 281428566, 283156147, 284932842, 289271355]
1483B89271355M028778J235733k10285r72500k228508n362282l663063M379043O011010
1492B92489281L856888J70478q603096j0498047n816230n316487p303714p801533p425308
1501B43752232p691136q310318q923301j3196946o824970J3528118K0211678J8276214
1509B50821571J5169869N624771L263950Q506527O049881n187759n577316N619773
1517B84291267N816460l025303o166458q452415n242825P984161Q499871m191170n380631
1526B74132957K390862M576683M639626L275146r79881k968331o041031j954326J4654636
1535B91726341J4087906k694130r837856j5590668j2819290K977619O658554P23114
1543B75231590L13759L053894L307114J899242J162052K46048K16484J673699J148701
$$ y = [289271355, 293300133, 294535866, 294325581, 293353081, 291124573, 285762291, 282099228, 286478271, 292489281, 296346169, 296516647, 287913551, 277415504, 271599274, 266282787, 258979073, 251177540, 243752232, 236061096, 227750778, 218827477, 205630531, 198805561, 212333679, 232545357, 250821571, 265991440, 271616211, 274880161, 283386688, 289436569, 284248810, 278671494, 284291267, 290107727, 287082424, 280915966, 272463551, 267220726, 275204887, 283704758, 279513588, 274132957, 276523819, 281100502, 285740128, 289015274, 288035393, 285067062, 279026031, 277071705, 291726341, 305814247, 303120117, 293282261, 277691593, 264872303, 267849922, 274508476, 275231590, 275545349, 278599243, 281906357, 283805599, 284967651, 285213699, 285430183, 287103882, 288252583]
1552B88252583k743721r94435J0824204N989532j9715309k2699814p783432P18117
1560B51847725J2624035J2970447j027336l267536M239330L432026l954181o800156
1568B70064354q903046o196022M936714N962830n97000o294479j8268357j6413917
1576B24291077J131057O811619N198727N561104N360832N478630O088486N611667L976345
1585B69509544L046990K439728J822967J186371R00726J186867P87735m07944o99768
1594B79773216k88963p3185L45230K72503k12173p34101j795997j761685l98388k76565
1604B74849892j040001j543999k278557k431640k348652j462460M96140J879940N171299
1613B71291962K085914j1317711j0990638K546310P325897R224663O701927l979683
$$ y = [288252583, 285508862, 284514427, 295338631, 301328163, 281612854, 258913040, 251129608, 251847725, 264471760, 277442207, 276414871, 273147335, 277386665, 280818691, 276864510, 270064354, 261161308, 254965286, 259902000, 265864830, 265267830, 258973351, 240704994, 224291077, 225422134, 232233753, 237432480, 242993584, 248354416, 253833046, 259921532, 265533199, 269509544, 272556534, 274996262, 276819229, 278005600, 278906326, 280093193, 280880928, 280472984, 279773216, 279484253, 279411068, 279756298, 280028801, 279816628, 279082527, 277286530, 275524845, 275126457, 274849892, 273809891, 272265892, 269987335, 267555695, 265207043, 263744583, 264240723, 266120663, 271291962, 273377876, 262060165, 251069527, 253615837, 260941734, 270166397, 276868324, 272888641]
1621B72888641o331672k503872l86486L502845L122578k938270k997647K045632M104862
1630B70506611O433735M102211m218331q286705j2825012r187240O819019R776821
1638B63121109J415024K33421L693581L446579J672744k000579j1734963j0513534
1646B49333382J530399P910976J7873993J0921479k0574093k5605450r982567j476288
1654B29931831J0019055J1849651K911797K70614J564484q28743p897835q066902j661301
1663B38092651J044751L738651J943092o339531q643875q013954m739761N860786N346794
1672B28289604p284660r583225m983654k197991K614250K802620k530822l147583J996269
1681B05974808j515389j7801285j5973815N270500R829750K594471J04656k449493
$$ y = [272888641, 266556969, 264053097, 263666611, 267169456, 270292034, 267353764, 264356117, 266401749, 270506611, 276940346, 281042557, 276824226, 268537521, 255712509, 246525269, 253344288, 263121109, 264536133, 264769554, 268463135, 271909714, 273582458, 271581879, 259846916, 249333382, 250863781, 258774757, 276648750, 287570229, 266996136, 241390686, 231408119, 229931831, 239950886, 251800537, 254712334, 254982948, 256547432, 255718689, 247820854, 239753952, 238092651, 239137402, 242876053, 244819145, 238479614, 229835739, 221821785, 217082024, 222942810, 228289604, 221004944, 211421719, 206438065, 204240074, 206854324, 209656944, 207126122, 203978539, 205974808, 204459419, 186658134, 170684319, 175954819, 185784569, 188379040, 188483696, 186034203]
1689A86034203k372284K102852J210937m503250p455597j0983925r322176J737356
1697A56448116m04358j8295288j9145727l952265j520872p659435j0331631j3427257
1705H1711283j3426304r568930q414745r149552q473873p014990n563259l660679k352237
1714A4086714j451016o62803L2186K57731j71900j38521L03983K49386m10557l37123
1724A1758080M54187O86645M31300O77824J472234J640320J065016J388311K461911
1733B2035828L237247L902197M751205N544663O943703Q887052J0958433J3564825
1741G9825153J5492678J7077684J8187762J9414901J8523207J5400887J2730140Q931618
1749B05584030P640381Q580437R219646J1739731R943008K290726J135826O256104
$$ y = [186034203, 183661919, 185764771, 186975708, 182472458, 175016861, 164032936, 154710760, 156448116, 156043758, 137748470, 118602743, 114650478, 113129606, 105470171, 95138540, 81711283, 68284979, 58716049, 50301304, 41151752, 32677879, 25662889, 20099630, 16438951, 14086714, 12635698, 11972895, 12005081, 12262812, 12090912, 11952391, 12256374, 12505760, 12095203, 11758080, 12212267, 12898912, 13330212, 14008036, 15480270, 17120590, 18185606, 19573917, 22035828, 25273075, 29175272, 33926477, 39471140, 46414843, 55301895, 66260328, 79825153, 95317831, 112395515, 130583277, 149998178, 168521385, 183922272, 196652412, 205584030, 213224411, 221804848, 231024494, 242764225, 252707233, 254997959, 256133785, 262389889]
1757B62389889O186237K436886M30813k521973j084328O933670P433663Q94775n04493
1766B82595139J422653J746902K654305L26633q054256p400990K763043N442619L279438
1775B84775486K699146K415409J146317k270699j903286L346672L153325k609959l114472
1784B87637939N04723J956940L177185K715339O43254j878987p638931o648521K166252
1793B82635193M519710K709389J829395M20571p77245k575416k471428k56310P31240
1802B86765099J396179J457214O81381K80629Q9168m42505j659622j635094m32014
1811B86500435K75154J255264J106491n20706q26340j95999J12076M03156P11918J739502
1821B90560951O43959m065971l583202K806415L439198n34764k055664l605842k316704
$$ y = [262389889, 268576126, 271013012, 271443825, 268921852, 267837524, 274771194, 282204857, 283099632, 282595139, 284017792, 285764694, 288418999, 288745632, 280691376, 273290386, 276053429, 281496048, 284775486, 287474632, 289890041, 291036358, 288765659, 286862373, 290209045, 293362370, 290752411, 287637939, 288142662, 290099602, 293276787, 295992126, 296635380, 294756393, 287117462, 280468941, 282635193, 287154903, 289864292, 291693687, 292114258, 291337013, 288761597, 286290169, 286033859, 286765099, 288161278, 289618492, 290299873, 290580502, 290669670, 290227165, 288567543, 286932449, 286500435, 286775589, 288030853, 289137344, 288616638, 287790298, 287594299, 287706375, 288109531, 288821449, 290560951, 291204910, 287138939, 283555737, 286362152, 289801350, 289266586, 287210922, 283605080, 281288376]
1830B81288376L379593M339447J373291L80516J6689k43187p06425L77656M299392
1839B94505348M145622P11441k271423q454552o963253M082432O287575J609573O13690
1848B94266453J324177J075744J91689M1008O12259N81970M7932n8651J62849J75934
1858B98421364m58R3460L59535P28360J601467J440506O28719q31127m427910m209042
1868B93804874Q336J539001J903057J704922J82648k22207J89286J79062k4071j00136
1878B99164772j13983j26343n2948j70212p84168l95527J626721J257419j764526k371559
1888B96269646j461029n11895J729966J723785q12530j212369J8120K34852j33514
1897B95845032j59760N9624j8845n21431m01497M88282N08308k79426m83513l07083
$$ y = [281288376, 284667969, 289007416, 290380707, 290761223, 290777912, 290534725, 289828300, 290205956, 294505348, 298650970, 299362411, 297090988, 288636436, 281673183, 285755615, 292043190, 293652763, 294266453, 295590630, 296666374, 296858063, 296899071, 297511330, 298093300, 298141232, 298082581, 298245430, 298421364, 298420906, 298514366, 298873901, 299602261, 301203728, 302644234, 303272953, 302441826, 298013916, 293804874, 293813210, 295352211, 297255268, 298960190, 299142838, 298920631, 299109917, 299288979, 299264908, 299164772, 299050789, 298924446, 298871498, 298701286, 297917118, 297521591, 299148312, 300405731, 298641205, 296269646, 294808617, 294296722, 296026688, 297750473, 296937943, 295725574, 295743694, 295978546, 295845032, 295685272, 295744896, 295726051, 295204620, 294803123, 295291405, 295799713, 295520287, 295036774, 294729691]
1907B94729691l30430n87463l65982L91235P40300J199016O37760j286258k072831
1916B93055038k710094j746426K044678K304802q72135j506558n91526j36375O00815
1925B90442219O58989j5736k48680k36969l68614o43482o74954m24385m34170p61985
1935B87292233o35396L5534J16101l8376p16686k679577k594948l61443K82994j03951
1945B80596485j8368L84827K21252o44683p85828k76337k47001n86987o08692m20074
1955B77614594k79427o2485j1196j53542j39236j25179J65233R98497J031628J81694
1965B79220581J21822O64463Q86460J060486J017570O36330N69114Q63076O74953k1229
1975B85693626k80132l07560k27699J37329J97659o8417J5488M91867N13076J24684
$$ y = [294729691, 294399261, 293811798, 293445816, 293837051, 294577351, 295776367, 296414127, 295127869, 293055038, 290344944, 288598518, 290643196, 292947998, 292075863, 290569305, 289977779, 289841404, 290442219, 291101208, 291085472, 290836792, 290599823, 290231209, 289587727, 288912773, 288488388, 288054218, 287292233, 286656837, 286692371, 286808472, 286770096, 286053410, 283373833, 280778885, 280417442, 280700436, 280596485, 280578117, 280962944, 281184196, 280539513, 279753685, 279477348, 279230347, 278643360, 278034668, 277614594, 277335167, 277272682, 277261486, 277107944, 276968708, 276843529, 277008762, 278007259, 279038887, 279220581, 279342403, 280006866, 280893326, 281953812, 282971382, 283607712, 284176826, 285039902, 285714855, 285693626, 285413494, 285105934, 284878235, 285015564, 285213223, 285144806, 285160294, 285652161, 286165237, 286289921]
1985B86289921r289J5965q5583l19481l81012m72298r2983J116505J217384L04928
1995B87584057o3419l19958k94686J44253K99206L09944L11604K78968J76659m8160
2005B88378468j49975k06452j52588O180K23885P03335O77814J67389j42822n70069
2015B88935165n30948K4547L11146O44436N45750j30654l24955k18887j45187Q9168
2025B89199581M4575l43781l80287j54972l109K40822K47231k2164q7738j8120k0981
2036B88701057l2672j01796k79426l14007k34604j77383r9659l6469K613Q9169K87056
2047B87803879K66552N8174j31607m58470n09758k73456k12193k55584k23637j40438
2057B85923462r1782j07765J7643M71592K97775o46820q36849m72546k79655J0242
$$ y = [286289921, 286280632, 286296597, 286211014, 285891533, 285510521, 285038223, 284945240, 286061745, 287279129, 287584057, 287520638, 287200680, 286905994, 287050247, 287349453, 287659397, 287971001, 288249969, 288426628, 288378468, 288228493, 288022041, 287869453, 287875633, 288099518, 288802853, 289480667, 289648056, 289505234, 288935165, 288404217, 288428764, 288739910, 289384346, 289930096, 289799442, 289474487, 289255600, 289110413, 289199581, 289244156, 288900375, 288520088, 288365116, 288362007, 288602829, 288850060, 288827896, 288740158, 288722038, 288701057, 288668385, 288566589, 288287163, 287973156, 287738552, 287561169, 287461510, 287425041, 287427654, 287516823, 287803879, 288070431, 288128605, 287996998, 287538528, 287028770, 286755314, 286543121, 286287537, 286063900, 285923462, 285831680, 285723915, 285741558, 286213150, 286510925, 285864105, 285027256, 284554710, 284275055, 284285297]
2067B84285297M8886j89324k56996k36282k47002k80609k52972j24931j39484l23754
2077B82282829l28788j58787j48525k48681l22570m80194m18664o6261j5259k22702
2087B79872398k70595k44141k24113k22454j11084J72844K46524J69049Q4877j28746
2097B79344559j27087J07765J59512J84288k7428p27653o99749R8476K80838Q4171
2107B78677692n2700l79066l36895J72367J96457k51045k73228O9141J20163m3144
2117B77899742p5340q3466J2398L30696L16143p9403j08223J76659K38419J97181J06812
2128B78931618j59989j50680J58787K17685J03226N3883j5259n017J01586J36375J30654
2139B79502869J25637J32084O3419j53065j40419J35422J58310m0302p2232j7166N1727
$$ y = [284285297, 284334183, 284144859, 283887863, 283651581, 283404579, 283123970, 282870998, 282746067, 282606583, 282282829, 281954041, 281795254, 281646729, 281398048, 281075478, 280595284, 280176620, 280110359, 280095100, 279872398, 279601803, 279357662, 279133549, 278911095, 278800011, 278972855, 279219379, 279388428, 279473305, 279344559, 279217472, 279325237, 279484749, 279669037, 279641609, 278913956, 278214207, 278312683, 278593521, 278677692, 278624992, 278245926, 277909031, 278081398, 278277855, 278026810, 277753582, 277822723, 277942886, 277899742, 277824402, 277740936, 277753334, 278084030, 278400173, 278320770, 278212547, 278389206, 278627625, 278824806, 278931618, 278771629, 278620949, 278779736, 278997421, 279100647, 279154530, 279139271, 279134254, 279235840, 279372215, 279502869, 279628506, 279760590, 279824009, 279670944, 279530525, 279665947, 279824257, 279783955, 279711723, 279694557, 279746284]
2150B79746284K30561K04792p7954r3231J09902K03132K92073K80380J41144P6999
2160B81114082P2728j5507l23754j65481O10351P11937K30542R0599J64280L8375l55949
2171B82172203l32603J72138K16732j42098j90734m1256L8147J44958J54972N0316
2181B82242775K4300N8670L1700n1728r0599j12781j10378p2480n1040m0055j3351
2192B81815033R9430j2875m63962m87576j23729J9321J11580P9861j93596j64986J64280
2203B80842781K54631K79427Q3198n32875o18210k12898j07536k05994j02768K02427
2213B79882183L02067L19729J66645l32337l88145R766K7179l11146k72750J27792
2223B79530983K12917R2755K613k04792j77632J93119J16825m32262n62668m35829
$$ y = [279746284, 279976845, 280181637, 280103683, 280010452, 280120354, 280323486, 280615559, 280895939, 281037083, 281114082, 281186810, 281171303, 280847549, 280682068, 281292419, 282004356, 282234898, 282325497, 282489777, 282528152, 282172203, 281839600, 282011738, 282228470, 282086372, 281895638, 281854382, 281892529, 282037487, 282192459, 282242775, 282267075, 282325745, 282357445, 282305717, 282215118, 282102337, 281991959, 281919479, 281868439, 281828384, 281815033, 281914463, 281901588, 281437626, 280950050, 280826321, 280845642, 280957222, 281037083, 280843487, 280678501, 280842781, 281097412, 281376839, 281460037, 280927162, 280308952, 280096054, 279988518, 279782524, 279679756, 279882183, 280184250, 280503979, 280670624, 280338287, 279950142, 279959908, 279987087, 279675941, 279403191, 279530983, 279743900, 279836655, 279839268, 279634476, 279456844, 279649963, 279766788, 279334526, 278771858, 278336029]
2233B78336029l00865k1477J05858J30901J48068J39942P8449r7275j17797M4117O923
2244B78452873j90277l25203n76477m53949J74751K86828K1438j57585m98772m73022
2254B76260605l5763J05152Q2970O9618j6460k2412Q4153K0980l09944k36263L19004
2265B76321640L72410J2646j32332j98841k70596m17252k77519L26405L21636l36895
2275B75721302l98388o924J59512K73209L20205L15667K09579o5575j93367k95143
2285B76040077k04811K09580K52952l0517j22548j85260q8692K72999L43323J82399
2295B76669502J05362k0027J7166K18392L64074N68161N92690M66118L09467R0351
2305B79381256j84059o08444q13942r33647q04901l86010p400M96158P92752J110305
$$ y = [278336029, 278035164, 278013687, 278119545, 278250446, 278398514, 278538456, 278616905, 278519630, 278401833, 278445950, 278452873, 278262596, 277937393, 277360916, 276906967, 277081718, 277368546, 277389984, 277232399, 276733627, 276260605, 276224842, 276329994, 276412964, 276482582, 276466122, 276443710, 276527863, 276548843, 276238899, 276002636, 276321640, 276694050, 276706696, 276574364, 276375523, 276104927, 275687675, 275410156, 275736561, 276058197, 275721302, 275322914, 275315990, 275475502, 275748711, 276068916, 276384583, 276594162, 276528587, 276335220, 276040077, 275835266, 276044846, 276297798, 276267281, 276144733, 275959473, 275870781, 276143780, 276487103, 276669502, 276774864, 276754837, 276772003, 276990395, 277354469, 277922630, 278515320, 278981438, 279290905, 279381256, 279197197, 278588753, 277774811, 276841164, 276036263, 275650253, 275642853, 276139011, 276931763, 278042068]
2315B78042068Q66166K9335o96411j545678k286434l569355l024349j86920P12871
2324B68341293L28064K75612N42870m40102l547916l715515j214028k5749J189938
2333B61734467J051445r36509j413116o58760r14078j677513k715359m487514n388985
2342B44594078p460346m145374N387535J1253585J8306981J7013549O179104J13240
2350B91242352n690327p516403m464608l854293m079819m246216m852791m800072m384269
2359B47353554l520966j806259r42001n71022m21028p99428p50064n35241o1988J061191
2369B39006748J173973J39942J64757R70841J462459K019634K215157J924515K071609
2378B51149635K614270K794017K802143K632390K251129J795768J095066O93799M55131
$$ y = [278042068, 278908234, 278937569, 278241158, 276695480, 274409046, 270839691, 267815342, 267628422, 268341293, 268669357, 268944969, 269487839, 269047737, 265499821, 261784306, 260570278, 260544529, 261734467, 262785912, 261849403, 260436287, 259777527, 258863449, 257185936, 254470577, 249983063, 244594078, 237133732, 232988358, 238375893, 249629478, 267936459, 284950008, 291129112, 291242352, 285552025, 278035622, 273571014, 269716721, 265636902, 261390686, 256537895, 251737823, 247353554, 243832588, 242026329, 241084328, 240513306, 240092278, 239292850, 238542786, 238007545, 237945557, 239006748, 240180721, 240320663, 240485420, 241456261, 242918720, 244938354, 247153511, 249078026, 251149635, 253763905, 256557922, 259360065, 261992455, 264243584, 266039352, 267134418, 267828217, 268283348]
2387B68283348L81718O54697N44548O0806j07765j02997m9591J89057J88350J4058
2397B70056229j74981o04877n32150R9182L18279L26882K88009M5548O0539L34034
2407B70216694M00066L71456K62261j0491j30901j93596j36127J16100J99566K01473
2417B71296501J35880j17054r4166K32925K86827J48526O8416J202j23730l88393l97434
2428B71049500j89324r041L44277L08742k23160k62737J06335K26974K18869K60124
2438B71830559L67164K92778j9798r8705o5327R3231O01998N46226p3204l46908n46685
2449B72581329m94957p0800O2217J0014R289k29j4305o3897l1242P7248J68571L58582
2461B72591820K73704j16348l19481n19276m74681p9880j183j55697k10285k83241
$$ y = [268283348, 268665066, 269319763, 269864311, 269925117, 269817352, 269714355, 269664764, 269853821, 270042171, 270056229, 269881248, 269276371, 268744221, 268843403, 269161682, 269488564, 269776573, 269822121, 269882660, 270216694, 270616760, 270988216, 271250477, 271239986, 271109085, 270915489, 270779362, 270895462, 271095028, 271296501, 271432381, 271315327, 271221161, 271454086, 271740913, 271889439, 271957855, 271959057, 271835327, 271446934, 271049500, 270860176, 270851135, 271195412, 271504154, 271280994, 271018257, 271124592, 271351566, 271570435, 271830559, 272197723, 272490501, 272470703, 272371998, 272306671, 272399902, 273001900, 273548126, 273474922, 273128014, 272581329, 272086372, 272015572, 272077789, 272087803, 272097092, 272096863, 272082558, 272018661, 271987419, 272064667, 272233238, 272591820, 272865524, 272749176, 272429695, 271910419, 271435738, 271355858, 271354675, 271198978, 270988693, 270705452]
2471B70705452k35081k8858M7226O0310K8611r0123j47571k07672j65940Q0834J1902
2482B70059090m03633n24521n55039l22819L99838N29041J70002j4076k55814k90870
2492B68791199o6052o1283k51999k57969p3433j02520m29630l15418L38783L98865
2502B67970543m7913k19116l38783k94686J9303O3896j16806j60465j62125j04904
2512B66608944O4850J12285J14937l586l70979m00772j11828j8825j9799j0261k0256
2523B65944710l5763k8610j27793m52518l99113O8188K02656J68094N4360l01361l38097
2534B64754753p3433J202j1444l0766j36604r2030J00136K12669L75996K94438j47114
2545B65247803j95732J25160J54991N951j13716l36189l41416j34926j5983J62124
$$ y = [270705452, 270470371, 270441513, 270488739, 270549049, 270577660, 270487537, 270339966, 270132294, 269966354, 270047188, 270059090, 269655457, 269130936, 268575897, 268253078, 268652916, 269181957, 269351959, 269337883, 269082069, 268791199, 268725147, 268663864, 268411865, 268153896, 268080463, 267977943, 267548313, 267232895, 267571678, 267970543, 267922630, 267703514, 267364731, 267070045, 267089348, 267153244, 267036438, 266875973, 266713848, 266608944, 266673794, 266786079, 266901016, 266897430, 266526451, 266125679, 266013851, 265995026, 265975227, 265964966, 265944710, 265908947, 265880337, 265752544, 265300026, 264900913, 264969101, 265171757, 265339851, 265394211, 265092850, 264754753, 264681320, 264682522, 264671078, 264640312, 264503708, 264411678, 264511814, 264724483, 265100479, 265394917, 265247803, 265052071, 265177231, 265332222, 265338173, 265224457, 264888268, 264546852, 264411926, 264395943, 264558067]
2555B64558067J11580k58217l00159r7275L5038K61555K38418r7522j51139K9316L8624
2566B64368286q3694r2964m0303L3131K33650J74522j90734k91825j88102k14348l95775
2577B63311844k98252J16348K59399K50340J96686O218o1035q2970j0986K11963L06606
2588B64206161M13666K49863l52154m42982r0599K7180K3136J24207M39415L05176
2598B64903069m87576m41074M93049O20613J21346k9793l9101n6514%n1022k37465
2609B64795532k66552j67598j18752r1553k2392J48525J18008j94779j66893K13395
2619B64246941K75611J25161J0719j64261k63691l21140l40958l40214k48203k1686
2629B62958279R5119J96705J49479j16348j88103j70708n9604K48909L32355K63443
$$ y = [264558067, 264669647, 264411430, 264111271, 264013996, 264049034, 264310589, 264549007, 264451485, 264300346, 264329662, 264368286, 264284592, 264191628, 264151325, 264184456, 264418106, 264592628, 264401894, 264110069, 263921967, 263707619, 263311844, 263013592, 263129940, 263389339, 263639679, 263836365, 263842583, 263781548, 263698578, 263687592, 263899555, 264206161, 264619827, 264869690, 264517536, 264074554, 263983955, 264011135, 264034271, 264158478, 264597893, 264903069, 264415493, 263974419, 264467468, 265088081, 265209427, 265179634, 265140533, 265084019, 265084019, 265032997, 264795532, 264528980, 264361382, 264242630, 264151077, 264128685, 264277210, 264395218, 264200439, 264033546, 264246941, 264522552, 264647713, 264658432, 264494171, 264230480, 263909340, 263568382, 263228168, 262979965, 262958279, 263053398, 263250103, 263399582, 263283234, 263095131, 262924423, 262864819, 263113728, 263446083, 263709526]
2639B63709526J71661q7242o6299K88734L11127M2915j7624M6731O7462Q5125J02749
2650B64654865J31855J20621J22070k6931m94004m48456J82858K74181j07536j07517
2660B64302006K10285K45323O8665n226m1008r6093j65214k14577k80876k51274j49021
2671B63622990L109L14941L67641J64509J10855J03722J46389L44524K72255o8664
2681B65382271k59857m74930m38461j07766O9142K90394K10990l18985l58123O6299
2691B64060974J20621p8201j67599k83241k44847l3626R3937K38647K50588J02519
2701B64059772N0793P6523j430k29588k43435k613l6011m03633l39279J78814K96345
2712B63406258J07765Q8939K19098J04446k76337m46090n96505m39186J70708L63350
$$ y = [263709526, 263881187, 263793945, 263727646, 264016380, 264327507, 264370422, 264352798, 264399529, 264466991, 264552116, 264654865, 264786720, 264907341, 265029411, 265002480, 264508476, 264060020, 264242878, 264517059, 264409523, 264302006, 264512291, 264757614, 264826279, 264821053, 264780045, 264683952, 264518738, 264304161, 264023285, 263772011, 263622990, 263626099, 263941040, 264308681, 264473190, 264584045, 264687767, 264834156, 265178680, 265450935, 265382271, 265122414, 264647484, 264209023, 264101257, 264170399, 264460793, 264671783, 264352798, 263994675, 264060974, 264181595, 264103394, 263935795, 263652554, 263407707, 263374081, 263468018, 263706665, 263957253, 264059772, 264110565, 264187088, 264185658, 263956070, 263712635, 263710022, 263674011, 263270378, 262931099, 263109913, 263406258, 263514023, 263602962, 263822060, 263926506, 263650169, 263204079, 262607574, 262168388, 262339096, 262702446]
2722B62702446L11394J90487k03133k31495J18256J54495n2948r3918l3626k1935K6703
2733B62866726q3218m69207m65622m9591K1705j28288k36511m59900m37260k28882
2743B60329952M1962O66370O02017k76814m28200j4057O8913r54m2457j45417j34010
2754B60667305K6951J9779j42326j96457k32468j53770R7503J92185K28634J41849
2764B60649185k10037j95274K20794K66781Q583m5776J6689L3856O6757L2177p3433
2775B60770302j53542k48184k97069l52154k66533O4125P4863k48661k85396q9169
2785B58968582o5803j91689j56631M0054Q3198J5259k1705p5341r9411r0122j11580
2796B58294811j16348k31266o00338n23815L9596K21959K07424J27067j99070j85718
$$ y = [262702446, 263013840, 263204327, 263001194, 262769699, 262887955, 263042450, 262989502, 262895584, 262861958, 262840023, 262866726, 262783508, 262314301, 261848679, 261799088, 261820793, 261692505, 261455994, 260996094, 260558834, 260329952, 260371914, 261038284, 261640301, 261363487, 260935287, 260921230, 260990143, 260989189, 260946732, 260801315, 260667305, 260694256, 260714035, 260571709, 260375252, 260142784, 259989014, 260086517, 260278702, 260507336, 260649185, 260439148, 260243874, 260464668, 260731449, 260740032, 260694256, 260710945, 260744801, 260811558, 260843735, 260770302, 260616760, 260368576, 260071507, 259719353, 259452820, 259516945, 259591808, 259343147, 259057751, 258968582, 258902779, 258711090, 258554459, 258594513, 258677711, 258692970, 258671265, 258595924, 258496513, 258406391, 258294811, 258178463, 257947197, 257346859, 256823044, 256862640, 257084599, 257292023, 257419090, 257220020, 257034302]
2806B57034302J87378K52494J10856K4566j72615p7724M33922M57515N7221j19915
2816B58188000k65599k63214o8893K4300J28040Q8939j55220k03361r2506p7973r2277
2827B57210236j52817l34511l22800p5111p8430k95182l89556m89235m23203j36604
2837B54512787k0981P2708o1512n52883o81648m87557n33828p84646q19911p20273
2847B49922256n85308k84671k43912m49181n31902n87215o06785o19412n21431k29587
2857B45262852j80722l61442l90282l07808l34015n74112l90300M48932L79105o03447
2867B42948761r21021r46273p68433j17760J3104l46890l24020J1444O5327m6253j93596
2878B39374390n31674n72910k86827k84920n38330n51472m47521k30064L03039L46642
$$ y = [257034302, 257221680, 257474174, 257585030, 257609596, 257436981, 257359257, 257793179, 258250694, 258307915, 258188000, 257922401, 257659187, 257590294, 257614594, 257742634, 257831573, 257676353, 257472992, 257380486, 257302513, 257210236, 257057419, 256722908, 256400108, 256324997, 256246567, 255951385, 255561829, 255072594, 254649391, 254512787, 254491806, 254564514, 254503002, 253950119, 253268471, 252780914, 252247086, 251462440, 250642529, 249922256, 249336948, 249052277, 248808365, 248359184, 247827282, 247240067, 246633282, 246013870, 245492439, 245262852, 245082130, 244720688, 244330406, 244022598, 243688583, 243114471, 242724171, 243173103, 243552208, 242948761, 242027740, 241081467, 240313034, 240195274, 240208378, 239861488, 239537468, 239548912, 239614239, 239567986, 239374390, 238842716, 238269806, 237982979, 237698059, 237159729, 236608257, 236160736, 235930672, 236233711, 236580353]
2888B36580353r5368k34604k55584k11716J0986R041k25773k57740o4125j73568n46685
2899B34535217q13255j161575j208306r60827p75089o17981k66571L52402P22160R19113
2909B30725288J152993J485576J460076J084079P81556L75022J49003k2889P9651P13101
2919B37983456O28948k32697l84102N8423P1525j46866l67870q20885q18252k53678
2929B35718002k42710p43618q09669m94957n31445q71410r73950q96206r52720j068840
2939B28132477j229286j476517j658211j839638j911888j858463j854649j865158j857032
2948B12581635j858712j790294j656056j518726j295338j258354j477737j404515j067409
2957A99254494r00975q38279p12643n30472m34646l83835m03652o43731m82559j8825
$$ y = [236580353, 236484985, 236250381, 235994797, 235783081, 235794067, 235803108, 235577335, 235319595, 235255470, 235081902, 234535217, 233721962, 232560387, 231352081, 230391254, 229616165, 228998184, 228731613, 229084015, 229806175, 230725288, 231878281, 233363857, 234823933, 235908012, 236689568, 237064590, 237213593, 237190704, 237270355, 237983456, 238612404, 238379707, 237995605, 238054028, 238125553, 237978687, 237610817, 236789932, 235971680, 235718002, 235475292, 234731674, 233922005, 233427048, 232895603, 232024193, 231050243, 230154037, 229201317, 228132477, 226903191, 225426674, 223768463, 221928825, 220016937, 218158474, 216303825, 214438667, 212581635, 210722923, 208932629, 207276573, 205757847, 204462509, 203204155, 201726418, 200321903, 199254494, 198353519, 197515240, 196802597, 196272125, 195837479, 195453644, 195049992, 194406261, 193923702, 193904877]
2967A93904877N19027J363278J811733J976509K111187K128849K123337K041111J999607
2976B09979515K027283J891861J536369J419067J533738J444091J231690J003494N65300
2985B22632408N86739J156082J250038J034737Q68568N78156M97818O18934O40393
2994B29863873O39915O04630N42888M32015J78794J76926M31519N26199N73387N36213
3004B34506359L60241K98042L43323K65350K7657O447J50680K87056M73252O51359
3014B37369766Q62847R99679J096001J120109J110306R42002M84695L83854O26564
3023B44995823O17275M73023L20186l4084N1727P09534P68890L49541J41849q0108
3033B48313656j06335J30177J50928L3608n4837k09331k19822j7872q8692l64551o32763
$$ y = [193904877, 194423904, 195787182, 197598915, 199575424, 201686611, 203815460, 205938797, 207979908, 209979515, 212006798, 213898659, 215435028, 216854095, 218387833, 219831924, 221063614, 222067108, 222632408, 223219147, 224375229, 225625267, 226660004, 227528572, 228106728, 228604546, 229223480, 229863873, 230503788, 231108418, 231651306, 232083321, 232262115, 232439041, 232870560, 233396759, 233970146, 234506359, 234866600, 235164642, 235507965, 235773315, 235800972, 235807419, 235958099, 236245155, 236718407, 237369766, 238232613, 239232292, 240328293, 241448402, 242558708, 243500710, 243985405, 244369259, 244995823, 245613098, 246086121, 246406307, 246372223, 246423950, 247133484, 247902374, 248251915, 248393764, 248313656, 248207321, 248337498, 248488426, 248522034, 248467197, 248257866, 248038044, 248020172, 247931480, 247566929, 246934166]
3044B46934166j053085j201878j143455j046181q20866o56128n00221l72391l21636
3053B39818325j33762K43187L85780L70979L11604J37329J5259j03951j92890l20187
3063B40531673k39620N3177K92301O94981O54945J32790j09177l04222k83966J9798
3073B41442680J63308L08265K51065p0324k06948l79104j57109O17733Q77152Q35895
3083B43682613P00951K58694J53541L29724L63102L95546K83718l2902j70479k32696
3093B45731812j91689J02768K1458m17004o60648j022091q03948J61877N03292N04036
3103B43929863L99342p9155r3213L17326M72317N63373N02587J78337J24454K75383
3113B46590614L56675M90188M62990K82783J28746n9623k19574m57993m13666k5749
$$ y = [246934166, 245881081, 244679203, 243535748, 242489567, 241668701, 241012573, 240512352, 240139961, 239818325, 239684563, 239927750, 240313530, 240684509, 240996113, 241133442, 241148701, 241044750, 240851860, 240531673, 240292053, 240345230, 240637531, 241332512, 241987457, 242120247, 242011070, 241706848, 241422882, 241442680, 241605988, 241914253, 242165318, 242094994, 241888046, 241508942, 241351833, 241969566, 242846718, 243682613, 244383564, 244642258, 244795799, 245125523, 245488625, 245884171, 246167889, 246134987, 245964508, 245731812, 245540123, 245642891, 245664349, 245247345, 244586697, 243564606, 242760658, 242922535, 243425827, 243929863, 244329205, 244250050, 244156837, 244474163, 244946480, 245509853, 246012440, 246190777, 246315231, 246590614, 246947289, 247437477, 247900467, 248183250, 248311996, 248252373, 248032799, 247574806, 247161140, 247135391]
3123B47135391R8953N6725O6528M2916J05629L44276K77977j96457j87874K92073L96480
3134B48432617K80628J68801p0572j38035q9645l815K66075K10037l23524k19841N82695
3145B49095421P22656L91483J84307j25179k29587j42823j17778r0847o6033j6937
3155B49604683m6482k60601j35422M09374N27859L74317J76182k79427l69072j51386
3165B49850025j7643K27928J90964k14329k53925M063R7980J59035J22299l3131j58557
3176B49974709l46413l76473k20298k12670m02202k62966K70347M08669L07788J32084
3186B49272575l40461l89328o1760J09195L93162K41280n97000n71976L37372M96368
3196B48889427N1995M8389M42257L62644j50433l86009n80559n01632K403R0103j81904
$$ y = [247135391, 247234344, 247291069, 247357597, 247400513, 247506142, 247850418, 248128395, 247931938, 247744064, 248036137, 248432617, 248713245, 248882046, 248811474, 248673439, 248583794, 248579979, 248846054, 249056091, 248732567, 248512726, 249095421, 249818077, 250209560, 250393867, 250268688, 250039101, 249896278, 249778500, 249687653, 249621620, 249604683, 249558201, 249297600, 249162178, 249571552, 250099411, 250473728, 250649910, 250370483, 250001411, 249850025, 249832382, 250060310, 250251274, 250036945, 249783020, 249787083, 249885063, 250044098, 250166397, 250133266, 249974709, 249628296, 249251823, 249031525, 248818855, 248416653, 248153687, 248424034, 248832703, 249140491, 249272575, 248932114, 248542786, 248481026, 248590221, 248983383, 249224663, 248627663, 248055687, 248393059, 248889427, 248941422, 248989811, 249432068, 249794712, 249644279, 249258270, 248677711, 248176079, 248178482, 248268585, 248086681]
3207B48086681k00519n8174p06J907P2232L03516J99318l01361m58012m34875l17326
3218B46892681L2425J48296R2030Q2016R9430R54k98043l17802o6757Q106K384j9302
3230B46656418j04199j30653j33038r7999M8637m997k96116l64056l19252j83334J71890
3241B45243301K54155L3626J18485N90095N14031j34964l22342j95732k01950k89670
3251B45609035k19345Q7490P5341l11852k96821R9182J81923O5307j5258j44959k20299
3262B44909744l43322k11945K48680M34151N16891M10080k136j70956j44710k80628
3272B45365849o17733o43731m36554j96933K89669L62892L3131q2970j18504j61400
3282B43793716j69982k23160l77426l29247p8697O7711K39143K25296O447j29471k94685
$$ y = [248086681, 247886162, 247827988, 247827282, 247829189, 247901421, 248204937, 248404255, 248102894, 247644882, 247210007, 246892681, 246925106, 247073402, 247165432, 247247448, 247346878, 247347832, 247049789, 246731987, 246665230, 246673336, 246675720, 246656418, 246552219, 246421566, 246288528, 246190529, 246239166, 246234169, 245938053, 245573997, 245254745, 245071411, 245243301, 245497456, 245531082, 245649567, 246239662, 246753693, 246618729, 246296387, 246100655, 245898705, 245609035, 245389690, 245477180, 245552521, 245240669, 244943848, 245043030, 245224953, 245290260, 245275002, 245130043, 244909744, 244566422, 244354477, 244603157, 245037308, 245554199, 245964279, 245962143, 245791187, 245646477, 245365849, 244748116, 244104385, 243667831, 243470898, 243760567, 244123459, 244156590, 244073620, 243955116, 243793716, 243623734, 243400574, 243023148, 242693901, 242615204, 242682915, 242922058, 243147354, 243153801, 243024330, 242729645]
3293B42729645l29972k58445j46866P0343J94321L67870K17438m88282m52747M01497
3303B42304802M66576j19687l03020l25699k74658r2259P7000L77903L74317O1035
3313B42546310j05133k72750l04471j59511j39465j93119k25773k90165k72274j74294
3323B40409355j02749j2397K1457L5515m4575l08990l24249j55449K1934L54290M29630
3334B40323772L64056J01814o48975o65188L2654L02315M57306L84082m6482k06489
3344B40398865k62718j78833J60942K56061J55449J60694K73705J82876j75476k38189
3354B40733376m6254m76j9799k9793o7939o0082j6708K7656J14212J12305J1902j7395
3366B40741005l5763K5749K90623J93138l73134m17233m291J35173J77880J45187K6474
$$ y = [242729645, 242399673, 242141228, 241994362, 242064705, 242259026, 242626896, 242844334, 242356052, 241903305, 242304802, 242771378, 242651691, 242348671, 242022972, 241748314, 241656055, 241733055, 242110958, 242485275, 242546310, 242441177, 242168427, 241863956, 241704445, 241564980, 241371861, 241146088, 240855923, 240583649, 240409355, 240306606, 240294209, 240315666, 240351181, 240306606, 239997616, 239673367, 239517918, 239539852, 239894142, 240323772, 240687828, 240789642, 240140667, 239475479, 239508133, 239810448, 240267754, 240651836, 240605354, 240398865, 240136147, 239957314, 240118256, 240374317, 240529766, 240690460, 240964165, 241147041, 240971565, 240733376, 240687122, 240686646, 240666847, 240637054, 240569115, 240509033, 240492325, 240519981, 240634193, 240746498, 240758400, 240741005, 240705242, 240730991, 241021614, 241214752, 240841618, 240424385, 240420094, 240555267, 240733147, 240878334, 240904808]
3377B40904808j58310n59807n96294l18279j05400K79922K66533k25525l07331j08013
3387B39072304j660J67370J47343j18961j51177N3902L090l12081l66459k11467j67141
3398B38115063j58558j65940k01225k37465l74794k40555L68348K67028o72569p56988
3408B35942345m7436N474n06630n01633K6226k9087n80063q71906j176357j161804
3418B31099129p76539n59559k55127l47595r63707j114845r75838q38051o40144l38784
3428B24288940J91918M02927L42121L64304L50723M18434N54314O92368R44137R27925
3438B29478111N99861N16663O75659N30243P9155j25885k77271j59741L70980N21888
3448B32209663L58582M10328O34670O71387N73158M86374L20663K90165M85669L26385
$$ y = [240904808, 240746498, 240186691, 239590397, 239272118, 239166718, 239446640, 239713173, 239487648, 239180317, 239072304, 239070644, 239238014, 239385357, 239266396, 239115219, 239169121, 239172211, 238860130, 238493671, 238282204, 238115063, 237956505, 237790565, 237589340, 237351875, 236977081, 236736526, 237104874, 237371902, 236699333, 235942345, 235894909, 235900383, 235393753, 234892120, 234918346, 234889259, 234309196, 233437290, 232260933, 231099129, 230322590, 229763031, 229507904, 229160309, 228196602, 227081757, 226105919, 225267868, 224627724, 224288940, 224480858, 224883785, 225225906, 225590210, 225940933, 226359367, 226913681, 227606049, 228550186, 229478111, 230077972, 230594635, 231270294, 231800537, 231879692, 231753807, 231476536, 231316795, 231687775, 232209663, 232568245, 232978573, 233613243, 234284630, 234857788, 235344162, 235664825, 235954990, 236440659, 236767044]
3458B36767044l20435l46412K26021L75499L52860J72615m44889l96004M20075M95910
3468B37302284l2882k04812k50339k10285n7945J37825N66711N36442M3869k09103
3478B37621765m07677n16433o06995m28200J90735L15666j3351k5997J56154K46773
3488B36532440L86238K98500p0095k31991l52859k59857J84288K57015J43299j75724
3498B36711254r88006j125088q09670l22838P57714J021385O55880L19004l49522n67684
3508B35302429n20458k50568N75771O66141J00136j50680m30584l36647M35123K62966
3518B35653629r72271j174202o28719k91347L31153K17934r02424r26266n5542M10805
3528B31662750J019707Q79765k08607n56946m97360l92418j38531K11716R30786R78470
$$ y = [236767044, 236446609, 236100197, 236326218, 236701717, 237054577, 237227192, 236782303, 236386299, 236806374, 237302284, 237269402, 237064590, 236814251, 236603966, 236546021, 236683846, 237250557, 237786999, 237830868, 237621765, 237214088, 236697655, 236090660, 235662460, 235853195, 236168861, 236155510, 236129513, 236285667, 236532440, 236918678, 237217178, 237147083, 236915092, 236562233, 236302376, 236486664, 236743679, 236886978, 236711254, 235723248, 234598160, 233788490, 233465652, 234223366, 235244751, 235900631, 236219635, 235870113, 235302429, 234781971, 234531403, 235107174, 235773315, 235873451, 235722771, 235292187, 234955540, 235390663, 235653629, 234681358, 233507156, 232878437, 232587090, 232918243, 233136177, 232233753, 231307487, 231251945, 231662750, 232682457, 233562222, 233353615, 232796669, 232299309, 231906891, 231768360, 231980076, 232910862, 233889332]
3538B33889332M46071P630n76725j023293j636505j482487n33332J63536J269340J185417
3548B31708984l40213p01199m00543l4332Q73336J012078M36325K38170m76K99930
3558B33092060J513958J564026R28402k31037k592793l607750m426250k996674J856327
3567B25100269L379574K669583K092838N92232K6226J28994J02748K15283J91936j87873
3577B34311810K30541J701126K052784K022495Q33054k161026l601799m861603l811588
3586B26715794L88145K247562L399392K800445n48115j610508j362800r38187M85420
3595B31577148P51973k8363j43299j58062M73481K391357K488842J289616j94092l220062
3605B35228539l770123k213478j092663O82106J291752O24905R43183K802353J715660
$$ y = [233889332, 234335403, 234343033, 233766308, 232743015, 231106510, 229624023, 229090691, 229254227, 230523567, 231708984, 231368771, 230667572, 230267029, 230232697, 231106033, 232118111, 232554436, 232792606, 232792130, 233092060, 234606018, 236170044, 237098446, 236867409, 234274616, 230666866, 226240616, 223243942, 225100269, 228479843, 231149426, 233242264, 233834496, 233860722, 233989716, 234092464, 234307747, 234499683, 234311810, 234542351, 236243477, 238296261, 240318756, 241151810, 238990784, 235388985, 230527382, 226715794, 227103939, 229351501, 232750893, 235551338, 235003223, 233392715, 232029915, 231091728, 231577148, 232329121, 232300758, 232157459, 231999397, 232472878, 234864235, 237353077, 238642693, 238448601, 235228539, 231458416, 229244938, 228152275, 228834381, 230126133, 230751038, 231694221, 234496574, 236212234]
3614B36212234k789726m337787m843712l022900K385368N052090P081509O384373K842903
3623B44964352r83944p415543r734154j0233154o458778N270958P773647K362251R67026
3632B26512661R79900R02901J416435J295815L25908N89371J996288K820721M032612
3641B40872612L478527J825581j441956q485088j0144711q242130m653931L553391
3649B16762295O521702O519088M329911k943268m498482j766453J73321L757248M316559
3658B33171921J643905J236687K153854K660523M064083K866745j252174l512135o208916
3667B36824493m940986K050400L326664J379013k319336j2835255j1377106L276100
3675B15383987P447739M846325M312992L292313L162880M261474L859768L166905P2479
$$ y = [236212234, 233422508, 229084721, 224241009, 221218109, 223603477, 228655567, 235737076, 242121449, 244964352, 243980408, 236564865, 226830711, 216597557, 210138779, 215409737, 223183384, 225545635, 226512661, 227492561, 228395462, 229811897, 231107712, 231433620, 232022991, 234019279, 236840000, 240872612, 244351139, 246176720, 244734764, 236249676, 226104965, 217862835, 213208904, 216762295, 223283997, 229803085, 234132996, 231189728, 226691246, 224924793, 225098114, 228855362, 233171921, 234815826, 236052513, 238206367, 240866890, 244930973, 247797718, 246545544, 243033409, 236824493, 231883507, 233933907, 237260571, 238639584, 236320248, 223484993, 212107887, 215383987, 222831726, 227678051, 231991043, 235283356, 238446236, 242707710, 246567478, 249734383, 249806862]
3684B49806862p308235r327412p911205n003453K019177M604092L918895L844261L482819
3693B38125801K540588P09534m86870j414051k134571l327122k214183J735191L618488
3702B37152805N165100M358044Q80489j984596o092777p306824o661415m158249J816502
3711B23169079M807472O861687O243229J801719j25389q95042j419525j252423j268386
3720B37922421j307240j135597j030693j20163J807213L032684N178699L471623l324051
3729B44494896n494576m363308m354476n421391l328819K150535N869160J0950565
3737B40502586J0047913L001442k206307r978065j0688057m863033k4319J0031471
3745B35823631Q010369r047737j2008191m727115r16024L649712N780220O602535M797936
$$ y = [249806862, 242498627, 233171215, 225260010, 220256557, 222275734, 226879826, 230798721, 234642982, 238125801, 240666389, 241375923, 240889053, 239475002, 237340431, 234013309, 231799126, 233534317, 237152805, 242317905, 246675949, 247556438, 245571842, 239479065, 232172241, 225510826, 221352577, 223169079, 227976551, 234838238, 241081467, 242883186, 242757797, 241862755, 240443230, 239190807, 237922421, 236615181, 235479584, 234448891, 234328728, 236135941, 239168625, 244347324, 247818947, 244494896, 239000320, 234637012, 230282536, 224861145, 221532326, 223682861, 229552021, 240502586, 250550499, 253551941, 251345634, 241367569, 230679512, 225816479, 225792160, 235823631, 243834000, 234786263, 222778072, 218050957, 217134933, 220784645, 226564865, 233167400, 237965336]
3754B37965336j616001l391495k070198p36237K397766L264676K573261J553764q50906
3763B39089966j644135r06486j313439l159523k593040L25928J985302L800640L721695
3772B39306908J598854P9612j925926k708206k822399j758576J677990K195130P1983
3781B35715370n18074n60531k87514P35988R99451N06878P49588J856079J819382P15732
3791B41732349K44141j4305q5583N28565j39714j916179l530503p166614n362263L825188
3801B28115082N161991J71413k006988n269547l172378O352882Q585224N896569L519306
3810B47353554q25424l255845n418529m609356Q34713J556149j238327l019581o886006
3819B24491348m976272M415989O602287L384113K241135J100311P73182J632214J374473
$$ y = [237965336, 236349335, 232957840, 230887642, 230151405, 232549171, 235813847, 238387108, 239940872, 239089966, 237445831, 236539345, 235225906, 232066383, 229473343, 229799271, 231784573, 235585213, 239306908, 240905762, 240985374, 239059448, 236351242, 233528843, 231770267, 233448257, 235643387, 235715370, 235197296, 234636765, 234349251, 235085239, 236084690, 236591568, 237341156, 239197235, 241016617, 241732349, 241976490, 241962185, 241876602, 242405167, 242265453, 240349274, 236818771, 229652157, 224289894, 228115082, 233277073, 233448486, 231441498, 226171951, 222999573, 229352455, 237937679, 243834248, 247353554, 246528130, 243272285, 237853756, 233244400, 234079113, 235635262, 234396935, 231377354, 224491348, 219515076, 223931065, 230533352, 233917465, 236158600, 237258911, 238032093, 239664307, 241038780]
3828B41038780o8664j19439J698494R00040k266655m312038p356892o408691o77567
3837B22427368J681786K534866K573013M01040R08126L634930N527019Q522759P920265
3846B56131172M892578n51452j1432896j5677204j7266045j2347946K938519R292850
3854B15979576J1098614J0121345L768673O41594j439323k358933j913299j034260
3862B34863987J418591J813888J007080p95135n566349n621663j115093Q83351K182235
3871B29070892K615700J669884J562347K504120J433601k506980k827149K61536J112461
3880B34896412J340866J30405m512538l798962L102302M076729O31562j148224m084587
3889B30633965k977372L202210N135765M830837L575802J68323j874218l772010m164219
$$ y = [241038780, 240970116, 240850677, 242549171, 243449211, 241182556, 236870518, 229513626, 223104935, 222427368, 224109154, 226644020, 229217033, 229618073, 230526199, 234161129, 239688148, 248210907, 256131172, 261023750, 260472298, 249039402, 233362198, 216096153, 203748207, 206686726, 215979576, 227078190, 237199535, 240968208, 241609802, 240170479, 237811546, 235898247, 234863987, 236282578, 238096466, 239103546, 238308411, 232742062, 227120399, 226005306, 226888657, 229070892, 231686592, 233356476, 234918823, 237422943, 238856544, 236349564, 233522415, 233783951, 234896412, 236237278, 236367683, 231855145, 228056183, 231158485, 235235214, 235866776, 234718552, 230633965, 227656593, 230858803, 235994568, 240825405, 244401207, 244569530, 242695312, 238923302, 234759083]
3898B34759083k523670k320290l572464k738705M0303J785030L835430L809929J127739
3907B34202385M90189J311302J232147Q78334J05362j485577k154598k548675j819859
3916B30211010P23839J465091R94683N65033n69344o81152O9618N93662J684437J255264
3926B36312141r67502j804352k112637j646041L2425R27696J641502J758824J122226
3935B35264282P74880N94368K4318j207103j456509j026859l52154J397839J334438
3944B35347500o30379j257419j305809r80149J20640N94845P36236P70569N56240M32263
3954B34384537L47366J64757j64032l08991l41911l05633j59989k5272J91688K38667
3964B34021187J47095M0283k08130k17667M769J05133J99794J74523p0324k4338L64304
$$ y = [234759083, 232235413, 229915123, 226342659, 223603954, 223644257, 225429287, 229264717, 233074646, 234202385, 234692574, 236003876, 237236023, 238114357, 238219719, 236734142, 234579544, 232030869, 230211010, 230934849, 232399940, 233394623, 233959656, 233390312, 232709160, 232778778, 233372440, 235056877, 236312141, 235344639, 233540287, 231427650, 229781609, 229814034, 230741730, 232383232, 234142056, 235264282, 236039162, 236633530, 236657848, 235450745, 233994236, 232967377, 232615223, 234013062, 235347500, 234717121, 233459702, 232153893, 231173744, 231294384, 231889229, 232625465, 233396034, 233952274, 234384537, 234731903, 234896660, 234732628, 234423637, 234081726, 233776093, 233616104, 233590832, 233782520, 234021187, 234168282, 234208565, 234000435, 233782768, 233787537, 233892670, 234092464, 234266987, 234196663, 234172325, 234536629]
3975B34536629L75995J38760j41373p46021p55310j75724R5863L40462L28522p7954
3985B33919849j00135K67505K20776k63691k89440J59511J19915m51564m20342J52588
3995B33314972L76244N56449L59536m32969o14166
4000B33560066
$$ y = [234536629, 234912624, 235051384, 234910011, 234163990, 233408680, 233232956, 233328819, 233669281, 233997803, 233919849, 233819714, 234087219, 234307995, 234044304, 233754864, 233914375, 234034290, 233582726, 233162384, 233314972, 233691216, 234247665, 234607201, 234174232, 233560066]
##END=$$ End of the data block
