##TITLE=$$ Begin of the data block
##JCAMP-DX=5.00 $$ ACD/SpecManager v 10.08
##SPECTROMETER/DATA SYSTEM=16PC
##DATE=18 Jun 2013 15:09:48
##DATA TYPE=INFRARED SPECTRUM
##DATA CLASS=XYDATA
##ORIGIN=
##OWNER=
##NPOINTS=3601
##FIRSTX=400.00000000
##LASTX=4000.00000000
##MAXX=4000.00000000
##MINX=400.00000000
##MAXY=80.31479645
##MINY=39.48578644
##XFACTOR=1.0000000000
##YFACTOR=0.000000100000000
##FIRSTY=44.97766495
##DELTAX=1.00000000
##XUNITS=1/CM
##YUNITS=TRANSMITTANCE
##XYDATA=(X++(Y..Y))
400 449776649 561808281 648369064 702932663 729073792 737068176 738257675 740276794 745312576
408 745312576 751552582 756211090 758006363 757796249 757522964 758631516 761181259 764103622 766171341
417 766171341 766853104 766491165 765849152 765504150 765554123 765756454 765867691 765852737 765835648 765907669 766010818
428 766010818 766006470 765841064 765630493 765575714 765783615 766158981 766477890 766582260 766532898 766584015 766991119
439 766991119 767802277 768797379 769621658 770014801 769961395 769669418 769410934 769348145 769471741 769662094
449 769662094 769805679 769865723 769869156 769846573 769789963 769662781 769444275 769156265 768845978 768548660 768264236
460 768264236 767977524 767698669 767483215 767403259 767490311 767697372 767914200 768033981 768018951 767920151 767834091
471 767834091 767830582 767904205 767976074 767943192 767732773 767328796 766765213 766093140 765352249 764547729 763639755
482 763639755 762538757 761119156 759256134 756882477 754035950 750867538 747592850 744408417 741423645
491 741423645 738651428 736063309 733679123 731624756 730122299 729412537 729651184 730838318 732814026
500 732814026 735314941 738064957 740851974 743567581 746201324 748798370 751405411 754023132 756589584
509 756589584 759001160 761159973 763026199 764640579 766103745 767517471 768924103 770279999 771478271
518 771478271 772409744 773027725 773377151 773574982 773756790 774015961 774367599 774751282 775065613 775220108
528 775220108 775180359 774988937 774750977 774588318 774577408 774704971 774861374 774887543 774647293 774090042 773268356
539 773268356 772293930 771267395 770222855 769126968 767932205 766649094 765388107 764338531 763694611
548 763694611 763567352 763928375 764616623 765400772 766065063 766482315 766648254 766666794 766699295 766896210
558 766896210 767334900 767988434 768734283 769405365 769861832 770051346 770028305 769925156 769884872 769994736
568 769994736 770250168 770565872 770828934 770955887 770934830 770828323 770739136 770761261 770935364 771229935 771556168
579 771556168 771808929 771916733 771878204 771764832 771690826 771758728 772009048 772401962 772833328 773185654 773382492
590 773382492 773420563 773366470 773321609 773371582 773549576 773824844 774120483 774351501 774462967 774452057 774365158
601 774365158 774269943 774219742 774222031 774232864 774176941 773983917 773624420 773122559 772546005 771975327 771477661
612 771477661 771095352 770852127 770768356 770868607 771174088 771681366 772345123 773075485 773760681 774308167
622 774308167 774683838 774933395 775166016 775508270 776042633 776759262 777548294 778240433 778679810 778795242
632 778795242 778630219 778314056 777989120 777731323 777513657 777233124 776782990 776136627 775388031 774728851
642 774728851 774375076 774479370 775070724 776044846 777205276 778337250 779283371 779998016 780558472 781122742
652 781122742 781847992 782798615 783895874 784942932 785729294 786161804 786345749 786552429 787070694 788019409
662 788019409 789231186 790294952 790752182 790349197 789207458 787802887 786762314 786577835 787388000
671 787388000 788935699 790709076 792181320 793022461 793189850 792880783 792396927 792004242 791845703 791924820
681 791924820 792142563 792356720 792436752 792304687 791960144 791479797 790992661 790631104 790474854 790515060
691 790515060 790658493 790768814 790733719 790518494 790181274 789845581 789641190 789647980 789867172 790232697 790654831
702 790654831 791068039 791462097 791875839 792364273 792954636 793617249 794267960 794797745 795112457 795159760
712 795159760 794933624 794451447 793727570 792750320 791479797 789859924 787842484 785417099 782643967
721 782643967 779680252 776786423 774290085 772497864 771579971 771470871 771854477 772266922 772292786 771777420
731 771777420 770941315 770328674 770594940 772224121 775312119 779514465 784181976 788606567 792259216
740 792259216 794913177 796626587 797620010 798141251 798379364 798450317 798425903 798359528 798283920 798191757 798024673
751 798024673 797699280 797160110 796431580 795632782 794940186 794513016 794425278 794634399 795007553 795386734
761 795386734 795659790 795806656 795895462 796040802 796340790 796820145 797406540 797948837 798273163 798256226
771 798256226 797884140 797267685 796602325 796084747 795825500 795796661 795844879 795765533 795400085 794710846 793795090
782 793795090 792832184 791993942 791360397 790880280 790392456 789692993 788613739 787081375 785131760 782875595
792 782875595 780427475 777820435 774934158 771454620 766886444 760616837 752031021 740663605 726360931
801 726360931 709425278 690692902 671499023 653485718 638255310 626930428 619755898 615910149
809 615910149 613657112 610862198 605735512 597547150 587029037 576272964 568136864 565362701
817 565362701 569735832 581586952 599784889 622167206 646200485 669607925 690775299 708870316
825 708870316 723730545 735638962 745092697 752629776 758726273 763750839 767962036 771534348
833 771534348 774597855 777273407 779680405 781913376 783999252 785870132 787380142 788372192 788767548
842 788767548 788638077 788212967 787819824 787778778 788301010 789431839 791058960 792970886 794936218 796766357
852 796766357 798344040 799620819 800592499 801277466 801704254 801912231 801956787 801908417 801839142 801802139
862 801802139 801811752 801839447 801827927 801725769 801520309 801257477 801031799 800949173 801078873 801416779 801879807
873 801879807 802334213 802651291 802759171 802673721 802490540 802342300 802337494 802509766 802796249 803060303 803147964
884 803147964 802952499 802464447 801776581 801043930 800413971 799957123 799632950 799302139 798784332 797932892
894 797932892 796687851 795090027 793245239 791257629 789166031 786910706 784347076 781299438 777634964
903 777634964 773323669 768463440 763258743 757968750 752840347 748063660 743758545 739998169 736850128
912 736850128 734411697 732816544 732207184 732683716 734249954 736784973 740051117 743739853 747537994
921 747537994 751190948 754542694 757542419 760221252 762652054 764910736 767049789 769093704 771049728
930 771049728 772926636 774747772 776553955 778390884 780288239 782238846 784188843 786044617 787696686
939 787696686 789049683 790049133 790691528 791013641 791068268 790896454 790510178 789898453 789048233 787975998
949 787975998 786750565 785497818 784383545 783578949 783219528 783373337 784022369 785066986 786351547
958 786351547 787700043 788958054 790023117 790856552 791475754 791930161 792274857 792549133 792764893 792906952
968 792906952 792941284 792825623 792527695 792039566 791388092 790629349 789825668 789011154 788166656 787216873
978 787216873 786057968 784597244 782779160 780582581 777992020 774974594 771496811 767576752 763341980
987 763341980 759031601 754906387 751098251 747482605 743688583 739286728 734103622 728498230 723423386
996 723423386 720171738 719876022 722965622 728849182 735996552 742418900 746359558 746899338 744234543
1005 744234543 739530487 734441757 730523605 728772278 729444351 732163696 736210861 740832977 745452118
1014 745452118 749720383 753457642 756550674 758886414 760355072 760897675 760554962 759472351 757843628
1023 757843628 755828552 753485260 750767670 747589722 743932266 739935913 735926132 732357559 729694138
1032 729694138 728273468 728210297 729372330 731429062 733952560 736529922 738854523 740772629 742281265
1041 742281265 743483734 744524002 745519867 746514816 747465897 748261642 748766556 748868561 748515472 747731781
1051 747731781 746611938 745303574 743984375 742844391 742067337 741811829 742191849 743255005 744970779
1060 744970779 747229233 749854431 752629166 755325623 757733994 759687042 761074448 761840439 761965866
1069 761965866 761434326 760198746 758168182 755240479 751382446 746739197 741719971 737004318 733435287
1078 733435287 731810532 732639694 735963593 741314850 747847214 754584045 760691452 765672531 769416122
1087 769416122 772111206 774083099 775634079 776950455 778091354 779038391 779758606 780247726 780539780
1096 780539780 780690765 780752487 780757751 780713196 780605774 780413513 780115128 779697418 779157486 778498077 777721939
1107 777721939 776828156 775815353 774696121 773514786 772356033 771336288 770572586 770140686 770037689
1116 770037689 770170593 770377274 770470123 770287399 769726028 768750610 767379761 765668182 763700790 761600266
1126 761600266 759539871 757743530 756455536 755884018 756140747 757201767 758912201 761038437 763339844
1135 763339844 765632858 767819748 769876633 771816406 773650360 775368958 776943512 778341675 779539719
1144 779539719 780527573 781303253 781869736 782234344 782415161 782447510 782381516 782275314 782180862 782130508 782131653
1155 782131653 782166290 782200241 782194366 782119904 781965637 781737671 781444473 781079559 780607452 779966812 779088821
1166 779088821 777914047 776391296 774451218 771972351 768777313 764693985 759679337 753961411 748111191
1175 748111191 742977676 739472198 738269043 739546661 742888947 747399063 751981277 755669632 757865524
1184 757865524 758406296 757464600 755361710 752391739 748732834 744449692 739558105 734095459 728162079
1193 728162079 721933441 715658340 709654236 704302979 700028305 697244644 696278915 697291565 700224533
1202 700224533 704803848 710596008 717095108 723813934 730350800 736419373 741849442 746565552 750562210
1211 750562210 753875427 756561432 758680420 760286865 761429443 762154770 762512817 762556000 762331619
1220 762331619 761872101 761187744 760267944 759091187 757638474 755899963 753877029 751573715 748990479
1229 748990479 746120148 742949219 739461212 735641861 731480103 726972046 722120132 716927185 711385193
1238 711385193 705460129 699085922 692185593 684714966 676715012 668336563 659805527 651337509 643041840
1247 643041840 634886894 626774063 618705368 610960159 604160957 599154778 596729622 597296638 600706902
1256 600706902 606321602 613313828 621059303 629399757 638639565 649272461 661584091 675346756
1264 675346756 689760971 703668594 715916367 725690384 732672424 736984863 738990021 739072952
1272 739072952 737503128 734410324 729842911 723843002 716495361 707940598 698369064 688030243
1280 688030243 677267303 666565781 656588974 648166656 642214737 639584923 640876846 646265488
1288 646265488 655403976 667450180 681222458 695442276 708987579 721077805 731338272 739743729
1296 739743729 746481857 751800537 755893860 758853378 760686188 761378403 760980225 759675522 757812347
1305 757812347 755871201 754373245 753750839 754227676 755757370 758049698 760670929 763179550 765241013
1314 765241013 766686249 767507477 767817841 767802505 767680588 767679367 768004913 768806229 770138168 771941071
1324 771941071 774053726 776258087 778341904 780153732 781632385 782801437 783740616 784543381 785278320
1333 785278320 785965500 786573486 787039108 787302170 787339706 787187119 786928406 786665726 786477890 786392059
1343 786392059 786384430 786403580 786404037 786369400 786312714 786261292 786238556 786255951 786318512 786431885 786605148 786842117
1355 786842117 787126083 787412872 787639084 787742538 787685165 787468567 787130203 786729050 786325684 785963211
1365 785963211 785660477 785410843 785186386 784946823 784649353 784256744 783742447 783087921 782276840 781286469
1375 781286469 780086975 778642273 776915131 774864731 772436371 769548492 766091232 761948318 757048798
1384 757048798 751432037 745299225 739025803 733116226 728114090 724496841 722589569 722525177 724255066
1393 724255066 727591324 732256393 737917328 744203491 750717773 757059937 762866440 767862930 771904144
1402 771904144 774984436 777204895 778718262 779670105 780165176 780273590 780060272 779617615 779076004
1411 779076004 778578033 778231964 778064804 778008728 777930679 777697754 777247925 776632080 775998077 775522842
1421 775522842 775320053 775369263 775508499 775500717 775146637 774388962 773351517 772282486 771429825 770906525
1431 770906525 770620499 770308914 769664688 768492279 766811752 764862518 763004074 761570053 760741119
1440 760741119 760492096 760623550 760851364 760914078 760663376 760116119 759457245 758988876 759020157 759726715
1450 759726715 761026459 762545929 763722382 764027481 763215103 761457443 759270325 757229156 755620728
1459 755620728 754218063 752331619 749131927 744076462 737198639 729089737 720580215 712319412 704509201
1468 704509201 696959839 689418411 681937103 675015259 669376831 665492477 663136063 661281052 658462219
1477 658462219 653464432 645999222 637017250 628481941 622698479 621504402 625670738 634745255 647346115
1486 647346115 661726074 676339645 690198212 702924194 714559708 725274963 735135727 744031601
1494 744031601 751769562 758250198 763608627 768213959 772514572 776804504 781039047 784820023 787569656
1503 787569656 788815460 788429413 786699295 784192505 781492996 778952637 776575928 774071655 771017609
1512 771017609 767040100 761936874 755731812 748685150 741291428 734261017 728451004 724725342 723761368
1521 723761368 725864487 730871811 738182449 746902771 756047134 764726410 772284927 778376083 782978897
1530 782978897 786361084 788973389 791290665 793633270 796041107 798261414 799873581 800496979 799989319
1539 799989319 798538361 796606293 794753113 793431549 792840729 792898560 793327713 793812027 794145584
1548 794145584 794319611 794507751 794955902 795819473 797019043 798194885 798800201 798318558 796517105
1557 796517105 793613815 790260162 787320938 785535431 785212631 786107712 787541275 788705292 789011307
1566 789011307 788311539 786891861 785252380 783791962 782561340 781208191 779145203 775857773 771204071
1575 771204071 765563507 759758835 754784241 751457443 750142365 750654221 752371597 754489594 756300812
1584 756300812 757386475 757657852 757262878 756419220 755262909 753776169 751808548 749160309 745669708
1593 745669708 741245651 735830917 729316254 721476212 711995239 700614395 687371140 672830658
1601 672830658 658182678 645121002 635496674 630848312 631969986 638672981 649827499 663658829
1609 663658829 678186874 691665649 702892075 711332855 717070923 720625916 722718201 724044266
1617 724044266 725110550 726159134 727186050 728032379 728510208 728512039 728071136 727357407 726621628 726111832
1627 726111832 725987701 726255035 726734695 727078934 726846313 725622711 723171234 719551239 715158615
1636 715158615 710651703 706779175 704169006 703170471 703811722 705886841 709114990 713275681 718238449
1645 718238449 723872452 729898300 735798111 740879288 744499741 746360626 746703491 746280746 746075134
1654 746075134 746890335 749013901 752131958 755538940 758525696 760727234 762245560 763501129 764921570
1663 764921570 766677628 768615952 770410995 771811676 772805023 773595505 774426270 775387497 776355667
1672 776355667 777112579 777557220 777854767 778396225 779579391 781534271 783973389 786270065 787739639
1681 787739639 787967987 787017975 785401459 783845291 782983093 783123550 784198227 785877304 787761536
1690 787761536 789544144 791066818 792277603 793147430 793618317 793618851 793130417 792250519 791201477 790263824
1700 790263824 789665222 789486313 789636307 789918976 790152130 790280991 790418625 790788879 791599121 792902069
1710 792902069 794521713 796081543 797136536 797346573 796627274 795199890 793515167 792080460 791259460
1719 791259460 791140976 791538696 792124863 792629547 792991943 793380508 794060669 795184402 796630249 797999725
1729 797999725 798788605 798648376 797587433 795994720 794461441 793499146 793306732 793713913 794318695
1738 794318695 794735870 794802017 794635544 794525146 794730072 795313187 796098862 796764526 797011108 796707687
1748 796707687 795944595 794977570 794106522 793554535 793402176 793588867 793967819 794373703 794672012 794784088
1758 794784088 794690018 794429016 794095917 793832703 793796768 794104843 794767914 795653839 796505051 797022400
1768 797022400 796983185 796341629 795259094 794043961 793031158 792455826 792380676 792700043 793207550 793683548
1778 793683548 793966980 793990707 793786545 793471298 793214188 793187561 793500137 794133148 794919739 795586624
1788 795586624 795863953 795614777 794913559 794029465 793307648 793007584 793181686 793657227 794132690 794331894
1798 794331894 794136887 793632507 793046341 792625122 792514648 792700958 793035431 793319931 793403244 793241196
1808 793241196 792897720 792496185 792154694 791936111 791837463 791810989 791800995 791773453 791723785 791668549 791633072
1819 791633072 791640015 791704559 791827087 791983719 792116013 792138443 791966400 791560745 790961609 790288239 789694061
1830 789694061 789298325 789135895 789155045 789267960 789419403 789623108 789939117 790404587 790964813 791461487
1840 791461487 791694489 791525803 790965958 790184402 789435577 788942184 788797760 788944626 789227905 789487457
1850 789487457 789634247 789667816 789643707 789615173 789594727 789556503 789469681 789337234 789211502 789170990 789274597
1861 789274597 789514618 789800262 789982986 789916077 789521942 788835907 788000031 787211304 786642838 786379776
1871 786379776 786394806 786575317 786781387 786905975 786904678 786789246 786600189 786375580 786137924 785894394
1881 785894394 785644760 785381851 785090256 784745255 784325333 783830719 783297806 782790146 782372284 782073898
1891 782073898 781870651 781696167 781478500 781178513 780809555 780425415 780087662 779836731 779678574 779593735
1901 779593735 779555435 779540863 779536057 779533920 779538345 779573212 779687653 779945831 780398407 781048355 781834869
1912 781834869 782645569 783360596 783901749 784259796 784485855 784653931 784814377 784972839 785098572 785156403
1922 785156403 785139008 785078201 785030823 785046768 785140686 785284119 785419006 785487213 785461884 785360413 785241165
1933 785241165 785177231 785223312 785388031 785623550 785840378 785942764 785868988 785619659 785259552 784889450
1943 784889450 784604492 784454117 784426575 784463806 784493866 784468231 784379807 784258957 784149628 784082565 784058990
1954 784058990 784055023 784035645 783977890 783882370 783770447 783672333 783608017 783577271 783558655 783519516 783431625 783283768
1966 783283768 783085861 782864914 782653427 782476044 782342606 782245636 782167282 782087631 781994095 781884384 781767197
1977 781767197 781655197 781560974 781491318 781447601 781427383 781425400 781436615 781453247 781463928 781453934 781407471 781315079
1989 781315079 781178741 781012650 780839767 780683441 780557709 780464478 780393753 780331116 780264130 780187302 780099716
2000 780099716 780002441 779894180 779772949 779637985 779495316 779357758 779242096 779161377 779119415 779106140 779101715
2011 779101715 779083481 779033966 778947220 778829880 778698425 778571854 778465805 778388901 778340759 778314209 778299942
2022 778299942 778287582 778269424 778240051 778196411 778138428 778068008 777990570 777914276 777848434 777799988 777771912 777759628
2034 777759628 777753220 777740097 777710342 777661819 777601471 777542725 777499847 777479935 777480087 777485733 777478638 777445374 777385483
2047 777385483 777313461 777252350 777221603 777226257 777251816 777272034 777259979 777202835 777108307 777000732 776907349 776845627
2059 776845627 776813049 776790314 776751862 776679993 776574097 776451035 776336670 776254120 776213760 776209259 776221619
2070 776221619 776226654 776205292 776150742 776069031 775978622 775900879 775853806 775844116 775865860 775902710 775933838 775943527
2082 775943527 775927200 775891876 775855179 775836334 775847855 775891418 775954819 776018448 776063461 776078720 776067200 776043777
2094 776043777 776028595 776037979 776076431 776133423 776188736 776221008 776217804 776181259 776126862 776075974 776046677 776045151
2106 776045151 776065216 776091080 776105194 776097183 776066666 776023865 775984573 775962601 775964813 775986862 776016998 776040268
2118 776040268 776045685 776031342 776005859 775984344 775983582 776013489 776073303 776151657 776229782 776290054 776320953 776320953 776299286
2131 776299286 776270981 776251068 776249695 776268387 776299210 776328583 776341705 776328659 776287766 776227493 776163101 776111298
2143 776111298 776084518 776084900 776104736 776128235 776138000 776123123 776083145 776028061 775975418 775942459 775939102 775963364 776002655
2156 776002655 776037827 776052170 776037827 775999451 775952530 775914917 775899429 775906982 775925217 775934296 775915070 775858841
2168 775858841 775771484 775671692 775585022 775531921 775519943 775540848 775572662 775589676 775572739 775516434 775432358 775342255
2180 775342255 775270157 775229797 775218964 775219727 775206909 775159378 775071945 774957275 774842834 774758072 774721832 774733353
2192 774733353 774772491 774807510 774809341 774762650 774673004 774563751 774465179 774402161 774383926 774399796 774425507 774431915
2204 774431915 774398956 774322815 774217300 774108200 774021606 773973236 773962173 773970261 773971481 773941498 773868179 773757324
2216 773757324 773629303 773512497 773430939 773394547 773395615 773411636 773414993 773384933 773316040 773219910 773120270 773041382
2228 773041382 772997284 772986755 772993927 772996368 772974625 772919693 772836990 772741470 772652283 772583542 772539215 772512283
2240 772512283 772487564 772448730 772384415 772293472 772186050 772079315 771990204 771928711 771893234 771870728 771842575
2251 771842575 771791382 771709213 771601028 771483536 771378708 771305084 771268539 771259766 771256638 771232758 771170654 771068115
2263 771068115 770940247 770812912 770709381 770640335 770598679 770563507 770509720 770419159 770286636 770121689 769943542
2274 769943542 769775543 769639435 769549942 769513245 769521866 769556885 769591446 769598770 769562454 769481277 769368744 769246292
2286 769246292 769131927 769033279 768946533 768862000 768772430 768680191 768597946 768543854 768533020 768569412 768642883 768731308
2298 768731308 768811035 768864212 768887329 768891602 768893433 768903732 768916321 768906326 768839798 768691254 768461990 768186951
2310 768186951 767928085 767752075 767702103 767772827 767901917 767979965 767884521 767524414 766883240 766037827 765139847
2321 765139847 764358826 763810043 763498917 763316269 763091125 762678299 762034225 761237106 760439377 759785767
2331 759785767 759339371 759066467 758873825 758667526 758381805 757958069 757303467 756284027 754792175 752878113
2341 752878113 750859451 749319305 748944244 750244141 753287506 757591858 762244797 766216431 768716812
2350 768716812 769436569 768571091 766644745 764243851 761799850 759507294 757376099 755350723 753408966
2359 753408966 751591339 749970703 748600464 747487488 746600571 745902710 745376129 745026321 744866867
2368 744866867 744901276 745116577 745490189 746002502 746645737 747423248 748342514 749407730 750615082 751949387
2378 751949387 753381653 754864883 756337357 757729416 758977661 760039139 760898132 761563644 762060699
2387 762060699 762420044 762670670 762839050 762948608 763019409 763064728 763089752 763092651 763070221 763023071 762959290
2398 762959290 762891235 762830429 762780991 762738724 762694397 762637787 762563629 762472763 762369232 762259750 762149887
2409 762149887 762044144 761944885 761852112 761762695 761672592 761576996 761473999 761365433 761255875 761149750 761049194
2420 761049194 760951691 760852356 760745544 760628891 760504303 760378723 760261612 760161438 760081329 760018997 759964294
2431 759964294 759905396 759832916 759743805 759644165 759544983 759458542 759390335 759337234 759288483 759230881 759155197 759061127
2443 759061127 758955688 758851471 758759613 758686295 758630829 758586502 758543930 758494720 758434372 758363953 758289642
2454 758289642 758219299 758159943 758114166 758078384 758045502 758006058 757954636 757890472 757818680 757747116 757682571 757627335
2466 757627335 757577591 757523651 757455063 757364044 757248688 757115631 756974869 756838226 756712952 756598816 756489487
2477 756489487 756376495 756253662 756121368 755988083 755864487 755761490 755683212 755626526 755581818 755537338 755483475
2488 755483475 755415497 755333786 755244522 755156097 755077286 755015259 754972305 754944992 754925003 754901199 754864426 754810715
2500 754810715 754743958 754674835 754615021 754571609 754542465 754514999 754473190 754402618 754299393 754171524 754036484
2511 754036484 753912430 753810577 753729095 753655319 753570938 753461456 753323288 753164673 753001633 752851028
2521 752851028 752721100 752607269 752493973 752359772 752187195 751969833 751717224 751451340 751200104 750988083
2531 750988083 750828705 750722122 750658417 750622864 750604706 750599289 750609207 750640564 750697479 750777969 750873566 750970230
2543 750970230 751053162 751111069 751138916 751139755 751122894 751101151 751085587 751081772 751087494 751093445 751087112 751059723 751009521
2556 751009521 750943985 750877380 750824127 750793610 750784912 750787964 750787354 750768585 750726547 750666809 750603638 750554733 750533371
2569 750533371 750540237 750564270 750585022 750579681 750532532 750440369 750312958 750168228 750024796 749894867 749781494
2580 749781494 749678574 749577332 749470673 749359131 749249649 749151688 749074783 749020844 748984680 748954315 748917084
2591 748917084 748864975 748798447 748727264 748667297 748634796 748640594 748686600 748764191 748858643 748951874 749029999 749086227
2603 749086227 749121475 749143524 749162598 749186478 749217453 749252243 749281464 749296417 749290085 749261627 749217300 749166336
2615 749166336 749119568 749083939 749059525 749041290 749018402 748980331 748921051 748840561 748747177 748653564 748571854 748508606
2627 748508606 748460617 748417435 748365936 748296432 748208923 748113480 748026199 747963486 747933502 747933960 747952499 747972183
2639 747972183 747977371 747959442 747917709 747859650 747796478 747738876 747693329 747659454 747630234 747593689 747538376 747458420
2651 747458420 747356796 747245102 747138901 747050781 746985474 746935883 746888123 746827621 746746674 746648865 746548233
2662 746548233 746462479 746405334 746380768 746380615 746389008 746387939 746363983 746314621 746248627 746182938 746136551 746121445 746137314
2675 746137314 746169510 746193848 746186218 746132660 746036606 745917892 745805283 745724640 745686722 745684052 745695190 745693665
2687 745693665 745660477 745591660 745498276 745400772 745317535 745259552 745224457 745199509 745168686 745119781 745049591 744966965
2699 744966965 744886475 744823380 744786377 744773331 744771194 744762268 744729691 744664993 744570694 744459076 744348297 744254761
2711 744254761 744188766 744149933 744128265 744108505 744074478 744016571 743935165 743840714 743749008 743674164 743620148 743579483
2723 743579483 743534775 743467865 743368607 743240280 743099899 742969513 742866516 742796707 742751236 742711792 742659302
2734 742659302 742581177 742476807 742355652 742232056 742119675 742027130 741954727 741896896 741843948 741785126 741711655
2745 741711655 741617966 741504974 741377487 741244125 741113586 740991898 740879898 740773773 740667343 740555649
2755 740555649 740437164 740316010 740201187 740101700 740024109 739970474 739936523 739915619 739900131 739886322 739875259
2766 739875259 739873734 739890289 739931412 739995956 740074310 740149307 740201416 740217743 740194626 740141602 740075760 740014420
2778 740014420 739968414 739938812 739917908 739895706 739863815 739819794 739763718 739697037 739619980 739531021 739429092 739315796
2790 739315796 739194336 739068375 738937988 738798599 738644867 738472214 738282776 738084564 737888794 737704468
2800 737704468 737534714 737376251 737221527 737063522 736898422 736727066 736551666 736374588 736194229 736006699
2810 736006699 735807724 735593948 735364609 735123978 734878006 734634018 734397430 734168167 733938904 733695450 733420334
2821 733420334 733098145 732721786 732295837 731834564 731355972 730873642 730390244 729895782 729373093 728806076
2831 728806076 728187408 727520828 726815796 726080170 725312347 724500427 723626862 722679901 721664047 720604095
2841 720604095 719541931 718529129 717614136 716833801 716207886 715738297 715412216 715204773 715083847 715015411
2851 715015411 714967957 714914932 714836273 714713898 714526749 714246902 713840332 713272552 712515793 711556473
2861 711556473 710398865 709062271 707578888 705990067 704346085 702708054 701148682 699749527 698594742
2870 698594742 697761078 697309113 697275467 697669144 698469086 699623642 701053619 702658768 704329147
2879 704329147 705960617 707470016 708802490 709933243 710858917 711587448 712128448 712489929 712680130
2888 712680130 712710724 712598648 712364807 712026672 711593933 711065979 710433731 709685211 708813171 707818909
2898 707818909 706716690 705532227 704300766 703062820 701858215 700721436 699675980 698732910 697890778
2907 697890778 697139587 696462326 695838699 695245285 694656219 694043045 693378220 692639389 691813354 690899811
2917 690899811 689911194 688871384 687814407 686780853 685815125 684961472 684255219 683713837 683330078
2926 683330078 683068848 682871246 682665787 682380066 681952896 681340256 680517960 679482040 678248596 676856155
2936 676856155 675366974 673866653 672458267 671251297 670351486 669851379 669824066 670324020 671385727
2945 671385727 673020782 675213165 677912903 681034241 684459686 688052979 691675034 695200577 698527985
2954 698527985 701585236 704327927 706735229 708806229 710554733 712005310 713186798 714126587 714845886
2963 714845886 715357895 715668564 715779648 715693283 715416489 714966431 714375992 713697891 713004913 712384720
2973 712384720 711925125 711697617 711741562 712056046 712603607 713323364 714146957 715013351 715876694 716703873
2983 716703873 717472610 718164139 718761978 719249954 719614716 719846649 719944611 719917603 719788895 719596024
2993 719596024 719384842 719204941 719097595 719090195 719192810 719401016 719701538 720077820 720514374 721000366
3003 721000366 721528931 722097473 722705383 723349838 724019928 724692230 725330353 725890656 726333160 726634445
3013 726634445 726795197 726838303 726800995 726720734 726623383 726519547 726405411 726270218 726104050 725901642 725663223
3024 725663223 725393372 725098877 724787140 724464722 724136353 723803177 723461761 723104935 722727356 722329254
3034 722329254 721920624 721520538 721151428 720830536 720563126 720341949 720151215 719977036 719815598 719675903
3044 719675903 719574585 719526367 719531860 719571762 719608765 719595795 719489288 719258804 718892517 718398209 717796936
3055 717796936 717117615 716390381 715643005 714898071 714173203 713481979 712836456 712246780 711719284 711252441
3065 711252441 710831528 710428314 710004501 709521027 708952942 708298721 707586365 706867905 706208496 705672455
3075 705672455 705312195 705163879 705244598 705555573 706084213 706807632 707694550 708709869 709818344 710986252
3085 710986252 712181244 713370743 714520111 715594025 716563339 717411652 718140945 718768539 719317780
3094 719317780 719805145 720231705 720582733 720837631 720985718 721036377 721021194 720984039 720965195 720987778 721050720
3105 721050720 721134262 721211929 721263123 721282578 721281357 721279068 721295090 721338196 721401596 721463928 721495132 721465607
3117 721465607 721356277 721164169 720903854 720603714 720296021 720010223 719764709 719563599 719398880 719253998
3127 719253998 719110260 718953018 718777466 718590851 718409271 718253021 718136368 718061447 718014450 717971954
3137 717971954 717907028 717801132 717647476 717453384 717234802 717009735 716794052 716599579 716432114 716293106
3147 716293106 716175690 716065903 715944290 715790863 715594025 715354309 715085144 714807739 714541473 714296494
3157 714296494 714071960 713859024 713646698 713428192 713201447 712968445 712731552 712491379 712247009 711996918
3167 711996918 711742020 711483154 711222000 710957642 710685730 710401535 710101852 709786758 709461517 709135056
3177 709135056 708816071 708510437 708218307 707933884 707648087 707352066 707041550 706719589 706394806 706079254
3187 706079254 705782623 705507050 705246658 704988403 704716263 704417496 704086456 703726730 703348236 702965088
3197 702965088 702591476 702236862 701906052 701599045 701310501 701032639 700756149 700472412 700174255 699856949
3207 699856949 699519501 699164429 698795700 698418350 698034821 697644196 697242966 696826935 696394501 695950165
3217 695950165 695502853 695063400 694639282 694229431 693825226 693414307 692987976 692547913 692107315 691686020
3227 691686020 691300049 690952301 690628052 690300293 689940948 689533615 689080429 688601379 688123627 687669449
3237 687669449 687246857 686847992 686456680 686057510 685644836 685224991 684810181 684411850 684033127 683667679
3247 683667679 683303375 682929611 682541046 682139893 681734467 681332169 680938797 680556030 680183411 679819794
3257 679819794 679463425 679113083 678765717 678418884 678073273 677734528 677414474 677126465 676879349 676669769
3267 676669769 676479034 676277924 676036072 675733566 675368500 674957581 674528046 674108200 673715591 673354111
3277 673354111 673014526 672681808 672341309 671985168 671614075 671235352 670859604 670494614 670142365 669796829
3287 669796829 669445267 669073792 668671722 668235550 667769089 667278214 666767883 666239777 665695038 665139542
3297 665139542 664587402 664060364 663578873 663152161 662768860 662396317 661989365 661504059 660912094 660210419
3307 660210419 659419098 658574142 657715988 656876984 656075668 655313950 654580536 653856888 653125534 652376175
3317 652376175 651609955 650836334 650068207 649314270 648572540 647830887 647069321 646267395 645412369 644502106
3327 644502106 643546906 642565994 641582870 640619354 639689255 638796120 637930183 637070999 636192932 635272751
3337 635272751 634296112 633262634 632184753 631083221 629980354 628893204 627829704 626786728 625751495
3346 625751495 624706001 623631783 622515945 621353798 620151138 618920670 617678032 616435242 615199356
3355 615199356 613971519 612750130 611533966 610324974 609127541 607946243 606782761 605633850 604490433
3364 604490433 603339577 602167282 600960579 599712563 598423538 597102928 595768547 594441719 593142624
3373 593142624 591884689 590671921 589499969 588359489 587239799 586132545 585033798 583943558 582867126
3382 582867126 581815414 580803680 579848938 578962746 578144646 577375755 576621132 575839615 574998970 574091530
3392 574091530 573140373 572192001 571299095 570496559 569785881 569133110 568482933 567783089 567006264 566160202
3402 566160202 565283928 564426613 563628311 562905655 562250824 561641388 561055183 560479164 559911118 559354477
3412 559354477 558809509 558270912 557730026 557181206 556627502 556081429 555560913 555082817 554656372 554283104
3422 554283104 553957481 553672409 553420753 553197594 553000336 552827415 552679100 552557144 552461052 552386551
3432 552386551 552323685 552258072 552178307 552081528 551977501 551885719 551825333 551803932 551812553 551829605 551834221 551821632
3444 551821632 551808739 551830788 551923141 552104568 552367096 552681274 553012428 553336678 553650551 553967896
3454 553967896 554305382 554670029 555053711 555437508 555804939 556152382 556494942 556859245 557272682 557749557
3464 557749557 558283768 558846703 559396973 559891815 560304642 560636559 560920181 561209526 561560593 562007179
3474 562007179 562545433 563135033 563716278 564237709 564678154 565052643 565400238 565763245 566168327 566619568
3484 566619568 567106094 567613068 568131371 568658371 569194031 569738884 570295219 570871277 571482506 572144051
3494 572144051 572856255 573596497 574319191 574973793 575527916 575984650 576381493 576772156 577198868 577674599
3504 577674599 578183441 578695679 579193115 579681587 580189476 580751648 581390228 582103920 582872047 583665962
3514 583665962 584464340 585257034 586042290 586817932 587572403 588286209 588937569 589511337 590007172 590440865
3524 590440865 590843048 591253777 591714401 592258873 592903824 593640671 594437447 595249062 596039238 596799774
3534 596799774 597559242 598367691 599266396 600253906 601273079 602228470 603029480 603637352 604086456 604466057
3544 604466057 604875107 605372009 605954781 606579590 607203331 607820816 608469162 609202461 610053482 611017303
3554 611017303 612067223 613187675 614392548 615706100 617109642 618495865 619670372 620419464 620619774
3563 620619774 620324402 619775581 619322586 619286804 619837608 620943642 622412605 623991318 625469589
3572 625469589 626742058 627819481 628799629 629825439 631039619 632534752 634305687 636215553 638009224
3581 638009224 639391327 640148010 640261765 639949455 639590988 639573364 640126953 641241150 642695618 644188461
3591 644188461 645480957 646485214 647259827 647943954 648678131 649562683 650656281 651989136 653557434
3600 653557434 655297775 657066956 658659286 659874802 660606537 660904617 660973206 661101379 661553726
3609 661553726 662470627 663813553 665368729 666809387 667804413 668152771 667902679 667397690 667197495
3618 667197495 667867355 669700089 672508011 675607452 678049622 679015503 678187866 675911636 673053436
3627 673053436 670628433 669387894 669567642 670895386 672812347 674761429 676394958 677639389 678637772
3636 678637772 679648209 680946198 682734909 685051117 687679672 690133057 691761780 691994476 690619812
3645 690619812 687954178 684775925 682027817 680425491 680174408 680944595 682098541 683036194 683465805
3654 683465805 683474731 683406448 683650208 684466171 685919113 687897949 690173569 692452316 694426117 695837173
3664 695837173 696554718 696621933 696228333 695594482 694829102 693855667 692470703 690515900 688062134 685482635
3674 685482635 683359146 682261505 682524338 684134216 686761551 689894943 692977905 695500565 697040253
3683 697040253 697306595 696216202 693974762 691090927 688273849 686219330 685377502 685813522 687228546
3692 687228546 689114304 690953903 692366714 693161316 693318863 692964783 692354813 691849518 691832657 692563019
3702 692563019 694010849 695784988 697229919 697680435 696769409 694625549 691854858 689307098 687738113
3711 687738113 687535858 688621979 690546188 692703247 694551926 695755920 696217651 696035995 695431747
3720 695431747 694680405 694058151 693804474 694081421 694937744 696270905 697807007 699120407 699721603
3729 699721603 699215012 697494736 694889145 692152176 690245972 689962997 691549072 694527283 697851410
3738 697851410 700350800 701252518 700507660 698736649 696826706 695416031 694565887 693811798 692547379
3747 692547379 690491257 687942123 685659485 684449692 684712524 686220016 688252411 689993134 690938110
3756 690938110 691093903 690875626 690804291 691195221 692011871 692928238 693533249 693539734 692896194 691782532
3766 691782532 690522308 689472504 688926544 689039078 689778671 690918274 692092514 692916794 693134918
3775 693134918 692725296 691902466 691006317 690335007 690013580 689971085 690031967 690053711 690021744 690046234 690269623
3786 690269623 690764923 691490707 692334366 693197479 694050064 694907684 695749054 696441727 696754684 696463242
3796 696463242 695488739 693975067 692237167 690607147 689277420 688244247 687397690 686688690 686248245
3805 686248245 686362762 687297516 689084549 691413193 693713303 695392227 696086731 695785446 694758377
3814 694758377 693358154 691832428 690264969 688662949 687103577 685811310 685099869 685206680 686138840
3823 686138840 687639923 689307327 690790939 691944962 692841949 693639526 694400940 694983063 695076447
3832 695076447 694375916 692778702 690491791 687974854 685754547 684217453 683498077 683528748 684201508
3841 684201508 685518951 687612228 690578156 694224319 697888947 700504532 700947037 698542557 693483353
3850 693483353 686912308 680581970 676212845 674841690 676458206 680097733 684318771 687819595 689901047
3859 689901047 690583649 690386887 689931793 689598389 689392242 689047470 688269348 686961746 685320282 683757401
3869 683757401 682717285 682482147 683066101 684233475 685617981 686868286 687754059 688191376 688206177
3878 688206177 687875824 687294769 686570587 685830002 685203629 684778824 684551773 684422836 684257126 683986359
3888 683986359 683688889 683584442 683930283 684867477 686304092 687904816 689198456 689749985 689313126
3897 689313126 687902908 685773315 683326416 681001740 679177704 678101120 677853317 678352432 679394531
3906 679394531 680721436 682088089 683305817 684249039 684837494 685026169 684816437 684278793 683560867
3915 683560867 682851181 682311401 682011948 681917114 681928711 681959991 681987076 682043762 682166061 682333069 682452469
3926 682452469 682403259 682108459 681589355 680968781 680423126 680111618 680116196 680415878 680893478 681376648
3936 681376648 681694489 681743774 681528854 681158142 680784988 680522995 680382996 680278854 680097656 679788437
3946 679788437 679403763 679062271 678861847 678813095 678840714 678851776 678805542 678727875 678661423 678601379 678483658
3957 678483658 678244400 677894440 677539520 677310791 677258148 677301483 677286835 677112427 676814957 676532745
3967 676532745 676374741 676306610 676165619 675805664 675247955 674691467 674350815 674250183 674166412 673800735
3977 673800735 673052826 672156830 671514206 671330109 671359711 671031952 669916687 668165054 666490326 665588455
3987 665588455 665405731 664913712 662774658 658549500 653476486 649862289 648983841 648586349 641762466
3996 641762466 618557625 570129395 493587494 394857864
4000 394857864
##END=$$ End of the data block
