##TITLE=$$ Begin of the data block
##JCAMP-DX=5.00 $$ ACD/SpecManager v 10.08
##SPECTROMETER/DATA SYSTEM=16PC
##DATE=18 Jun 2013 16:13:30
##DATA TYPE=INFRARED SPECTRUM
##DATA CLASS=XYDATA
##ORIGIN=
##OWNER=
##NPOINTS=3601
##FIRSTX=400.00000000
##LASTX=4000.00000000
##MAXX=4000.00000000
##MINX=400.00000000
##MAXY=245.61402893
##MINY=17.02127457
##XFACTOR=1.0000000000
##YFACTOR=0.000001000000000
##FIRSTY=183.39622498
##DELTAX=1.00000000
##XUNITS=1/CM
##YUNITS=TRANSMITTANCE
##XYDATA=(X++(Y..Y))
400A83396225J7839157L169907j5562348j6956833P048798K804214k8573776l7902214
408A15263130m4184639k0589924O0268452O2012939j3997589l6821174l3182884k7124497
416F1643814p360504N008720K3935364J4710739l9544845l6604334K8398538L3771538
424H3959030j1397461k1767921j7566895l226784M5386551L6169007n3361679m1172573
432A7021275Q9282390Q9785690l7308181n3199799K5616989K6317948m3188385m1711808
440G2616119K7426178L6321320r160507m578690N6141541M4260345n6330475n2458572
448A14237259O4953369O6423401m1571945n5457199Q607315J1687454l5446594l6941841
456I6491219L96225P936386n024582p042954m619430l195046r52606K80022R23973
$$ y = [183396225, 201235382, 204405289, 188842941, 171886108, 178934906, 181739120, 153165344, 115263130, 71078491, 50488567, 110757019, 172769958, 158772369, 121951195, 88768311, 61643814, 54283310, 59292030, 83227394, 97938133, 58393288, 21788954, 50187492, 83959030, 72561569, 50793648, 33226753, 29999969, 75386520, 111555527, 58193848, 17021275, 106303665, 196089355, 158781174, 105581375, 131198364, 157516312, 114327927, 72616119, 100042297, 136363617, 127203110, 122624420, 178765961, 223026306, 166695831, 114237259, 179190628, 245614029, 204042084, 148584885, 157192200, 168879654, 133433060, 96491219, 96887444, 104823830, 99799248, 92756294, 88136864, 84941818, 83989212, 84269234, 85193207]
465H5193207J122230M39957M73305J116447J196358Q16368P35977Q55919Q13652O76872
475I3440292N37041N05371M5471j212715j252701M700K25990l94249l00834N18249
485I2116615M59694m96506o67236j45630k42447j029251r09302N3834N17654Q83575
495I0541000Q88329M08386K00966L7476P4699M26865M79980K83699K53197M22455K40425
506I4257477l82736n36705k99736k69463k94518l82858o34712o41136m30771k98142
516I0086700j30394q4495r9945k62161p11419q01330n82169m99435m62486l88459k87796
527H5776611k01553n5244j06026m50661m45122j55693L8483K79304L78014K98622L73795
538H5730530N84389O74003P21268O67999M90715L41393J27166O7498J76101J78307
$$ y = [85193207, 86315437, 86755394, 87228699, 88345146, 89541504, 90357872, 91093849, 91949768, 92763420, 93440292, 93977333, 94482704, 94528175, 93315460, 92062759, 92067459, 92293449, 91899200, 91598366, 92116615, 92576309, 92079803, 91412567, 91266937, 91024490, 89995239, 89085937, 89139771, 89657425, 90541000, 91429329, 91837715, 92038681, 92076157, 92150856, 92577721, 93057701, 93341400, 93594597, 94017052, 94257477, 93874741, 93338036, 93038300, 92768837, 92474319, 92091461, 91456749, 90815613, 90384842, 90086700, 89956306, 89871811, 89771866, 89509705, 88798286, 87996956, 87414787, 86915352, 86452866, 86064407, 85776611, 85575058, 85519814, 85413788, 84963127, 84518005, 84362312, 84400795, 84680099, 85058113, 85356735, 85730530, 86314919, 86988922, 87710190, 88378189, 88868904, 89210297, 89337463, 89404961, 89581062, 89759369]
548H9759369Q2283J29936M03572L31856j09962k51526j92810k04468k47002k07977
558H9493271q8974L601J22024J63361J46103R9113N196r5940k68295k95898j81870
569H9101692j30104o2034q8265k11403l10638m32587n11574o10634n43434k75367j31325
580H5794327m1313L9573Q8906J51466K54204K44545R8968O4041P5005J44081L53020
591H7266823L62541K16888P8202j89896k04300M5990J33560J87706J18355j42914k32673
602H7640282k01317k10999k51983k01279o6681N9837K89589K69265o913j62651l56079
613H6801071l31062n4459Q4740J99692K26570J40098J05050P0190P5691J30280J58928
624H7606789J83296J91635J97441J58310K7321L4286K01271K09877J15540J4618j84059
$$ y = [89759369, 89841652, 89971588, 90375160, 90707016, 90597054, 90345528, 90152718, 89948250, 89701248, 89493271, 89404297, 89407898, 89529922, 89693283, 89839386, 89938499, 89943695, 89847755, 89579460, 89283562, 89101692, 88971588, 88909554, 88821289, 88609886, 88299248, 87866661, 87355087, 86744453, 86201019, 85925652, 85794327, 85753014, 85792587, 85881493, 86032959, 86287163, 86531708, 86630676, 86694717, 86769722, 86913803, 87266823, 87629364, 87846252, 87924454, 87734558, 87530258, 87576248, 87709808, 87897514, 88015869, 87872955, 87640282, 87438965, 87227966, 86975983, 86774704, 86708023, 86767860, 87057449, 87326714, 87319801, 87157150, 86801071, 86470009, 86415550, 86500290, 86699982, 86926552, 87066650, 87171700, 87241890, 87317581, 87447861, 87606789, 87790085, 87981720, 88179161, 88337471, 88364792, 88399078, 88600349, 88810226, 88925766, 88940384, 88756325]
635H8756325k12410p0214k6588k6749k0813o0150J0727K46140K72995J42479K2720
646H9034462k02538k36656p6507l1372m8287k9968P133L1159Q1016L2807j50109j97364
658H8213776j27030j37543k00607k30980k49382k58423k74353k29667j12892l7522
668H6355377M9187M9705n6572q9744p4051r2552j16280j78383k93899l69744l77487
679H4805557n24017p66945j069115j400642j918411k628777l349731m271797m815171
688F4060951n331447m994297l868653k521156l93082Q47317J584625J948574J769921
697E3102753J595665J107216J031639J280449J480293J702431K034950K587387K833511
706F8756294K862450K843811K792953K478554J807785J383278J060990Q14270O89865
$$ y = [88756325, 88543915, 88473701, 88447113, 88420364, 88399551, 88339401, 88350128, 88596268, 88869263, 89011742, 89034462, 88831924, 88595268, 88518761, 88487389, 88439102, 88409134, 88416267, 88447426, 88528442, 88561249, 88411140, 88213776, 88086746, 87949203, 87748596, 87517616, 87268234, 87009811, 86735458, 86505791, 86392899, 86355377, 86404564, 86454269, 86397697, 86307953, 86233902, 86141350, 86025070, 85846687, 85552788, 85183044, 84805557, 84281540, 83514595, 82445480, 81044838, 79126427, 76497650, 73147919, 68876122, 64060951, 58729504, 53735207, 49866554, 47345398, 46952316, 47799633, 49384258, 51332832, 53102753, 54698418, 55805634, 56837273, 58117722, 59598015, 61300446, 63335396, 65922783, 68756294, 71618744, 74462555, 77255508, 79734062, 81541847, 82925125, 83986115, 84800385, 85490250]
715H5490250N27359L56628K18414J21544j0231j68365l11066l94585o35719r94636
725H4199593j414032j969773k415748k920914l055931k927757k538010j746346j112869
734F4098213m06742Q610K29763K33669n1140l16044p36309r19841r47049q88488p36573
745E9568069m51156L837M43673R74441J356529J631974J872085K093506K158287K095459
755G1746704J926636J609688J291366Q96363N78926K49817J11557J53396K15553L06130
765G9086136N52246J023437J314332J551818J633576J523849J467919J414512J323296
774I0891121J211098J050872Q23288O32431M26125L08914K72324K45712K71843K50320
784I6384048J63796J81770L30490L35221K38510J44554m73q5526j25762j71616k20848
$$ y = [85490250, 86017609, 86374237, 86592651, 86714195, 86703964, 86535599, 86224533, 85829948, 85194229, 84199593, 82785561, 80815788, 78400040, 75479126, 72423195, 69495438, 66957428, 65211082, 64098213, 63691471, 63700081, 63929844, 64163513, 64112373, 63796329, 63060020, 62140179, 61193130, 60304642, 59568069, 59116913, 59120750, 59564423, 60538864, 61895393, 63527367, 65399452, 67492958, 69651245, 71746704, 73673340, 75283028, 76574394, 77470757, 78049683, 78299500, 78411057, 78564453, 78780006, 79086136, 79638382, 80661819, 81976151, 83527969, 85161545, 86685394, 88153313, 89567825, 90891121, 92102219, 93153091, 93976379, 94608810, 95034935, 95343849, 95616173, 95861885, 96133728, 96384048, 96547844, 96729614, 97060104, 97395325, 97633835, 97778389, 97777916, 97692390, 97566628, 97395012, 97174164]
795I7174164k31980j67678k18796m30321m31541k86980j09291K28760L30825K11411
805I6068573K08755K73514K64649J97815J51153J19072M5487q6449j53519j80031j91925
816I6717094j64894j70562k63619j53900K27409L14873J19591J62536N19799L65875
826I7674202k86224o63155j065498j064370o08947l31711k4964J12870N2734J08940
836I3903877K66312K71126J20025Q0132P9895J38397L28278L39775J69159J40732K25166
847I6062874K15217J25458J04569J00540J72592L83476M22669L38478K48222Q8432
857I8262527m417o2866r3315q7982p1785k4773j953J5426P004l7903n6457m8378p7675
870I7717453j59477j69304j16089q8715o1508m8591n7076m4464k2842J3305Q6258J01181
$$ y = [97174164, 96942184, 96774506, 96555710, 96125389, 95693848, 95406868, 95297577, 95526337, 95857162, 96068573, 96277328, 96550842, 96815491, 97013306, 97164459, 97283531, 97329018, 97242569, 97089050, 96909019, 96717094, 96552200, 96381638, 96118019, 95964119, 96191528, 96506401, 96625992, 96788528, 97308327, 97674202, 97387978, 96724823, 95659325, 94594955, 93986008, 93654297, 93629333, 93742203, 93794937, 93903877, 94170189, 94441315, 94561340, 94641472, 94721367, 94859764, 95188042, 95527817, 95696976, 95837708, 96062874, 96278091, 96403549, 96508118, 96608658, 96781250, 97164726, 97587395, 97925873, 98174095, 98262527, 98258110, 98195244, 98101929, 98013947, 97942162, 97917389, 97915436, 97930862, 97937866, 97899963, 97843506, 97795128, 97717453, 97557976, 97388672, 97272583, 97183868, 97122360, 97073769, 97016693, 96972229, 96949387, 96962692, 97048950, 97150131]
882I7150131N0713N8845J12793J39550J53038J70280J93550J96503J78810J67900J63651
893I8735764J38900Q9859N8556K8778K3079O3515L9146l5118j08193j98150k84050
904I8552086l54912m75716o91009p57698o99280o64825o10115n63286n09079m80507
914I2745659m98268m46800l33619k44499j94115l8269K45667M22981N54299O31614
924I2844650O55678O31523N39803M52659L28804K60949K62809J86852L7384n5336j19713
935I6026062j72470j92215k48077l41912l97186m09004m73404n94803o59782o80802
945I1856407p21718p59292q22731r05922j004311j117256j252007j404312j584121
954H2284737j780228k027603k334908k632690k980042l210373l428413l381966l118373
$$ y = [97150131, 97200844, 97259689, 97372482, 97512032, 97665070, 97835350, 98028900, 98225403, 98404213, 98572113, 98735764, 98874664, 98964523, 99023079, 99051857, 99074936, 99138451, 99177597, 99142479, 99034286, 98836136, 98552086, 98197174, 97721458, 97030449, 96272751, 95573471, 94908646, 94298531, 93735245, 93226166, 92745659, 92247391, 91800591, 91466972, 91222473, 91028358, 90990089, 91235756, 91658737, 92213036, 92844650, 93500328, 94131851, 94671654, 95124313, 95453117, 95714066, 95976875, 96163727, 96201111, 96145775, 96026062, 95853592, 95661377, 95413300, 95071388, 94674202, 94265198, 93791794, 93196991, 92537209, 91856407, 91134689, 90375397, 89552666, 88646744, 87642433, 86525177, 85273170, 83868858, 82284737, 80504509, 78476906, 76141998, 73509308, 70529266, 67318893, 63890480, 60508514, 57390141]
963E7390141k700566k049187j418754p10678o5140N54421J141811J726387K196957
972E6065392K633834K826714K828148K638267K209229J731994J076912N71396Q7357
981G2669243j90476k83378k91115j27625l7498O6322P9850Q750o5757j69869k80288
992G1378159m16352n24185o45355o67664o10832n08209k87460k04972j95785k63527
1002F7053818m70352n64194o12572n97519n07431m07097k63286j44482l0826O6516
1012F3522575J45844K24876L05649L62137L92296M30221M59748N11406O21864O13670
1022F7590286M95743M09622L30765K15691n9365M4060M84993Q88779J498382J716545
1032G3615501J632119J486564J156136Q94333O21681M02306K19345P6149k1149j00708
$$ y = [57390141, 54689575, 52640388, 51221634, 50510956, 50445816, 51000237, 52142048, 53868435, 56065392, 58699226, 61525940, 64354088, 66992355, 69201584, 70933578, 72010490, 72581886, 72669243, 72478767, 72195389, 71904274, 71776649, 71739151, 71805473, 71885323, 71894073, 71828316, 71658447, 71378159, 70961807, 70437622, 69792267, 69124603, 68513771, 68005562, 67718102, 67513130, 67317345, 67053818, 66583466, 66019272, 65406700, 64809181, 64301750, 63894653, 63631367, 63486885, 63456059, 63522575, 63668419, 63893295, 64198944, 64561081, 64953377, 65383598, 65843346, 66354752, 66976616, 67590286, 68086029, 68495651, 68826416, 69042107, 68982742, 69026802, 69511795, 70400574, 71898956, 73615501, 75247620, 76734184, 77890320, 78784653, 79406334, 79808640, 80027985, 80104134, 80082985, 79982277]
1042G9982277j57929j83342j74186j51062q0017p6241j22833j72333k33314l18932
1052G8312088m51569n28503n76370n91614n52826n49362n58617n81741o04340o82998
1062G2634148q10196r59442j193283j288079j390793j137451n87364J32439J317764
1071F6717743J912331K220512K080826J314110P98156K67121r3842k76489m99039p12845
1081G3728584q94500j073143j155930j146667j123215j075531r66004q05091n88753
1090F4899750k84355k6703K13432M53735O97274R13932J142670J257347J273514J255104
1100G1795700J164864J087761R66575R45091J012948J067497J162880J184990J160576
1109H1548882J096679R76013Q60619P30225O03866M64081L61542K90008K23427J60408
$$ y = [79982277, 79824348, 79641006, 79466820, 79315758, 79235741, 79159500, 79036667, 78864334, 78631020, 78312088, 77860519, 77332016, 76755646, 76164032, 75611206, 75061844, 74503227, 73921486, 73317146, 72634148, 71823952, 70864510, 69671227, 68383148, 66992355, 65854904, 65267540, 65399979, 66717743, 68630074, 70850586, 72931412, 74245522, 75043678, 75310799, 75216957, 74940468, 74441429, 73728584, 72834084, 71760941, 70605011, 69458344, 68335129, 67259598, 66293594, 65488503, 64899750, 64615395, 64588692, 64802124, 65255859, 65953133, 66867065, 68009735, 69267082, 70540596, 71795700, 72960564, 74048325, 75014900, 75959991, 76972939, 78040436, 79203316, 80388306, 81548882, 82645561, 83621574, 84482193, 85212418, 85816284, 86280365, 86641907, 86931915, 87155342, 87315750]
1119H7315750J32347J38397J50254J81106K06398K43714K47139K12120K02636J85563
1129H9215424K29118L53409M09599M16161M48036M92409N25520N74280N54657M61647
1139I3680260L98948L41057K86057K41371J78886Q3428M3434O6971L3210k1331j22048
1150I5210243k76016m29535o58661p12868o48544m90906j70211N9677K92732M06815
1160I2582726M19448L82592K47337J57089P1030Q942k9305o3232p6363j15227j71043
1171I3413994k32483l14636l68523m22073m12705l36883k71538j90636j21620m5540
1181I0697357j0895j2611k2606m4128r2408j90567k31124k15340k45934l18473l48191
1192H8965080l50685l48427l27156l21533l35602l18619k73468k39753k22466j62315
$$ y = [87315750, 87448097, 87586494, 87736748, 87917854, 88124252, 88367966, 88615105, 88827225, 89029861, 89215424, 89444542, 89797951, 90207550, 90623711, 91071747, 91564156, 92089676, 92663956, 93218613, 93680260, 94079208, 94420265, 94706322, 94947693, 95126579, 95210007, 95253441, 95320412, 95353622, 95332291, 95210243, 94934227, 94504692, 93846031, 93133163, 92484619, 91993713, 91823502, 91883179, 92175911, 92582726, 93002174, 93384766, 93632103, 93789192, 93860222, 93869164, 93839859, 93776627, 93700264, 93585037, 93413994, 93181511, 92866875, 92498352, 92076279, 91663574, 91326691, 91055153, 90864517, 90742897, 90697357, 90686462, 90673851, 90651245, 90607117, 90514709, 90324142, 90093018, 89877678, 89631744, 89313271, 88965080, 88614395, 88265968, 87938812, 87617279, 87281677, 86963058, 86689590, 86449837, 86227371, 86065056]
1202H6065056p2624M0626K06825L14240M03786M23309L66692L10249K14821J60759
1212H8433739J38359J06071O7040N0140O2370M6753o790j098N2665J01876J84272K01249
1224H9436646J45629J44623J71021K06230K79449K92443K55561K25426J83083J47583
1234I1487694J05018R1629J17966J05339O3248L2020M105l0662q4160r8732p4005o9092
1246I1650368p2861p0808n9510o7306r6062j10222j28677j11481m9614j9218R254o584
1258I0867279p5172j20446j65702j93886k17362k03949j49887j02501l3523q652k8442
1269H9567757k5010q682o149j0422k2812n8700n5336j7929J1589M0977Q0826J51688
1281H9647797J60568J11297Q1467O5018Q438q9356j70570k65480l10989l19245l04771
$$ y = [86065056, 85992432, 86033058, 86239883, 86554123, 86957909, 87381218, 87747910, 88058159, 88272980, 88433739, 88572098, 88678169, 88745209, 88795349, 88857719, 88904472, 88897682, 88896584, 88949249, 89051125, 89235397, 89436646, 89582275, 89726898, 89897919, 90104149, 90383598, 90676041, 90931602, 91157028, 91340111, 91487694, 91592712, 91684341, 91802307, 91907646, 91970894, 92002914, 92007019, 91976357, 91892197, 91793465, 91719460, 91650368, 91577507, 91506699, 91447189, 91379883, 91283821, 91173599, 91044922, 90933441, 90883827, 90864609, 90873863, 90867279, 90792107, 90671661, 90505959, 90312073, 90094711, 89890762, 89740875, 89638374, 89604851, 89596199, 89567757, 89542747, 89534065, 89527916, 89517494, 89494682, 89435982, 89380646, 89362717, 89374306, 89415283, 89496109, 89647797, 89808365, 89919662, 90001129, 90066147, 90074585, 89985229, 89814659, 89549179, 89238190, 88918945, 88614174]
1292H8614174k69005j91879m4701L7407P5241J20568J77246J77902J23291P7675M509
1303H8902428j4550K1630K6726J3542J6929K4742N0576J00609J36085J82129J76887
1314H9637733J11481Q3115P4959N6984L6407J4206p126l8650q6876j14777j33873j35109
1326H9498474j13991r7610p9605n8342l4378p248L0777M8301M4686N3596O9237Q1062
1338H9434959R7794R4826P8415M7775q225m4395p5890q7326p6156o8138n2262m7111
1350H9294266m2534o0776j11961j33301j27907j46393j78146k15263k61689l09875
1360H7706421l88718l90480k96737k89200l59085l60032l18336k75352k04087j71234
1370H4653160j83845j47171o4896j7311K2049K7519j2947k5726k7062k5894j9737r560
$$ y = [88614174, 88345169, 88153290, 88108589, 88145996, 88221237, 88341805, 88519051, 88696953, 88820244, 88897919, 88902428, 88887878, 88909508, 88936234, 88949776, 88966705, 88991447, 89042023, 89142632, 89278717, 89460846, 89637733, 89749214, 89832329, 89907288, 89964272, 90000679, 90014885, 90007759, 89969109, 89882233, 89767456, 89633583, 89498474, 89384483, 89286873, 89207268, 89148926, 89114548, 89107300, 89138077, 89186378, 89231064, 89284660, 89353897, 89434959, 89532753, 89627579, 89705994, 89753769, 89745544, 89701149, 89625259, 89537933, 89461777, 89393639, 89341377, 89294266, 89251732, 89190956, 89078995, 88945694, 88817787, 88671394, 88493248, 88277985, 88016296, 87706421, 87317703, 86927223, 86630486, 86341286, 85982201, 85622169, 85303833, 85028481, 84824394, 84653160, 84469315, 84322144, 84257248, 84239937, 84261986, 84289505, 84276558, 84250832, 84223770, 84197876, 84178139, 84168579]
1382H4168579J7853J0612m8210l9192M1199N9242M2274J4565n3787o7475n0659k243
1394H4092758J30585J35467q483n341J40709J50375N6381O798n1429n4474J785L6720
1406H4631851R2148Q1253j3092l5881r445J91J9599Q370l6194o2988j33515n3001K47887
1419H4737183K96707J19667Q4183J24382J36184J63819J34399K0523M532P1716R8183
1430H5991478J32133J04493n936m5418m7607l1929O8550N409j96503l88412n61424
1441H5024834r00032j360558j933288k846886l196427l378135k712105r32213K16980
1450F7982170J342301J760719J308082J323990J461525J768738K561279K528046J702476
1459H3739326J261925Q83293O81641O65619O85188Q50632Q70872Q13507O98967M41697
$$ y = [84168579, 84186432, 84197044, 84148834, 84109642, 84150841, 84210083, 84252357, 84266922, 84213135, 84145660, 84095001, 84092758, 84223343, 84358810, 84350327, 84344986, 84485695, 84636070, 84692451, 84699249, 84647820, 84593346, 84595131, 84631851, 84723999, 84805252, 84792160, 84756279, 84746834, 84747025, 84766624, 84774994, 84738800, 84675812, 84542297, 84489296, 84737183, 85033890, 85153557, 85237740, 85362122, 85498306, 85662125, 85796524, 85817047, 85821579, 85893295, 85991478, 86123611, 86228104, 86222168, 86176750, 86129143, 86097214, 86165764, 86171173, 85974670, 85586258, 85024834, 84124802, 82764244, 80830956, 77984070, 74787643, 71409508, 68697403, 67765190, 67982170, 69324471, 71085190, 72393272, 73717262, 75178787, 76947525, 79508804, 82036850, 83739326, 85001251, 85884544, 86566185, 87231804, 87916992, 88767624, 89638496, 90452003, 91150970, 91592667]
1469I1592667L63540M18190M68750O02394O07392M87999M38949M50257L67187J88156
1479I5985481P3960J2016j08482k38060m64127q07549j097488j218864j802971k858162
1489H7475754l719757n116036m798866l041534r99329K323891M098793N008102N150200
1498H6381218M163551L395798K386665J629357R82689N17959J58028J39954O49063
1507A00404282P06840M37431L22625K50938J86417J60080Q3725r4338p9300J77765
1517A02556465J86257l0877p4936l4263M5517K72652K59712k9587o2775J16844J50017
1528A03355026J21758N1170j35399j62750o9969K3887K62566J90071k51938l74412
1538A03010010l40988j86516K49412L59795J82060J73378K79473K59994J32111O7497
$$ y = [91592667, 91956207, 92374397, 92843147, 93445541, 94052933, 94540932, 94979881, 95430138, 95797325, 95985481, 96059441, 96071457, 95962975, 95724915, 95260788, 94453239, 93355751, 92136887, 90333916, 87475754, 83755997, 78639961, 73841095, 70799561, 69800232, 72124123, 76222916, 81231018, 86381218, 90544769, 93940567, 96327232, 97956589, 98939278, 99457237, 99615265, 99755219, 100404282, 101111122, 101548553, 101871178, 102122116, 102308533, 102468613, 102552338, 102458000, 102378700, 102556465, 102742722, 102711845, 102636909, 102602646, 102648163, 102920815, 103180527, 103150940, 103088165, 103205009, 103355026, 103476784, 103527954, 103392555, 103229805, 103159836, 103183723, 103446289, 103636360, 103384422, 103010010, 102669022, 102482506, 102731918, 103091713, 103273773, 103447151, 103726624, 103986618, 104118729, 104186226]
1548A04186226K1454J075K9496O836p0137q8814J1207j24267o70387n72487J92711
1559A02922913M77104N69389M62509j9310j66183m9301r3842k37587l04527l35411
1569A03225754l43628k06261m01832r61037j282837j783302j399300M2961P85042J377419
1579I9052979J376510N76019K44446Q1635J9699J59477J65367J18706K9442j08956
1589A01715324k80571m88304p36450j098946j275939j410706j230331o94420k37679
1598I4261978L32596O79993Q73306R73556R34555Q79784P52236O56250N74752M71665
1608A01390671L39126K44309J89300R8565J1543j54259m98817n39833k45400k25494
1618A00609711l78472n01228p27867p25197n22804l35526j18400J63437N91278Q04901
$$ y = [104186226, 104207680, 104208755, 104238251, 104245087, 104174950, 104086136, 104097343, 103973076, 103302689, 102730202, 102922913, 103400017, 103969406, 104431915, 104412605, 104246422, 104197121, 104103279, 103865692, 103561165, 103225754, 102882126, 102675865, 102274033, 101312996, 100030159, 98246857, 96847557, 96890518, 97675560, 99052979, 100429489, 101005508, 101249954, 101331589, 101351288, 101510765, 101676132, 101794838, 101824280, 101715324, 101434753, 100946449, 100209999, 99111053, 97835114, 96424408, 95194077, 94499657, 94261978, 94594574, 95274567, 96147873, 97121429, 98055984, 98935768, 99688004, 100344254, 100919006, 101390671, 101729797, 101974106, 102163406, 102261971, 102273514, 102119255, 101620438, 101080605, 100835205, 100609711, 100231239, 99730011, 99002144, 98276947, 97754143, 97418617, 97300217, 97463654, 98054932, 98859833]
1628I8859833R08973Q45047N71778L12950q1612k35130k14264j29204J68778J95007
1638A01202156k2057j11892j40427k14554l08464m18731o11336o26038m30847m14085
1648I7903725m47007o56341j218819j300789r87533p71691m36210l56697n50865n72274
1658I0605499m98634m65752m90371l70057o1363N9578L2379P4578J18019K17598M12658
1669H9634132M90952N16724M45076J48536J81816N73761O54167M96727M76647N59303
1679I4177841N07858K94846K66602L63922M77241P48543P19406L77342K30530J76163
1689I8340294J16875J13250K0005k17438k35581m7783L5790J19514R5849j39664o1875
1700I8139236L74894M62745K57607K43591L38104L87268M62243M32159L01956J82457
$$ y = [98859833, 99768806, 100613853, 101185631, 101498581, 101416969, 101181839, 100967575, 100838371, 101007149, 101202156, 101180099, 101068207, 100927780, 100713226, 100404762, 99986031, 99374695, 98748657, 98317810, 97903725, 97456718, 96800377, 95581558, 94280769, 93293236, 92521545, 92085335, 91728638, 91177773, 90605499, 90106865, 89641113, 89150742, 88780685, 88719322, 88778900, 88811279, 88885857, 89003876, 89221474, 89634132, 90125084, 90641808, 91086884, 91235420, 91417236, 91990997, 92645164, 93141891, 93618538, 94177841, 94685699, 94980545, 95247147, 95611069, 96088310, 96836853, 97556259, 97933601, 98164131, 98340294, 98457169, 98570419, 98590424, 98372986, 98137405, 98089622, 98125412, 98244926, 98340775, 98201111, 98139236, 98514130, 98976875, 99234482, 99478073, 99816177, 100203445, 100665688, 101097847, 101399803, 101582260]
1710A01582260J1665p3509q2184j14723j65489j56876j21711o394K82715L17223J10458
1721A01583435L7170j907J5183J29036J55204J19713J02760R1050N7411j4351l2570
1732A02242134o4018O6498M91592N05356J17538n294k694J6785J38237J29654p462
1743A03628326m7088j6480l2989r0630r6107p9415j4015J43715J92619J73928J23710
1754A03885574k8488l7147J07078J21041L4195J1917K792M6967K02156J97387L7239
1765A04580711k5749m3465o1103n9250p0427j30798o3469J78741K30080J25068R1248
1776A04751587Q1177N6678M815J5327J16066J05736k3911l8650N2215N1689j2634n4359
1788A05105736r7847j32179j97365j44364Q6121J07544n2544j18042j62651j67656
$$ y = [101582260, 101593925, 101520416, 101438232, 101323509, 101158020, 101001144, 100879433, 100873039, 101155754, 101472977, 101583435, 101620605, 101618698, 101633881, 101762917, 101918121, 102037834, 102140594, 102231644, 102289055, 102274704, 102242134, 102178116, 102244614, 102736206, 103241562, 103359100, 103353806, 103351112, 103367897, 103506134, 103635788, 103628326, 103581238, 103564758, 103531769, 103441139, 103345032, 103265617, 103251602, 103395317, 103587936, 103761864, 103885574, 103857086, 103819939, 103927017, 104048058, 104082253, 104094170, 104096962, 104143929, 104346085, 104543472, 104580711, 104554962, 104511497, 104450394, 104391144, 104320717, 104189919, 104126450, 104305191, 104535271, 104660339, 104751587, 104832764, 104889442, 104894257, 104909584, 105025650, 105131386, 105107475, 105068825, 105121040, 105172729, 105160095, 105105736, 105007889, 104875710, 104678345, 104533981, 104620102, 104727646, 104675102, 104557060, 104394409, 104226753]
1798A04226753j21711q8952m9591j8959J5091J9104j8028j8524J3305J6877r011R77
1810A03967331M2198O7902J01089R6184L7407L3333O9183R5200J41906J36811Q3610
1821A04872154L9742m9660k2697J59431J79672O3919K5345q056L8215K17270K42165
1832A05757500J31149R8038J06170Q8219M6967L8383P5363N0164l0282q6235j94282
1843A06081154j27915J74736K39563J19881P6531M3678K3552J8692J6548L1494J8578
1854A06716492k9091l9314j8189j3687r918k2461n7984p4409p2762r1201j24428j55709
1866A06007339k11166k03041j30966q4229j8333k2102j08101j37398j49323j25671
1876A04817009m6349j0063R110N981m3678l7743K1889M0558L9268K8588j0163j2947
$$ y = [104226753, 104105042, 104016090, 103966499, 103947540, 103962631, 103981735, 103963707, 103945183, 103958488, 103975365, 103966354, 103967331, 104009529, 104077431, 104178520, 104274704, 104312111, 104345444, 104414627, 104509827, 104651733, 104788544, 104872154, 104911896, 104862236, 104839539, 104998970, 105178642, 105242561, 105267906, 105259850, 105298065, 105515335, 105757500, 105888649, 105986687, 106092857, 106181076, 106228043, 106266426, 106341789, 106391953, 106361671, 106275436, 106081154, 105953239, 106127975, 106367538, 106487419, 106563950, 106607628, 106631180, 106649872, 106666420, 106697914, 106716492, 106687401, 106648087, 106629898, 106616211, 106606293, 106583832, 106525848, 106451439, 106378677, 106287476, 106163048, 106007339, 105796173, 105593132, 105462166, 105377937, 105359604, 105337502, 105229401, 105092003, 104942680, 104817009, 104770660, 104760597, 104769707, 104775688, 104732010, 104694267, 104716156, 104756714, 104795982, 104824570, 104814407, 104801460]
1888A04801460J3283L2166O1386O6261L9986M4105P7629Q2970O7711N9128M2961M8950
1900A05437996Q2634R1911Q7212P8605N8197M7188M1077L6430K9328L8856P7034P6699
1912A06183167M4448K0882j2421k2506k0241M814Q8165P7202l6957o6208m3060k5581
1924A06191704J5854K0462j0872k1248j7334k9488n6839p2624q0612r2644j10199j15844
1936A05620316r9305j19331j85509k01088j84387j59073r5871q8218j37757j44691
1946A04205086j28273j11367r1117n6389J884L6141N3787P2716R5802R3574N5794N3002
1958A04280640Q3923Q2825N2955M6845N7747N9890N8388N8296N3139O3683R6756J03920
1970A05099007R1270Q2993O9549O4636O9161O5781N6243N0850M4373M7378O1058O9855
$$ y = [104801460, 104814743, 104846909, 104908295, 104974556, 105014542, 105058647, 105136276, 105219246, 105286957, 105346085, 105389046, 105437996, 105520630, 105612541, 105699753, 105778358, 105836555, 105883743, 105924820, 105961250, 105990578, 106029434, 106106468, 106183167, 106227615, 106248497, 106236076, 106213570, 106193329, 106198143, 106286308, 106363510, 106326553, 106260345, 106217285, 106191704, 106207558, 106228020, 106217148, 106195900, 106178566, 106149078, 106092239, 106019615, 105939003, 105846359, 105736160, 105620316, 105521011, 105401680, 105216171, 105015083, 104830696, 104671623, 104575752, 104487534, 104349777, 104205086, 104076813, 103965446, 103874329, 103817940, 103819824, 103855965, 103909752, 103982468, 104078270, 104171844, 104227638, 104280640, 104364563, 104447388, 104500343, 104547188, 104604935, 104664825, 104723213, 104781509, 104834648, 104898331, 104995087, 105099007, 105190277, 105273270, 105342819, 105407455, 105476616, 105542397, 105598640, 105649490, 105693863, 105741241, 105802299, 105872154]
1982A05872154Q1703Q0086O4087N3696M1603L6903M3183L6781J0376J6807N9296P1999
1994A06468674O7733O1135L8315M0100P6584O6322J3351j7135n2292m8828L959J9791
2006A06737709J4877J0491p775l646K1698L6521O0799M6181j9310l9414l4446j9409
2018A06804276K1835L9726M5319M3724K6733K2049K5581K6108K8115K4795J9669N455
2030A07133385l0350l0632M906J7624K2888J7761l883j4717k4079k2102r842O958M1008
2043A07108925M7020L1303J3611j9356l4431m6539k9229L9482M5037j1017k0477K548
2055A07126877N935N372r896n6556n7175r369k14k4154j6373K5124K7420r774j2611
2068A06994606K0004R629m3343o2279n6289o5659r3124q7647m6371l1975k4483m1244
$$ y = [105872154, 105953857, 106033943, 106098030, 106151726, 106193329, 106230232, 106273415, 106310196, 106320572, 106337379, 106396675, 106468674, 106536407, 106597542, 106635857, 106675957, 106752541, 106818863, 106832214, 106815079, 106762787, 106713959, 106717918, 106737709, 106752586, 106763077, 106755302, 106751656, 106773354, 106809875, 106870674, 106916855, 106897545, 106858131, 106823685, 106804276, 106826111, 106865837, 106911156, 106954880, 106981613, 107003662, 107029243, 107055351, 107083466, 107108261, 107127930, 107133385, 107103035, 107072403, 107077309, 107094933, 107117821, 107135582, 107131699, 107116982, 107092903, 107070801, 107060959, 107067917, 107108925, 107155945, 107187248, 107200859, 107181503, 107147072, 107100533, 107071304, 107110786, 107155823, 107144806, 107124329, 107126877, 107132812, 107138184, 107128288, 107071732, 107014557, 107005188, 107004974, 106980820, 106964447, 106989571, 107016991, 107007217, 106994606, 107014610, 107024239, 106980896, 106918617, 106862328, 106796669, 106703545, 106615898, 106569527, 106537552, 106513069, 106471825]
2080A06471825j00327j12419p9033q3687j08787j41266j93688k28981k53936k78473
2090A04891228k90062l29041l98155m46297m88281n16251n39733n28473m92554m22264
2100A00440117l13591j92474m4991R8900K65739L79250M61151N00610M81201M79409
2110A02555321M85756M61601M11224L56102K75399K30690K14004J95694J89972J69426
2120A05545189J32103J12823J06285R8587R5368Q7784P2387P1549R2316Q4091M9751
2131A06548233K8015L464j099J4946K6299M7706M5136J2352Q270L0686K9205M532L982
2144A06801727K5414L0014K6657J8425p866k548M1511M5914J5213R415K3224J7738
2156A07044838m128j5228k4086k3956k0126J693O2371O3850O149j2802j7265q484K9182
$$ y = [106471825, 106371498, 106259079, 106180046, 106096359, 105987572, 105846306, 105652618, 105423637, 105169701, 104891228, 104601166, 104272125, 103873970, 103427673, 102939392, 102423141, 101883408, 101354935, 100862381, 100440117, 100126526, 99934052, 99889061, 99987961, 100253700, 100632950, 101094101, 101594711, 102075912, 102555321, 103041077, 103502678, 103913902, 104270004, 104545403, 104776093, 104990097, 105185791, 105375763, 105545189, 105677292, 105790115, 105896400, 105994987, 106090355, 106178139, 106250526, 106322075, 106414391, 106498482, 106548233, 106576248, 106579712, 106578613, 106593559, 106619858, 106667564, 106712700, 106725052, 106733322, 106764008, 106793213, 106797745, 106801727, 106827141, 106857155, 106883812, 106902237, 106894371, 106891823, 106933334, 106979248, 106994461, 107003876, 107027100, 107044838, 107040710, 107025482, 107001396, 106977440, 106957314, 106959007, 107021378, 107085228, 107091377, 107078575, 107061310, 107052826, 107082008]
2169A07082008L4211J2161K197p439r063o64J884M05L189J1398J1872P202r2j9096
2183A07130173j6335J0109J8974J9722J5809n96j602J0659J6525K5963J8478j5930
2195A07231949j6876J4778K1934J7403O988j9554k7267k6970j0490M1770M2939p744
2207A07268860k0363j1948m501J1131K0050L2685K1866k8916k6634L2257M0436J0231
2219A07345154n27J023j4519n8914n5954o722J6686L7193L5027j816n745K2102J8357
2232A07331345k0287j7525L1136L1258j1467k5536k3529k6611l5569k6107J0940J4519
2244A07232567r392k3720m6997m2320o531J0758K6771K1889j4404k0600p553O653L5278
2257A07162399M3373L8506K5154r300j9173j0109n478L266M959l319J099J7593K5894
$$ y = [107082008, 107116219, 107128380, 107130577, 107123138, 107114075, 107113411, 107115295, 107115700, 107118889, 107130287, 107142159, 107149361, 107149269, 107130173, 107113838, 107123947, 107142921, 107162643, 107178452, 107177856, 107176254, 107186913, 107203438, 107229401, 107247879, 107231949, 107215073, 107229851, 107251785, 107269188, 107276176, 107256622, 107229355, 107202385, 107191895, 107233665, 107276604, 107268860, 107248497, 107236549, 107232048, 107243179, 107263229, 107295914, 107317780, 107288864, 107262230, 107294487, 107334923, 107345154, 107344627, 107345650, 107331131, 107272217, 107216263, 107209541, 107226227, 107263420, 107298447, 107296631, 107290886, 107312988, 107331345, 107311058, 107293533, 107324669, 107355927, 107344460, 107318924, 107295395, 107268784, 107233215, 107207108, 107218048, 107232567, 107223175, 107199455, 107152458, 107110138, 107103607, 107114365, 107141136, 107163025, 107148621, 107128021, 107120468, 107127121, 107162399, 107205772, 107244278, 107269432, 107260132, 107240959, 107230850, 107225372, 107228638, 107233597, 107230278, 107231377, 107248970, 107274864]
2270A07274864L6308K7665j526k4414o4522n4619K1767L1181k0218k3697J5999Q873
2282A07227661m7111n3887k0622q919n600k029q034O935N4291N7625J9813N600O03
2295A07226326k724m005K647K2461K8351K7298J8188q651j3710L433J381q515l0517
2308A07261963q0986r0576p4387m1458M3266M8447l7308l7407K8252O2630R9395J00594
2320A07282425O1653L8742R369P103M7424L4523k4864o1874j04279j09863q0780n0591
2332A07048988O745K0340j2520j0155K6154J9767l5934l8094J2421J6045j4374l0830
2344A07008553p9773k3415J73523K32147K15645J50185j6358j02043j69327j50512
2354A07238625j5755M7684R1476R6230N6762J3092o8954r2766o6589n4215k4605l8246
$$ y = [107274864, 107311172, 107338837, 107337311, 107312897, 107248375, 107193756, 107215523, 107246704, 107226486, 107202789, 107218788, 107227661, 107180550, 107126663, 107106041, 107097122, 107091522, 107089493, 107081459, 107088394, 107142685, 107200310, 107220123, 107225723, 107226326, 107223602, 107219597, 107222244, 107244705, 107273056, 107300354, 107318542, 107309891, 107296181, 107299614, 107300995, 107292480, 107261963, 107180977, 107090401, 107016014, 106974556, 107017822, 107066269, 107028961, 106991554, 107019806, 107082436, 107181831, 107282425, 107344078, 107382820, 107392189, 107399292, 107446716, 107481239, 107456375, 107394501, 107290222, 107180359, 107099579, 107048988, 107055733, 107076073, 107063553, 107053398, 107079552, 107099319, 107063385, 107025291, 107037712, 107053757, 107039383, 107008553, 106928780, 106905365, 107078888, 107311035, 107526680, 107676865, 107660507, 107558464, 107389137, 107238625, 107222870, 107270554, 107362030, 107458260, 107515022, 107528114, 107459160, 107366394, 107299805, 107245590, 107220985, 107182739]
2366A07182739j20926j09077M150K7802k3483j7548M7752L1372p7362r5062m1031k1667
2378A06787659j7411m50L4714L8055J3871n005l5500m3060l2761j8951J1139K0714
2390A06753014J5022R773m669n608J1376N653k8374k7900O538J4183J0536n668m7303
2403A06706573o1798o4804m6371R918K8153J9699J4732j434m73K0172K1690R567O41
2416A06656265j6403j3092K0241J6243k9663l1998J694J6067L0548K2553k2057k4368
2428A06626030J6884J7692k0362j9913J2207K5802L8979K9160j6213k4559j472K594
2440A06686829o363j770J8097J9508M578j549o966m509R590J3016J2802L220k6611
2453A06719872k7489n531J4404N6816M8302k2171l7056r270m913j1849j2520j2298
$$ y = [107182739, 107061813, 106952736, 106956886, 106984688, 106961205, 106943657, 106991409, 107022781, 106945419, 106850357, 106809326, 106787659, 106770248, 106769798, 106804512, 106842567, 106856438, 106851433, 106815933, 106772873, 106740112, 106721161, 106732300, 106753014, 106768036, 106777809, 106773140, 106767532, 106778908, 106784561, 106756187, 106728287, 106734825, 106749008, 106759544, 106753876, 106706573, 106644775, 106579971, 106533600, 106543518, 106571671, 106591370, 106606102, 106604668, 106604195, 106624367, 106646057, 106655624, 106656265, 106639862, 106626770, 106647011, 106663254, 106633591, 106601593, 106603287, 106619354, 106649902, 106672455, 106650398, 106626030, 106642914, 106660606, 106640244, 106620331, 106632538, 106658340, 106697319, 106726479, 106710266, 106685707, 106684235, 106686829, 106680466, 106678696, 106696793, 106716301, 106720879, 106719330, 106712364, 106707855, 106717445, 106730461, 106743263, 106746483, 106719872, 106692383, 106686852, 106701256, 106758072, 106806374, 106784203, 106747147, 106737877, 106732964, 106721115, 106708595, 106696297]
2465A06696297p347R658N318k3537l0967k8298j6479J5854K4177J3878P866k815n387
2478A06658218J168l05r179j0994k815j1108l7644m9164n9486m6684m6J5640J4092
2491A06461693M982k6581l0998q538p934l0518k2484J9600K7985J2329J526j7311k1530
2504A06362221j0826r079j1971j3306j9454j1254J7334K2888J3520M5l4332l3211R491
2517A06282066J2848j3946k6749m5181l4973R681L1136M9110M2298k167j1734P942
2529A06300331O745q507j5213k1271j7883p10L792k602n49J5472L838m3701n2597l5591
2543A06131554j6381K1767L5385L5019K1866j7861l0517k5009j9547l082j877j8814
2555A06112503j6548P248N607k4444k4124L219J1917J5671N173k9205l9772l6026k7962
$$ y = [106696297, 106688950, 106698608, 106703926, 106680389, 106649422, 106621124, 106604645, 106620499, 106644676, 106658554, 106666420, 106663605, 106658218, 106659386, 106659081, 106649902, 106638908, 106636093, 106624985, 106587341, 106538177, 106478691, 106432007, 106431961, 106447601, 106461693, 106466675, 106440094, 106409096, 106400558, 106392624, 106362106, 106339622, 106359222, 106387207, 106399536, 106401062, 106383751, 106362221, 106351395, 106342316, 106330345, 106317039, 106297585, 106286331, 106303665, 106326553, 106340073, 106340118, 106305786, 106272575, 106282066, 106294914, 106280968, 106254219, 106209038, 106174065, 106183746, 106214882, 106263992, 106306290, 106304123, 106292389, 106300331, 106307076, 106298569, 106283356, 106262085, 106244202, 106243492, 106247284, 106244682, 106244133, 106259605, 106263443, 106219742, 106167145, 106131554, 106115173, 106136940, 106172325, 106207344, 106229210, 106211349, 106180832, 106155823, 106136276, 106133194, 106131317, 106112503, 106095955, 106103203, 106108810, 106084366, 106060242, 106063461, 106075378, 106091049, 106096222, 106067017, 106027245, 105991219, 105963257]
2568A05963257K693p492p0732p4822k6435j1162j1467j2017k3437j8593N509R559m005
2581A05720856n844R07p17k59k2842q2634r8114q8837n8411K6634L5904k8251m4823
2594A05353569m2061k8061K0363J8265l2570n4573p7202o0318J3992L3760J2047Q553
2606A05165764K0126k13p2503o9671J5091K7183j8242k7366j3710j7311l4142m0436
2618A04934570l9863m1748m3030m6921o0966n2025j8547%J6617J8791N386o554k9403
2631A04636307l0846r277l861j4160l006L6118L9940J4991j808k9922k8588J1063J2756
2644A04629707k4864k0416K7138L2188%m868J2375P821j4596k6725l8643l8460k3483
2657A04517174j6312j0681r155j2108j5640k7085k1339N363J2612Q941L59k0310l0548
$$ y = [105963257, 105965950, 105958458, 105887726, 105812904, 105786469, 105775307, 105763840, 105751823, 105728386, 105709793, 105715302, 105724861, 105720856, 105715012, 105715919, 105715202, 105714943, 105692101, 105609467, 105511353, 105422516, 105364105, 105390739, 105426643, 105398392, 105353569, 105311508, 105283447, 105303810, 105322075, 105289505, 105234932, 105157730, 105097412, 105111404, 105145164, 105157211, 105165764, 105185890, 105185677, 105113174, 105043503, 105058594, 105085777, 105067535, 105040169, 105026459, 105009148, 104975006, 104934570, 104894707, 104852959, 104809929, 104763008, 104702042, 104650017, 104631470, 104631470, 104648087, 104666878, 104672264, 104665710, 104636307, 104605461, 104596184, 104592323, 104578163, 104575157, 104611275, 104651215, 104666206, 104664398, 104634476, 104605888, 104616951, 104629707, 104604843, 104584427, 104611565, 104643753, 104643753, 104638885, 104651260, 104659081, 104644485, 104617760, 104579117, 104540657, 104517174, 104500862, 104490181, 104481026, 104468918, 104453278, 104426193, 104404854, 104410217, 104422829, 104431770, 104432129, 104411819, 104381271]
2670A04381271l8314l4379j2084p485j9913j6044M6J0993K9854K1668j8883l5789m2176
2683A04218765m1862k7611k4582k9678l0449l0350k7916k3819j7097l792p86o821j0063
2696A03943939q224k2644o9023o3256J763J3374j3893k5582l5743m2916m3991n3070
2708A03580734p9246p2411k8084j4404k0546k1606j9570l1616o9618o9115l0998j6449
2720A03107071j0155j2375l0449l4782l7361k0126L7651L4713k6466n4741q1421p2548
2732A02799011r826o64m0322m0603r033m052k2987j8066Q743J7334K3415M173n5886
2745A02651237p1929n3597m7180m9568k7039L7285M1916j0803k9106l2998l4622k5749
2757A02347847k7130m3915l5026R323Q728l6454m7378l6308l3257l3737k5986l029
$$ y = [104381271, 104342957, 104308578, 104296494, 104289009, 104269096, 104253052, 104253098, 104264091, 104293945, 104315613, 104296730, 104260941, 104218765, 104176903, 104149292, 104124710, 104095032, 104064583, 104034233, 104006317, 103982498, 103965401, 103961609, 103960823, 103954002, 103943939, 103935715, 103913071, 103844048, 103780792, 103782555, 103795929, 103782036, 103756454, 103720711, 103677795, 103633804, 103580734, 103501488, 103429077, 103400993, 103386589, 103366043, 103344437, 103324867, 103293251, 103223633, 103154518, 103123520, 103107071, 103096916, 103084541, 103054092, 103019310, 102981949, 102961823, 102999474, 103034187, 103007721, 102952980, 102871559, 102799011, 102789185, 102788521, 102748199, 102707596, 102698563, 102694511, 102671524, 102653458, 102662201, 102679535, 102702950, 102707123, 102651237, 102579308, 102525711, 102478531, 102428963, 102401924, 102439209, 102481125, 102470322, 102441216, 102408218, 102373596, 102347847, 102320717, 102276802, 102241776, 102251099, 102259827, 102223373, 102175995, 102139687, 102106430, 102072693, 102046707, 102043678]
2769A02043678m577l3432l8910k6299k5177k3048m0657q8188j04256j00929r1668n9104
2781A01407433n9510r4818j01166q6212q3351q3298q9790j09459j12343r9609r6634
2792A00391243j00113r7916q1779r6962j55640j64200j29913j17401j04996j14731
2802I9227592j59141j66039j35681j39168j76116j76957j49917j31798j02806j05332
2812I7784637j35803j66275k25044k26952j74949j42403r6466r5390j37947j71143
2822I6212265k24968k32368j87584j80886j90071k13958k78710k81120k11640k11792
2832I3999168k68074k93113l06252l17688l14194l38905l96492m25575m41605m44336
2842I0452934m17351m26895m69230m92974n20729n13603m67636m37614m13918l80569
$$ y = [102043678, 102039101, 102005669, 101966759, 101940460, 101915283, 101892235, 101851578, 101763390, 101659134, 101558205, 101466537, 101407433, 101347923, 101253105, 101151939, 101065727, 100982376, 100899078, 100809288, 100699829, 100587486, 100487877, 100391243, 100291130, 100193214, 100111435, 100014473, 99858833, 99694633, 99564720, 99447319, 99342323, 99227592, 99068451, 98902412, 98766731, 98627563, 98451447, 98274490, 98124573, 97992775, 97889969, 97784637, 97648834, 97482559, 97257515, 97030563, 96855614, 96713211, 96616745, 96521355, 96383408, 96212265, 95987297, 95754929, 95567345, 95386459, 95196388, 94982430, 94703720, 94422600, 94210960, 93999168, 93731094, 93437981, 93131729, 92814041, 92499847, 92160942, 91764450, 91338875, 90897270, 90452934, 90035583, 89608688, 89139458, 88646484, 88125755, 87612152, 87144516, 86706902, 86292984, 85912415]
2852H5912415l38410l00026k59491k27958k01149j85227j90475j69564j27433r1980
2862H3820702m3015l3447p1190p1838o0799k0882O6277J09886J19072J47842J92429
2873H4155037K13760K12265K25212K48124K61352K73209K70004K46002K37702K37823
2883H6580490K38922K52938K39349K01439J66221J09032J01563J46415J61530J80649
2893H8378548J50612N7006J0415r034l2524m8706p1907j05835j21475j14822j31058
2904H7961220j69655j87523j84608k04201k48505k65671k70393k56058k02514j97220
2914H5774872k36603k47818k50839k38655k13883j73332j00136o5231o1462m6639n3001
2925H4087273O179J63842K01248J19186J33225K20085K57042K72507K75306K42897
$$ y = [85912415, 85574005, 85273979, 85014488, 84786530, 84585381, 84400154, 84209679, 84040115, 83912682, 83820702, 83777687, 83744240, 83673050, 83601212, 83540413, 83519531, 83585808, 83695694, 83814766, 83962608, 84155037, 84368797, 84581062, 84806274, 85054398, 85315750, 85588959, 85858963, 86104965, 86342667, 86580490, 86819412, 87072350, 87311699, 87513138, 87679359, 87788391, 87889954, 88036369, 88197899, 88378548, 88529160, 88586166, 88596581, 88587547, 88555023, 88506317, 88434410, 88328575, 88207100, 88092278, 87961220, 87791565, 87604042, 87419434, 87215233, 86966728, 86701057, 86430664, 86174606, 85972092, 85774872, 85538269, 85290451, 85039612, 84800957, 84587074, 84413742, 84313606, 84248375, 84186913, 84140274, 84087273, 84093452, 84257294, 84458542, 84577728, 84710953, 84931038, 85188080, 85460587, 85735893, 85978790]
2935H5978790K56378L15018L40508L44825L58109L88046L73558L07007K79762K75139
2945H9217140K68410K65884K67006K77779K74422K60398K45476K13097K19559K70248
2955I1779419K87109K89559K77656K40830K21061K06261K02744K13768K19803K31216
2965I4169426K25922K05711J85318J53404J40358J51253J35368Q3756Q2878J34659
2975I5668053J44912J39946J08391K6390K90K0241J8928R560O554J3733J434k7443
2987I6130989n4909q7333j17493j54877j69082j47965j70662k40349k65289k65236
2997I4457794k53158k22870j86035j29845r4154o7444n5962o2080p0168q1276j07124
3008I3127678j44981j94077k64496l16788l35502m21860n50629p21763r77989j148537
$$ y = [85978790, 86235168, 86550186, 86890694, 87235519, 87593628, 87981674, 88355232, 88662239, 88942001, 89217140, 89485550, 89751434, 90018440, 90296219, 90570641, 90831039, 91076515, 91289612, 91509171, 91779419, 92066528, 92356087, 92633743, 92874573, 93095634, 93301895, 93504639, 93718407, 93938210, 94169426, 94395348, 94601059, 94786377, 94939781, 95080139, 95231392, 95366760, 95450516, 95533394, 95668053, 95812965, 95952911, 96061302, 96087692, 96087982, 96108223, 96127151, 96136711, 96143265, 96156998, 96158432, 96130989, 96076080, 95988747, 95871254, 95716377, 95547295, 95399330, 95228668, 94988319, 94723030, 94457794, 94204636, 93981766, 93795731, 93665886, 93571732, 93504288, 93448326, 93386246, 93316078, 93234802, 93127678, 92982697, 92788620, 92524124, 92207336, 91871834, 91449974, 90899345, 90177582, 89199593, 88051056]
3018H8051056j292084j344780j319237j229072j066544q49296n32669k77977m7089
3027H0092308J68633L81713N33219O29165P04194P41577P73521Q02902P85996P15423
3037H6328651O64139O18119N60264M90234M26293L74840K91923J83151O9710o4224
3047H9943100j76811k74681l73391m87014n43930n52658n50866n39970m76784l61587
3057H5605408k36824r1576P2647K83142M32160N59570O13235N73990N70511N94002
3067H8976265N50842M54521L44391J90476P3074q896j31676l05984m12849n03037m92714
3078H8734413l89007k47429k5772J62269L77106M90738N17387N27817N02274M48730
3088I1098526L41743K74926K32643J83418J38764Q3847J3137l6666p4746j01257j11008
$$ y = [88051056, 86758972, 85414192, 84094955, 82865883, 81799339, 80950043, 80417374, 80139397, 80092308, 80260941, 80642654, 81175873, 81805038, 82509232, 83250809, 84024330, 84827232, 85613228, 86328651, 86992790, 87610909, 88171173, 88661407, 89087700, 89462540, 89754463, 89937614, 90007324, 89943100, 89766289, 89491608, 89118217, 88631203, 88087273, 87534615, 86983749, 86443779, 85966995, 85605408, 85368584, 85277008, 85349655, 85632797, 86064957, 86624527, 87237762, 87811752, 88382263, 88976265, 89527107, 89981628, 90326019, 90516495, 90589569, 90580673, 90448997, 90143013, 89730164, 89227127, 88734413, 88345406, 88097977, 88072205, 88234474, 88611580, 89102318, 89619705, 90147522, 90649796, 91098526, 91440269, 91715195, 91947838, 92131256, 92270020, 92353867, 92367004, 92330338, 92255592, 92154335, 92043327]
3099I2043327j24885j50749j36376q5358l5781K9609P9773J35422J44676J01303Q2039
3110I2083000P4646N1262Q133j1993j2925k2171l1593m6516o8375q6426j06979j15662
3122I1714401j07956j16348j47079j42975r4849r6748j44120j61224j68869j59668
3132I0374565j16661j15059j57997j58028j21353j10817j05308j26725k01171k02538
3142H8958908j21170j21872j98250k11479j78741j70472j75499j68342j45485j46843
3152H7320755j77834j77124j47247j39496j42143j50993j75644j82007j72737j71471
3162H5684059j71371j76529j89972j95648k07207j86134j17279r9801j10221j43479
3172H4086418k31171k52128k17369k04346j95862j83510j62078j61095j83182j88682
$$ y = [92043327, 91918442, 91767693, 91631317, 91545959, 91510178, 91539787, 91619560, 91754982, 91899658, 92000961, 92083000, 92157646, 92208908, 92217041, 92205048, 92192123, 92169952, 92138359, 92091843, 92023468, 91937042, 91830063, 91714401, 91606445, 91490097, 91343018, 91200043, 91105194, 91008446, 90864326, 90703102, 90534233, 90374565, 90257904, 90142845, 89984848, 89826820, 89705467, 89594650, 89489342, 89362617, 89161446, 88958908, 88837738, 88715866, 88517616, 88306137, 88127396, 87956924, 87781425, 87613083, 87467598, 87320755, 87142921, 86965797, 86818550, 86679054, 86536911, 86385918, 86210274, 86028267, 85855530, 85684059, 85512688, 85336159, 85146187, 84950539, 84743332, 84557198, 84439919, 84340118, 84229897, 84086418, 83855247, 83603119, 83385750, 83181404, 82985542, 82802032, 82639954, 82478859, 82295677, 82106995]
3182H2106995j83442j84150j91284j86516j63178j66603j97647k07710k08740k01699
3192H0216026j75979j73210j92330j96266j90331j90498j95503j94595j88782j84891
3202G8333641j78963j80290j86439j98128k26425k26593j93573j92360k25159k18201
3212G6307510j75216j55281j41526j42646j61286j78245k02202k17941k37534k27882
3222G4467751j74973j67892k05826k03163j71875j49605j06575j24314k15309k48314
3232G2699905k59399k35680j45271j28792j83052j80580j31897j22353j35330j52107
3242G1025444j92497j96106j57929j58477j91971k01126j99463j90399j64658j56021
3252F9216797j63529j57569j41602j31485j16302j24001j60095j74881j78169j80436
$$ y = [82106995, 81923553, 81739403, 81548119, 81361603, 81198425, 81031822, 80834175, 80626465, 80417725, 80216026, 80040047, 79866837, 79674507, 79478241, 79287910, 79097412, 78901909, 78707314, 78518532, 78333641, 78154678, 77974388, 77787949, 77589821, 77363396, 77136803, 76943230, 76750870, 76525711, 76307510, 76132294, 75977013, 75835487, 75692841, 75531555, 75353310, 75151108, 74933167, 74695633, 74467751, 74292778, 74124886, 73919060, 73715897, 73544022, 73394417, 73287842, 73163528, 72948219, 72699905, 72440506, 72204826, 72059555, 71930763, 71747711, 71567131, 71435234, 71312881, 71177551, 71025444, 70832947, 70636841, 70478912, 70320435, 70128464, 69927338, 69727875, 69537476, 69372818, 69216797, 69053268, 68895699, 68754097, 68622612, 68506310, 68382309, 68222214, 68047333, 67869164, 67688728]
3262F7688728j76193j77025j85653j79726j59546j46271j32988j26480j24672j29204
3272F6150970j45790j49986j51352j36398q6380r0004j46645j70356j84197j82129
3282F4707733j66038j34583o0112n4733j19759j38313j34155j29269j11294j07696
3292F3551781j15727j19232j26030j21117r8583r7301j24142j12942n7838m8756p1193
3303F2458920r3483j46153j38832o0936m5277o9095r0885j39832j41003r3006p6458
3314F1363960p2288p6367r7370j04976j15513r4010k3674o771l3188m1439m0985n5549
3326F0601830r0073j01139r9182q6190m8015l9578o0844n7102l1517k6108l6884l8124
3338E9887074l7503l0182j4450k311K0408Q942m4110o4586p1144o3683l4332j4732
$$ y = [67688728, 67512535, 67335510, 67149857, 66970131, 66810585, 66664314, 66531326, 66404846, 66280174, 66150970, 66005180, 65855194, 65703842, 65567444, 65481064, 65391060, 65244415, 65074059, 64889862, 64707733, 64541695, 64407112, 64347000, 64292267, 64172508, 64034195, 63900040, 63770771, 63659477, 63551781, 63436054, 63316822, 63190792, 63069675, 62971092, 62873791, 62749649, 62636707, 62578869, 62530113, 62458920, 62365437, 62219284, 62080452, 62019516, 61974239, 61905144, 61814259, 61674427, 61533424, 61440418, 61363960, 61291672, 61215305, 61117935, 61012959, 60897446, 60803436, 60779762, 60772991, 60739803, 60698364, 60657379, 60601830, 60511757, 60410618, 60311436, 60225246, 60177231, 60137653, 60076809, 60019707, 59988190, 59962082, 59925198, 59887074, 59849571, 59819389, 59804939, 59802628, 59823036, 59831978, 59787868, 59723282, 59652138, 59588455, 59554123, 59539391]
3350E9539391J2943Q751l8719m4201j4496p679j6262j2276J240Q365R133J9314M6158
3363E9511662M4704J1299N386K2416K1026N818m54o581l54K8011K7111o535p869M268
3377E9659908M0009J31489J39782P0930L9482O127J3305P5672R1935P7011P2406O8497
3389F0486553O2229N4741M4487K0649K7943O6376R0980J27625J17492M7348K8637L6263
3401F1211323N8819J25572J30703P3456O2633O9855R9518J86252J86993R3983Q0967
3412F2380074J32392J36593J08219J00037R6253J07170J37374J57952J90857J77002
3422F3723923J01898Q2565R2407J20644J92261K17773K12044K04826J86562J65588
3432F5300491J27053J21925J49055J61744J73118J77124J73737J69082J56281J56761
$$ y = [59539391, 59552334, 59561085, 59522366, 59478165, 59463669, 59455990, 59439728, 59427452, 59428692, 59437057, 59446190, 59465504, 59511662, 59556366, 59567665, 59573051, 59595467, 59616493, 59622311, 59621857, 59615276, 59614922, 59642933, 59670044, 59663509, 59655640, 59659908, 59699917, 59831406, 59971188, 60042118, 60081600, 60087727, 60101032, 60176704, 60268639, 60345650, 60418056, 60486553, 60548782, 60603523, 60648010, 60668659, 60696602, 60762978, 60853958, 60981583, 61099075, 61146423, 61175060, 61211323, 61270142, 61395714, 61526417, 61599873, 61662506, 61732361, 61831879, 62018131, 62205124, 62299107, 62380074, 62512466, 62649059, 62757278, 62857315, 62953568, 63060738, 63198112, 63356064, 63546921, 63723923, 63825821, 63908386, 64000793, 64121437, 64313698, 64531471, 64743515, 64948341, 65134903, 65300491, 65427544, 65549469, 65698524, 65860268, 66033386, 66210510, 66384247, 66553329, 66709610, 66866371]
3442F6866371J67183J79245K02484K06803J94000J86683J70517J79863K25213K30072
3452F8808434J96289J92695K13143K13241J92116J97433K29386K39349K37274K31888
3462G0951248K13028K12570K28356K37114K46185K49367K46071K44545K42256K41089
3472G3311829K43850K37160K21207K08473J83868J95259K47864K72652K90108K87201
3482G5699471K56370K40830K31216K21565K04064K15553K67197K77374K53410K47391
3492G8114441K51190K44881K36870K13050J44700J60667K67746L09822L30643L11348
3502H0585358K31842J91284J55830J61576K19726K49291K75230K78519K56965K38160
3512H2843781K05993J97029K06520K16767K51175K33673J54426J28579J31202J46576
$$ y = [66866371, 67033554, 67212799, 67415283, 67622086, 67816086, 68002769, 68173286, 68353149, 68578362, 68808434, 69004723, 69197418, 69410561, 69623802, 69815918, 70013351, 70242737, 70482086, 70719360, 70951248, 71164276, 71376846, 71605202, 71842316, 72088501, 72337868, 72583939, 72828484, 73070740, 73311829, 73555679, 73792839, 74014046, 74222519, 74406387, 74601646, 74849510, 75122162, 75412270, 75699471, 75955841, 76196671, 76427887, 76649452, 76853516, 77069069, 77336266, 77613640, 77867050, 78114441, 78365631, 78610512, 78847382, 79060432, 79205132, 79365799, 79633545, 79943367, 80274010, 80585358, 80817200, 81008484, 81164314, 81325890, 81545616, 81794907, 82070137, 82348656, 82605621, 82843781, 83049774, 83246803, 83453323, 83670090, 83921265, 84154938, 84309364, 84437943, 84569145, 84715721]
3522H4715721J99104K06665J71540J66534J87279J78337J27747J38496K33101K18368
3532H6542892Q6739O1653J25977J24572P6272O0752N9914O6422R0644R8137R5322R0645
3544H7579941P8491P2548O5231P3006R8205J14869J36680J34636J08696Q7647M2648
3555H8592598O0272J59455J77696J37970J10702O2889N5985O9618J23451K53128K96166
3566I0099930K69958K67365K72774K55394K02110J96144K34627K45552K49000K36489
3576I2529343J85417J94481K69554K88109K75345K52937J83327J94686K87941L31353
3586I4992493L54316L70789L80035L70842L35953L15476K97233K89513K98141K91275
3596I8296066K62146K69654L28155L21053K51869K22847K05589K11380K62497K58255
$$ y = [84715721, 84914825, 85121490, 85293030, 85459564, 85646843, 85825180, 85952927, 86091423, 86324524, 86542892, 86629631, 86691284, 86817261, 86941833, 87018105, 87078857, 87138771, 87205193, 87295837, 87393974, 87489296, 87579941, 87658432, 87730980, 87796211, 87869217, 87967422, 88082291, 88218971, 88353607, 88462303, 88549950, 88592598, 88652870, 88812325, 88990021, 89127991, 89238693, 89301582, 89357567, 89427185, 89550636, 89803764, 90099930, 90369888, 90637253, 90910027, 91165421, 91367531, 91563675, 91798302, 92043854, 92292854, 92529343, 92714760, 92909241, 93178795, 93466904, 93742249, 93995186, 94178513, 94373199, 94661140, 94992493, 95346809, 95717598, 96097633, 96468475, 96804428, 97119904, 97417137, 97706650, 98004791, 98296066, 98558212, 98827866, 99156021, 99477074, 99728943, 99951790, 100157379, 100368759, 100631256, 100889511]
3606A00889511K01584J81389J83731J75308J56189J59210K03186J79932P5890N3329
3616A02459259Q0185J22307K19253K46857K27638J95748J36657P3983j7861o0173j01662
3627A03582191k6611K34963K87437J66779J24450J00777Q2901Q6426O1661m12j4138
3638A04686424J2879K5177M3342M0314K2560r064o3202j06262j97891j33369J11625
3649A04432533K34894L33901L20838J52855Q8883O7039P5768J42410J68991J85707
3659A06203819J69731J08765P4768N5023K8115N668l7712j39618j24572J0940P7339
3670A06432266J72119R4864k78900k50885J70990L19794L58887L01605M7584j5449
3680A07352875O5635R0577J42692Q8860q7090j87591l16765k55890M0268J71852K33841
$$ y = [100889511, 101091095, 101272484, 101456215, 101631523, 101787712, 101946922, 102150108, 102330040, 102405930, 102459259, 102539444, 102661751, 102881004, 103127861, 103355499, 103551247, 103687904, 103761887, 103744026, 103683853, 103582191, 103555580, 103790543, 104077980, 104244759, 104369209, 104469986, 104552887, 104639313, 104700974, 104700562, 104686424, 104699303, 104724480, 104767822, 104808136, 104830696, 104821632, 104758430, 104652168, 104454277, 104320908, 104432533, 104667427, 105001328, 105322166, 105475021, 105563904, 105630943, 105706711, 105849121, 106018112, 106203819, 106373550, 106482315, 106557083, 106612106, 106640221, 106645889, 106608177, 106468559, 106343987, 106354927, 106432266, 106604385, 106699249, 106420349, 106169464, 106340454, 106660248, 107019135, 107320740, 107368324, 107352875, 107418510, 107509087, 107651779, 107740639, 107653549, 107465958, 107149193, 106893303, 106933571, 107105423, 107339264]
3691A07339264K46071J82174J27747M6036j717j5472n6648j44097j41029n6908R155
3702A07534576J07171J36062J24809N8487j12770j74980j85203j29242M2511J17248
3712A07518669J42983J40449Q6167N3146K3460m410l5743m8065l9650l9956n9700k6916
3724A07710434P0763J11557J42425R7275n5931j22978j49964j46888j04477n0141L2952
3735A07535027J04789K10831K08900J17234M837j94428k85103l72314k31125K91802
3745A07390450L57864J8768r3696j49872j00212J23977J98227J87371J56471O7573
3755A08156921P386p3525o4255N4429R4657J07026P6652l5171n9006M196j1421j12534
3767A08145355j06621o485M6395J00326J03241M6318J6671l601l0350q5045o6139M8423
$$ y = [107339264, 107585335, 107767509, 107895256, 107941292, 107939575, 107924103, 107867455, 107723358, 107582329, 107525421, 107534576, 107641747, 107777809, 107902618, 107961105, 107848335, 107673355, 107488152, 107358910, 107401421, 107518669, 107661652, 107802101, 107888268, 107941414, 107964874, 107960464, 107924721, 107876656, 107837006, 107797050, 107737350, 107710434, 107781197, 107892754, 108035179, 108132454, 108076523, 107953545, 107803581, 107656693, 107552216, 107502075, 107535027, 107639816, 107850647, 108059547, 108176781, 108181618, 107987190, 107702087, 107329773, 107098648, 107390450, 107748314, 107767082, 107673386, 107523514, 107423302, 107547279, 107745506, 107932877, 108089348, 108156921, 108164307, 108090782, 108026527, 108080956, 108175613, 108282639, 108359291, 108324120, 108265114, 108269310, 108257889, 108145355, 108038734, 108032249, 108078644, 108178970, 108282211, 108328529, 108345200, 108341599, 108311249, 108226204, 108160065, 108208488]
3779A08208488O8688J4328l502k7756J839J19186J28075L6575Q324K3628k510p0618
3791A08504745r3597q4282p8827p4478m6043M3274K0980j52725j46293L5232Q0208
3802A08008194N6549L983j77407j28029J87561K67624J93024J41983O9069k2224j82580
3813A08417747k12791j29387o5780P6560L6858k69417k43614J08650K10953J70494
3823A08100273J34796K0150J3801J42532J12008p6775j33629j10672r0004j7883k7466
3834A08067131j44791j32537L265M9354L7049N4100Q0086J08665J64772J54976Q2779
3845A08524849K7512k6635r5794j73714k69386m88854l99162M1321K33078L29681L16147
3856A08019043J34232L1753o8428j05759p7057n5748j7974J4213P1236N3238o1226
$$ y = [108208488, 108277176, 108291504, 108288002, 108260246, 108262085, 108381271, 108509346, 108545921, 108554245, 108577873, 108575363, 108504745, 108411148, 108326866, 108248039, 108173561, 108127518, 108170792, 108191772, 108039047, 107892754, 107927986, 108008194, 108064743, 108068726, 107891319, 107763290, 107950851, 108218475, 108411499, 108553482, 108622551, 108600327, 108417747, 108204956, 108075569, 108009789, 108086349, 108123207, 107853790, 107610176, 107718826, 107929779, 108100273, 108235069, 108255219, 108269020, 108411552, 108523560, 108446785, 108313156, 108202484, 108112480, 108094597, 108067131, 107922340, 107789803, 107793068, 107842422, 107879471, 107933571, 108013657, 108122322, 108287094, 108442070, 108524849, 108552361, 108525726, 108429932, 108256218, 107986832, 107497978, 107098816, 107140137, 107373215, 107702896, 108019043, 108153275, 108185028, 108116600, 108010841, 107933784, 107878036, 107860062, 107874275, 107945511, 107998749, 107937523]
3867A07937523q6685n1857k7535K1904K4536m2152j6518J33896J17439p5645j14632
3878A07820274n5816n005J15730J00250q2657j02256Q629N0422Q9073O0349q8501q2428
3890A07828064P5912J22071J24099P4028p1235j31470j41571j42334j18706r0431n2261
3901A07476166n676N6694J06597J77811J63391M3602M196Q202J7670N9959O3538L7384
3913A08209534J6952j6090k3888p965l36J9455J435o9886q2679n7007k4697M2840O2873
3926A08070541N3360K4842n7793o4636j4450L7574J38855J54664J02325M7188n0972
3937A08441498r6947j11839j06407p5486k9152P7149P5081m8668p2571k9495r674P507
3949A08020996K9564O2279P4859Q1589N6213k0835m5205l6575k0599K6184L5499Q561
$$ y = [107937523, 107850838, 107798981, 107771446, 107793350, 107817886, 107775734, 107759216, 107893112, 108010551, 107934906, 107820274, 107764458, 107759453, 107875183, 107975433, 107892776, 107790520, 107799149, 107849571, 107938644, 107998993, 107910492, 107828064, 107903976, 108026047, 108150146, 108224174, 108152939, 108021469, 107879898, 107737564, 107618858, 107528427, 107476166, 107470490, 107527184, 107633781, 107811592, 107974983, 108018585, 108022781, 108030983, 108048653, 108108612, 108172150, 108209534, 108226486, 108210396, 108186508, 108178543, 108178207, 108197662, 108199097, 108129211, 108046532, 107989525, 107964828, 108007668, 108070541, 108123901, 108148743, 108090950, 108026314, 108011864, 108049438, 108188293, 108342957, 108445282, 108492470, 108441498, 108344551, 108232712, 108126305, 108050819, 108021667, 108098816, 108173897, 108125229, 108052658, 108023163, 108013489, 108020996, 108050560, 108112839, 108187698, 108269287, 108325500, 108304665, 108259460, 108222885, 108202286, 108228470, 108263969, 108272530]
3961A08272530Q606L1776L0258L792J121L0419J0185o9832q7455o7231l3378M4319
3973A08175110O9046N9959L7194k5650m3129k9877j2970L1326L4981R31j4641m1267
3985A08241013j6983Q9408R1195n310l8987m8805l9978N531K0691K5437O988n3856
3997A08276344o7596l8857l8673
4000A08131218
$$ y = [108272530, 108281136, 108312912, 108343170, 108346962, 108348083, 108378502, 108388687, 108318855, 108231400, 108164169, 108130791, 108175110, 108244156, 108304115, 108341309, 108315659, 108272530, 108242653, 108229683, 108261009, 108295990, 108296921, 108282280, 108241013, 108224030, 108313438, 108404633, 108399323, 108360336, 108311531, 108271553, 108277084, 108297775, 108323212, 108330200, 108276344, 108208748, 108169891, 108131218]
##END=$$ End of the data block
