##TITLE=$$ Begin of the data block
##JCAMP-DX=5.00 $$ ACD/SpecManager v 10.08
##SPECTROMETER/DATA SYSTEM=16PC
##DATE=25 Jun 2013 10:43:02
##DATA TYPE=INFRARED SPECTRUM
##DATA CLASS=XYDATA
##ORIGIN=
##OWNER=
##NPOINTS=3601
##FIRSTX=400.00000000
##LASTX=4000.00000000
##MAXX=4000.00000000
##MINX=400.00000000
##MAXY=512.79064941
##MINY=10.00192070
##XFACTOR=1.0000000000
##YFACTOR=0.000001000000000
##FIRSTY=111.62788391
##DELTAX=1.00000000
##XUNITS=1/CM
##YUNITS=TRANSMITTANCE
##XYDATA=(X++(Y..Y))
400A11627884r4518896L8932657J9029690K2115349j4481209j6419769k421883K8058174
408I1921997J17193817R5745270n4943848r1008148m7684891k7890869M705590P694389
416I5733307k7120064k4545479J3429047J9567390k050972n07759K3468972K1872879
424A19847321j863144j3464432n3175923N707455K49569298K06170074j68747711k25914306
432A18128632k8107239K6514030K9798622J2509476q3849411n6057239J23418094J41227097
440B83582062J3311218j0746124N2766876J9419281j30337280j33878395J1925560
447A06043198L1931472n0100853n4067684l433563J5555740K1739766K6005867K8905777
455A22579720J7345161j9506569k5232986k765992L205491J946121J085968k982140
$$ plain form
400 111627884 17108988 56041645 75071335 97186684 82705475 66285706 63863823 91921997
408 91921997 209115814 304861084 249917236 158909088 111224197 83333328 88038918 95733307
416 95733307 68613243 44067764 57496811 77064201 75013229 74505470 97974442 119847321
424 119847321 117984177 104519745 51343822 57051277 306620575 512790649 344042938 118128632
432 118128632 90021393 116535423 146334045 158843521 74994110 18936871 142354965 283582062
440 283582062 296893280 286147156 338914032 358333313 227996033 94117638 106043198
447 106043198 137974670 87873817 33806133 30372570 45928310 67668076 93673943 122579720
455 122579720 139924881 120418312 95185326 92419334 95624825 97570946 98656914 95674774
463I5674774l459740o63467j25359r36965j200364j379608j516510j834038j398490
472H3160233R3055M94881j50482J32271J356124J493737P45636L36761j81907k39281
482H7241028K64763L58513L42796j4229j181061j052093N53398Q06496o0555j48033
492H7111023L12683L47138J18064n1094m24507k69195M97696Q11439J035423P80754
502I0269424k48718m79774R826m2038m87373o55960p12967o68022m44893l39050l37364
513H5863091j97106P3914K63931M57596N28045M37790M63623N94521N97763N50293
523H9633461L76945J68j94717l54721k77092J88660K37823n8601j80153k21581l24493
534H8825699n02701n59570m52065n48912q27934j009132j161408j289200j466125j393540
$$ plain form
463 95674774 92215034 91551567 91426208 90489243 89288879 87909271 86392761 84558723 83160233
472 83160233 83253288 83748169 83597687 83729958 85086082 86579819 87325455 87662216 87480309 87241028
482 87241028 87505791 87864304 88207100 88192871 87011810 85959717 86513115 87319611 87259056 87111023
492 87111023 87423706 87770844 87888908 87837814 87413307 87144112 87641808 88453247 89488670 90269424
502 90269424 90020706 89540932 89550758 89508720 89021347 88365387 87652420 86984398 86539505 86200455 85863091
513 85863091 85665985 85739899 86003830 86461426 86989471 87427261 87890884 88485405 89083168 89633461
523 89633461 90010406 90010574 89815857 89461136 89184044 89372704 89610527 89551926 89371773 89150192 88825699
534 88825699 88322998 87763428 87311363 86762451 85934517 84925385 83763977 82474777 81008652 79615112
544G9615112j048797q21167o67092l71460K1149M73930J070763J512909J998253K033974
554H3817574J562690J306656J091858Q91907P45842N23613J58935M6891J84516J88370
564I0518852J39122R7634K7824J2970P7980L9749j00876j64581j68610k23640l16307
575H9940117l89435m28314n49080p90665q81271p92717r09515j235039j371430j418014
585H1174637j375466j289749r76318m17641J31516Q34175J292847J695686J687500
594H2757187J201698Q59665M21982K24831K74322K09877O6498O4514K65785K02233
604H6548592j19500k58041k76802l63564m87640n84335p26036o88050m47128l21152
614H2276344p5081l31352j490524j328087M8859Q43902J735497J805977R30900N25521
$$ plain form
544 79615112 78566315 77745148 77078056 76706596 76727745 77201675 78272438 79785347 81783600 83817574
554 83817574 85380264 86686920 87778778 88670685 89416527 89940140 90099075 90145966 90330482 90518852
564 90518852 90657974 90755608 90783432 90796402 90874382 90914131 90813255 90648674 90480064 90256424 89940117
575 89940117 89550682 89122368 88573288 87782623 86901352 86108635 85199120 83964081 82592651 81174637
585 81174637 79799171 78509422 77533104 77115463 77246979 78081154 79374001 81069687 82757187
594 82757187 83958885 84818550 85240532 85465363 85739685 85949562 86016060 86080574 86346359 86548592
604 86548592 86429092 86171051 85894249 85530685 85043045 84458710 83732674 83044624 82597496 82276344
614 82276344 82201263 81869911 80379387 79051300 79100159 79944061 81679558 83485535 84416435 84941956
624H4941956K67463L0655j30081l08006n18372o06941o11832n35110l48259j63552
634H2017921O9787K60688M66294N48744N43289M46747J78909O3851Q1039j1589k07069
645H4458611k91443k87392l18260m10202l35335m242k670k47193m85969p68257j148987
656H0158661j810524j968506j762390j418945o54793l76679m48608n08164n30242r77921
666F9701889k208405k329849j389267j090549j043865j104714j523281j443554q67126
675E6701279o43971o46972n34794m10752k02942J41217L39485M25602N46596P27940
685E6442688P20718O81374K33032n74280j563881l002311m000473m993748n130005
694C8813114m513073l579807j909996p47849J63342J040840J874615K487205K864170
$$ plain form
624 84941956 85209419 85240074 85109993 84801987 84283615 83676674 83064842 82529732 82181473 82017921
634 82017921 82087708 82348396 82814690 83363434 83906723 84353470 84532379 84596230 84677269 84665680 84458611
645 84458611 84167168 83879776 83561516 83151314 82815979 82811737 82809067 82561874 82075905 81307648 80158661
656 80158661 78348137 76379631 74617241 73198296 72543503 72166824 71718216 71210052 70679810 69701889
666 69701889 67493484 65163635 63774368 62683819 61639954 60535240 59011959 57568405 56701279
675 56701279 56057308 55410336 54875542 54464790 54261848 54403065 54742550 55168152 55714748 56442688
685 56442688 57163406 57844780 58077812 57503532 55939651 52937340 48936867 43943119 38813114
694 38813114 34300041 30720234 28810238 28062389 28225731 29266571 31141186 33628391 36492561
703C6492561L240513L558422L814171M024796M125686M202462L977085L426387K921059
712F9783142K320168J816650J346428R72816O85357M62554K94022K42516L96537L39272
722G8659462J08192l0113j56807k14172j82915j98173k35176k58179k73918k91306
732G6926895l01933l30589l85788m09005m17610m00902l28376l32856m13276m41406
742G3165154m27582m58786n44457n60188n12192n00320m83536n26283o37085p17659
752F7797066q18352q36464q16444o83281m03214j86584L0922K02156L29513M50302
762F5065620N85007O14098N59326M53186K70134P9796j47988l62350n61661q03428
772F5751740j079773j364872j674225j971699k296852k527905k679489k814915k900550
$$ plain form
703 36492561 39733074 43291496 47105667 51130463 55256149 59458611 63435696 66862083 69783142
712 69783142 72103310 73919960 75266388 76239204 76924561 77387115 77681137 77923653 78320190 78659462
722 78659462 78767654 78737541 78580734 78366562 78183647 77985474 77750298 77492119 77218201 76926895
732 76926895 76624962 76294373 75908585 75499580 75081970 74681068 74352692 74019836 73606560 73165154
742 73165154 72737572 72278786 71734329 71174141 70661949 70161629 69678093 69151810 68514725 67797066
752 67797066 66978714 66142250 65325806 64642525 64239311 64052727 64083649 64285805 64615318 65065620
762 65065620 65650627 66264725 66824051 67277237 67547371 67627167 67479179 67116829 66555168 65751740
772 65751740 64671967 63307095 61632870 59661171 57364319 54836414 52156925 49342010 46441460
781D6441460l007721l142979l208900l243733l192209l060507k879288k622318k364109
790A9719696k083683j790715j448226j194811j026845q20398n88680m02951k91514
799A0071873o9952L35931M44627K34509K73323N15175N75614M67515N23495O64163
809A4036273Q74472J314879J358341J023150Q62955P29038O62398N91516P61341J245499
819B3459862J504471J669025J755379J588058J852490K624416K915382K908303K859829
828D3137215K701473K450420K055382J704262J277401J065349J034951J028015J134559
837E7589027J152520J085781J120567J249386J315758J376442J360649J271537J167298
846F8688965J033615Q69247O71868M51919J75194l1929j77238l56057n76301p10991
$$ plain form
781 46441460 43433739 40290760 37081860 33838127 30645918 27585411 24706123 22083805 19719696
790 19719696 17636013 15845298 14397072 13202261 12175416 11355018 10766338 10363387 10071873
799 10071873 10001921 10337852 10782479 11016988 11290311 11805486 12381100 12848615 13372110 14036273
809 14036273 14910745 16225624 17583965 18607115 19470070 20199108 20861506 21453022 22214363 23459862
819 23459862 24964333 26633358 28388737 29976795 31829285 34453701 37369083 40277386 43137215
828 43137215 45838688 48289108 50344490 52048752 53326153 54391502 55426453 56454468 57589027
837 57589027 58741547 59827328 60947895 62197281 63513039 64889481 66250130 67521667 68688965
846 68688965 69722580 70591827 71263695 71715614 71890808 71858879 71681641 71325584 70749283 70038292
856G0038292p95097q15682p51015p00882o74438n35347k75299o3942J74141L06602
866F5907333L30262L89930M59717M98390M97345N32105N82855O53152P48635Q42995
876G1442719R49127J041580J134895J196045J239350J240325J202202J136490J032738
885H1615471R21059P73551O71715O07132N32013M52133L92105L48923L09662K76756
895H6900520K53250K40708K29690K07497K34337L05176L79966M93058N47096N74348
905I0365646N43000M23835L65380L57460K91939J87805P7179o7765j67846k50885k85050
916I1840698k65175k43972j95191j71470j98197j21261O7451J81076K72270L17314
926I1483543L09517K99309K57561K50320K73415K77092K81692K55539J84174J57051
$$ plain form
856 70038292 69243195 68427513 67676498 66975616 66301178 65765831 65490532 65426590 65600731 65907333
866 65907333 66237595 66627525 67087242 67585632 68082977 68615082 69197937 69851089 70599724 71442719
876 71442719 72391846 73433426 74568321 75764366 77003716 78244041 79446243 80582733 81615471
885 81615471 82536530 83310081 83981796 84588928 85120941 85573074 85965179 86314102 86623764 86900520
895 86900520 87153770 87394478 87624168 87831665 88066002 88371178 88751144 89244202 89791298 90365646
905 90365646 90908646 91332481 91697861 92055321 92347260 92535065 92612244 92544479 92376633 92125748 91840698
916 91840698 91575523 91331551 91136360 90964890 90766693 90645432 90712883 90893959 91166229 91483543
926 91483543 91793060 92092369 92349930 92600250 92873665 93150757 93432449 93687988 93872162 94029213
936I4029213J77147J42715O7093j388q4687j43501j88736k16102k05422k41730l13926
947I3020676l81539m67468n20752n37018n85029o51314p21192q07380q73879r25728
957H6549377r79042j031402j076317j150681j113578r64714q46314p06985o10108n52154
967G7518082m84063m18067l54409k80761k46407k63641k34154j57616j33804j42166
977G4802994j65177j94549k81098m45648n54230o23847p20475q28933r44046j083512
987F8961479j181846j237153j322410j425293j522373j602482j734066j908756k091740
996E4935360k299690k500775k772236k836990k728771k589752k292561k204822k302788
1005C2406975k313854k324439k261709k141929j972889j733589j500250j234652j013421
$$ plain form
936 94029213 94206360 94349075 94416168 94414780 94330093 94186592 93997856 93781754 93576332 93334602 93020676
947 93020676 92639137 92171669 91650917 91113899 90528870 89877556 89156364 88348984 87475105 86549377
957 86549377 85570335 84538933 83462616 82311935 81198357 80233643 79387329 78680344 78070236 77518082
967 77518082 77034019 76615952 76261543 75980782 75734375 75470734 75236580 75078964 74945160 74802994
977 74802994 74637817 74443268 74162170 73716522 73162292 72538445 71817970 70989037 70044991 68961479
987 68961479 67779633 66542480 65220070 63794777 62272404 60669922 58935856 57027100 54935360
996 54935360 52635670 50134895 47362659 44525669 41796898 39207146 36914585 34709763 32406975
1005 32406975 30093121 27768682 25506973 23365044 21392155 19658566 18158316 16923664 15910243
1014A5910243q13436o50573n33128m12202k92039k04658j56021r0552j597K8443k4319
1025A2760161J7715J63245J99533J40714J42861J78528K01201K14004K50888L44086
1035A4612936L30377J94764J60289J96242K02107K12479J89256J25719Q6523N4882
1045A6365574L3165K7323J0919q796l4548p6128r1719q0275q7858j04069j24526j70064
1057A5658998j61911j01590o2060l0303J4234Q4495J08123J13392N9485q2493j56164
1068A5444206j79457k37012l40176l59225l00694k68483k39539k02370j55234j16897
1078A3045119q8453m7016K8086L1089m6324o5470l4309n9723j60718j54591m1533l623
1090A2402534j4067K003L2925N0187M4322Q1349J56426K22826K99359L57294L99947
$$ plain form
1014 15910243 15096807 14446234 13913106 13500904 13208865 13004207 12848186 12757634 12756037 12784480 12760161
1025 12760161 12777876 12941121 13140654 13281368 13424229 13602757 13803958 14017962 14268850 14612936
1035 14612936 14943313 15138077 15298366 15494608 15696715 15909194 16098450 16224169 16310692 16365574
1045 16365574 16398739 16426062 16436981 16428185 16393637 16317509 16225790 16145515 16057657 15953588 15829062 15658998
1057 15658998 15497087 15395497 15333437 15303134 15317368 15401863 15509986 15623378 15682863 15600370 15444206
1068 15444206 15264749 15027737 14687561 14328336 14027642 13759159 13519620 13317250 13162016 13045119
1078 13045119 12956666 12909650 12937736 12968825 12922501 12857031 12822722 12762999 12602281 12447690 12406157 12402534
1090 12402534 12388467 12390470 12423395 12473582 12517904 12599253 12755679 12978505 13277864 13635158 14035105
1101A4035105M42505M70662N26190O16885O69740O85381P34259Q01706Q75759R66572
1111B0824764J045395J117825J189853J263523J324486J377033J418187J444196J472880
1120C2478142J509952J514386J492454J460026J392864J372028J401020J384617J337979
1129D5343468J295402J240540J204368J189972J153946J098755J057957J024986R92344
1138E5601738R65904R29405Q76690Q48484Q49961Q19397P54524P26128P35427P06482
1148F3814140O48308O00647N68077M92577L63327K81334J91185K13432L50311M72092
1158F7995430O55914P22718O97059O59592N74875N03921M29009L59771K95571K29309
1168G3123169J65512R3147O317o0653r9297j78055l15689l68759l70025l32146k15431
$$ plain form
1101 14035105 14477610 14948272 15474462 16091347 16761087 17446468 18180727 18982433 19858192 20824764
1111 20824764 21870159 22987984 24177837 25441360 26765846 28142879 29561066 31005262 32478142
1120 32478142 33988094 35502480 36994934 38454960 39847824 41219852 42620872 44005489 45343468
1129 45343468 46638870 47879410 49083778 50273750 51427696 52526451 53584408 54609394 55601738
1138 55601738 56567642 57497047 58373737 59222221 60072182 60891579 61646103 62372231 63107658 63814140
1148 63814140 64462448 65063095 65631172 66123749 66487076 66768410 66959595 67173027 67523338 67995430
1158 67995430 68651344 69374062 70071121 70730713 71305588 71809509 72238518 72598289 72893860 73123169
1168 73123169 73288681 73381828 73388145 73327492 73228195 73050140 72734451 72365692 71995667 71663521 71448090
1179G1448090j66275j55930j53084j93077j65909r2178P6J46675K32262K88704L03818
1190G1493172K58804K40822K07306K41279L44544M26628N19989N85266O40228O52886
1200G5610924O23176N83176N19753M53132L82996K90184J42738Q7479J21948J08864
1210G8924370O7856N7602P0304P8156R7061R0881N1117M7661P9994P9964N5573M2678
1222G9743217L8292J8402l120n8029j62148k20733k52960k76947k76040k98812l40889
1233G7910233l71293l97346m20738m34258m65149m95483n69824o69808q24478j009369
1243G2252487j293304j700157k065636k396202k830315l319958l918979m714607n304123
1252D4709206n962086n993271n481840m786707l677248k717138j733016q54659j06073
$$ plain form
1179 71448090 71281815 71125885 70972801 70779724 70613815 70521637 70521713 70668388 70900650 71189354 71493172
1190 71493172 71751976 71992798 72200104 72441383 72785927 73212555 73732544 74317810 74958038 75610924
1200 75610924 76234100 76817276 77337029 77790161 78173157 78463341 78606079 78693558 78815506 78924370
1210 78924370 78992226 79049828 79120132 79198288 79295349 79386230 79437347 79485008 79565002 79644966 79700539 79743217
1222 79743217 79781509 79799911 79796791 79738762 79576614 79355881 79102921 78825974 78549934 78251122 77910233
1233 77910233 77538940 77141594 76720856 76286598 75821449 75325966 74756142 74086334 73261856 72252487
1243 72252487 70959183 69259026 67193390 64797188 61966873 58646915 54727936 50013329 44709206
1252 44709206 38747120 32753849 27272009 22485302 18808054 16090916 14357900 13503241 13397168
1261A3397168P38287J590634K576493L763916M755138N822300O274559O229851N907181
1270E1055527N085991M429176L713966L168389K752975K397461K144959J893142J673004
1279G8314590J462555J257851J096458R87916Q56353P11365N90134M75433L98659L67309
1289H6518623L19863K63382K30972K05833K21871K91534L31024L61611L81798M09294
1299H9535805L74534K76993J88355P4905l05n0591q5807j08933r8228m4373o676K4964
1311I0080643O9427J34659J69655J80511J93665J99867K09549K36862K14745J40121
1321I1829704R1957M2870K3170L5195L9123M0718N6748R9113J03112P5225N4070L9291
1333I2530296o508q9119j48155k10785k28790j95908j85585j85775j71326j46080j19926
$$ plain form
1261 13397168 14135455 15726089 18302582 22066498 26821636 32643936 38918495 45148346 51055527
1270 51055527 56141518 60570694 64284660 67453049 70206024 72603485 74748444 76641586 78314590
1279 78314590 79777145 81034996 82131454 83119370 83975723 84687088 85277222 85752655 86151314 86518623
1289 86518623 86838486 87101868 87332840 87538673 87760544 88052078 88383102 88744713 89126511 89535805
1299 89535805 89910339 90187332 90375687 90450592 90450287 90399696 90313889 90204956 90106728 90062355 90055679 90080643
1311 90080643 90150070 90284729 90454384 90634895 90828560 91028427 91237976 91474838 91689583 91829704
1321 91829704 91921661 91964531 91987701 92022896 92062019 92102737 92159485 92258598 92361710 92436935 92491005 92530296
1333 92530296 92523788 92434669 92286514 92075729 91846939 91651031 91465446 91279671 91108345 90962265 90842339
1344I0842339r1935n5954p438K9060O4209P9750P1434P4433Q8928P8941M3297K2339
1356I1239403J3641j3573n2497r9564j81458j95098j37307j24099j32439j38641j53298
1367I0025070j57928j42075j66229k23374k81311l80943l90938l10249k74399k53105
1377H7444519k32124k24732j92260j25672r9777r3010j16852k03461k12837j53473
1387H5790321j31584j01158j40045k56020l40339m59244m56688l18146k57919k54990
1397H3074188j79199k8824N8792J28937J37497P4677K3742l3760j07216k13714k75780
1408H2659340l35907l01842j76925m0177J51039L05245M50302N65956O41273P40006
1418H4658310R04732R01123P24174O27945N44693M91379M98962M26415K66861J88469
$$ plain form
1344 90842339 90750404 90694450 90687012 90716072 90780281 90860031 90931465 91005898 91094826 91173767 91217064 91239403
1356 91239403 91253044 91239471 91186974 91087410 90905952 90710854 90573547 90449448 90317009 90178368 90025070
1367 90025070 89867142 89725067 89558838 89335464 89054153 88673210 88282272 87972023 87697624 87444519
1377 87444519 87212395 86987663 86795403 86669731 86569954 86476944 86360092 86156631 85943794 85790321
1387 85790321 85658737 85557579 85417534 85161514 84821175 84361931 83905243 83587097 83329178 83074188
1397 83074188 82894989 82866165 82924957 83053894 83191391 83266068 83289810 83256050 83148834 82935120 82659340
1408 82659340 82323433 82021591 81844666 81804489 81955528 82260773 82711075 83277031 83918304 84658310
1418 84658310 85563042 86464165 87188339 87816284 88360977 88852356 89351318 89777733 90044594 90233063
1428I0233063J64505J33636J27510Q0818P706q3351k41707k78717j71135k00584k96135
1439H9475609m60152p32422r51690j139908j370598j558495j971382k732422l081398
1448G5477142l164787l156975l198501k553059j194191L5976J381447K708268M587432
1457G0922752M868920L542274K798943K011795J497795J197220J031830J119758J066612
1466I0057899R61182Q42621O73531N63957M65774M61266N98930O02463N24635M30298
1476I6182556K69562J76903J46652O7070m6372j44195k08664l60275n79026q24546
1486I4679665j106385j426765j890228k076744k103379j922134j636788q80455M62410
1495H2099197J562500K970696L312469K612473K146530J507233J048111O66336M19563
$$ plain form
1428 90233063 90397568 90531204 90658714 90739532 90747238 90663887 90422180 90143463 89972328 89771744 89475609
1439 89475609 89015457 88283035 87331345 86191437 84820839 83262344 81290962 78558540 75477142
1448 75477142 72312355 69155380 65956879 63403820 62209629 62245605 63627052 66335320 70922752
1457 70922752 75791672 79333946 82132889 84144684 85642479 86839699 87871529 88991287 90057899
1466 90057899 91019081 91861702 92535233 93099190 93564964 94026230 94625160 95227623 95752258 96182556
1476 96182556 96452118 96629021 96775673 96842743 96796371 96652176 96443512 96083237 95504211 94679665
1486 94679665 93573280 92146515 90256287 88179543 86076164 84154030 82517242 81636787 82099197
1495 82099197 83661697 86632393 89944862 92557335 94703865 96211098 97259209 97925545 98345108
1504I8345108K91092K90153N30602N47813M09195L09609J62704J19019K07321J61842
1514A01374458l3088m9164J25862J14632q4382q7829Q3229J29387J12533Q4427k548
1525A01767517r827O3569P5073N9891J9859p8697j03096q6594k9037J61911J16493
1536A01957062j89812k89368l10875k07374J21643K27089J56647J68396K39395K03300
1546A02076103M9515j3496l3020k8634L7171L3974l6141n1330O408n6907l27874k66311
1558A01389458J47697K93968L15216K60498L5668l1761L3020L265j05163j29082r6298
1569A02116486n9006M1794K1980j17439j96701l10204k59994J7997O9550l7933j20255
1580A01166275k43813l27323m22593m04052k80548j42289Q7242J92070K16149J99653
$$ plain form
1504 98345108 98636200 98926353 99456955 100004768 100413963 100723572 100886276 101005295 101212616 101374458
1514 101374458 101341370 101292206 101418068 101532700 101448318 101360489 101443718 101573105 101685638 101770065 101767517
1525 101767517 101757690 101821259 101896332 101956223 101976082 101897385 101794289 101707695 101678658 101840569 101957062
1536 101957062 101767250 101477882 101167007 100959633 101081276 101308365 101465012 101633408 101872803 102076103
1546 102076103 102125618 102112122 102079102 102050468 102087639 102121613 102085472 102034142 102040550 101983643 101655769 101389458
1558 101389458 101537155 101831123 102146339 102406837 102442505 102410744 102443764 102447029 102341866 102212784 102116486
1569 102116486 102057480 102099274 102121254 102003815 101807114 101496910 101236916 101254913 101324463 101286530 101166275
1580 101166275 100922462 100595139 100172546 99768494 99487946 99345657 99432899 99624969 99841118 100040771
1590A00040771J07857L9292k9541j03280j88468k54563l24394l37311l13286k33383
1600I8403694q8005O5376K96883L83110L54340L12919J98250J50414J55693J28669
1610A00361343Q6625M5654K670m6036j38450j19164L7384P3433K9564R08n9753n8724
1622A00215454k907M1344J25954J09581m2511n0263Q0712R2552K3033k1004q9981q9218
1634A00392746m0695M8797K54990K81738J37383Q4396Q0185L2402o1066r9533j23191
1645A00988152p2342J03073J43051J12701J1277k96425k68990R6535K46841L32329
1655A01396202L04649R7519K4414L8575J3351n0163k9755R1004J24023J14563O9595
1666A02193977o2896q1948r178M0749J39732J14731p8987q9722O0059J08291J23932
$$ plain form
1590 100040771 100148628 100187920 100158379 100055099 99866631 99612068 99287674 98950363 98637077 98403694
1600 98403694 98315689 98381065 98677948 99061058 99415398 99728317 99926567 100076981 100232674 100361343
1610 100361343 100447968 100493622 100496292 100450256 100311806 100192642 100230026 100303459 100333023 100333931 100274178 100215454
1622 100215454 100212547 100253891 100379845 100489426 100446915 100396652 100477364 100569916 100592949 100571945 100481964 100392746
1634 100392746 100352051 100400848 100655838 100937576 101074959 101159355 101239540 101271942 101210876 101111343 100988152
1645 100988152 100915810 101018883 101161934 101274635 101285912 100989487 100720497 100817032 101063873 101396202
1655 101396202 101700851 101798370 101822784 101861359 101874710 101824547 101794792 101885796 102009819 102124382 102193977
1666 102193977 102131081 102049133 102039955 102080704 102220436 102335167 102256180 102166458 102226517 102334808 102458740
1677A02458740R2911k0409n9723l2279o5522k10167j36017K26662K68700K1957l2020
1688A02512833L0090L3211K8351j3451j19209j52016j46294j01494M9233L7888j91498
1699A01967644j47270J93832K46788P2121J2542k1675j4541O6253P5104L1189L212
1710A02485199l4660m7783l3974l6766n4718n0018n0804J7379K09046K31651R6413
1721A02730965N0880L9314L6881O9336N8365J403j3114R368J839k2079n0087j41625
1733A02771446p1594K33841K53845O317n9532l1685p538O2394P7514N1064L0403K785
1745A03319260k8229q1604q5144m7470o272P0122R2507Q4686M0413r1675j00060J9043
1757A03185577L8865j1109k2461l3874P09J21193J21826P40k8747j198P942L0922J3970
$$ plain form
1677 102458740 102551651 102531242 102471519 102439240 102373718 102163551 102027534 102254196 102522896 102544853 102512833
1688 102512833 102542923 102576134 102604485 102591034 102471825 102319809 102173515 102072021 102121254 102159142 101967644
1699 101967644 101820374 102014206 102260994 102333115 102345657 102323982 102309441 102375694 102450798 102481987 102485199
1710 102485199 102450539 102402756 102368782 102332016 102277298 102227280 102176476 102193855 102402901 102634552 102730965
1721 102730965 102781845 102821159 102858040 102927376 102985741 102987144 102974030 102983398 102985237 102963158 102913071 102771446
1733 102771446 102699852 102933693 103187538 103193855 103134323 103102638 103095100 103157494 103235008 103286072 103316475 103319260
1745 103319260 103291031 103209427 103124283 103076813 103070541 103140663 103233170 103317856 103358269 103266594 103166534 103185577
1757 103185577 103224442 103213333 103190872 103156998 103157707 103278900 103400726 103401466 103372719 103371521 103379463 103410385 103424355
1770A03424355p7004n1910J01310J44219J17348R6870M9042L2333K9701N0812J32271
1781A04049347J17783j0781k4750O1280P6935O6375K3148q8570j19209r3964o1935
1792A03995659K1026K7344m0458o5087o1439q7456j61911j51726n6770j0895K3270
1803A03431557K9922l792j0772m891J885O912L2524R0118J11657J11145J00540N9295
1815A03956100N7244R0553J04523J22360J05835M9324J3237l5576k5154O8329P7248
1826A04584023N867M699N6053Q0201J01593J01966P5463O3560N6649N1429N1094M6135
1838A05278732M5441K2957l1113n1712o6231l0136R6268J09680J5495m699K6062J8097
1850A05428841k2370l0678r567j3183m0291m1893k3575j1993P057L143k5154m1794
$$ plain form
1770 103424355 103347351 103295441 103396751 103540970 103658318 103755188 103804230 103836563 103866264 103917076 104049347
1781 104049347 104167130 104156349 104131599 104192879 104269814 104336189 104359337 104270767 104151558 104057594 103995659
1792 103995659 104016685 104044029 104003571 103938484 103877045 103789589 103627678 103475952 103419182 103408287 103431557
1803 103431557 103461479 103457687 103446915 103442024 103443909 103450821 103483345 103573463 103685120 103796265 103896805 103956100
1815 103956100 104013344 104103897 104208420 104330780 104436615 104485939 104499176 104463600 104438446 104506775 104584023
1826 104584023 104589890 104594589 104650642 104730843 104832436 104934402 105009865 105073425 105130074 105181503 105232597 105278732
1838 105278732 105324173 105347130 105316017 105264305 105198074 105167938 105264206 105373886 105389381 105384682 105410744 105428841
1850 105428841 105406471 105375793 105366226 105353043 105312752 105270859 105247284 105235291 105242348 105245491 105220337 105178543
1862A05178543n6908o6330o5322p7111j15059j02729l6484p439J3428Q77n5618q8882
1874A04520966j26915j24932p3501n5291n1590n4740p8728p5249m4983l3714l0685
1885A03770638l3310n7694m1962J8975M2610M1649M7371N0193N7168P2578P2212O1089
1897A04101517M3319Q294n646j1398M028N9250O6589K9373K1836L2257L3050L1281
1909A04413750K5917J4541P607J0414q728n9456p1907o8237k9969P9133R5321K8252
1921A04436638K830j3847j5358R590R178j2565k0149j5854k6322m9469o7093q6998
1933A04150581r6397r0622j01158j23314j44692j79412j83792j59958j43387j20087
1943A02807762j10679j18683j09528p9254p8438j16249j05835n1643k2721n554J4610
$$ plain form
1862 105178543 105121635 105055305 104989983 104912872 104797813 104695084 104658600 104651161 104664589 104665466 104609848 104520966
1874 104520966 104394051 104269119 104195618 104140327 104088737 104033997 103955269 103880020 103835037 103801323 103770638
1885 103770638 103737328 103679634 103637672 103656647 103699257 103740906 103788277 103838470 103895638 103968216 104040428 104101517
1897 104101517 104144836 104153130 104147484 104136086 104140114 104199364 104265953 104295326 104317162 104349419 104382469 104413750
1909 104413750 104439667 104454208 104461815 104472229 104463501 104404045 104332138 104263901 104233932 104313065 104408386 104436638
1921 104436638 104439468 104425621 104410263 104419853 104429031 104416466 104396317 104380463 104354141 104304672 104237579 104150581
1933 104150581 104054184 103963562 103862404 103739090 103594398 103414986 103231194 103071236 102927849 102807762
1943 102807762 102697083 102578400 102468872 102389618 102311180 102194931 102089096 102037453 102014732 102009178 102023788
1954A02023788L5195N1521O1325P8339J07361J15303J03256R9709R7892R6154R9754
1965A02969597Q9195N2948N6343J04210J11626R0248P8171N6915O2439J05743J06690
1976A03884125O6299O0608Q0589Q6258R0309Q1833N5115M3755L9406M1488O3469N1972
1988A04645226p744l365O5018Q5304P8606P2265N7724M1672R323J3016O3019O5635
2000A05185699K1386K1766O3683O7802M0917L5217M7134L8575J1512m219k0813j9622
2012A05489037L532J3252J9478J7693R178o821m4411m6470j7456L082L1395M1725L9986
2025A05553200K7939k625k0576m0863l5073R445J3520j6838k6604k7992k7298k0386
2037A05385849j7738j0086k4079o7283q3062q8501p2120k2820L243K9541J8142m8301
$$ plain form
1954 102023788 102058983 102110504 102171829 102250168 102357529 102472832 102576088 102675797 102773689 102869843 102969597
1965 102969597 103058792 103111740 103168083 103272293 103383919 103474167 103552338 103609253 103671692 103777435 103884125
1976 103884125 103950424 104011032 104091621 104177879 104268188 104350021 104405136 104448891 104488297 104529785 104593254 104645226
1988 104645226 104637482 104634117 104699135 104784439 104863045 104935310 104993034 105034706 105044029 105057045 105120064 105185699
2000 105185699 105207085 105228851 105292534 105360336 105401253 105436470 105483604 105522179 105533691 105529472 105508659 105489037
2012 105489037 105492569 105505821 105525299 105542992 105552170 105545349 105500938 105454468 105437012 105440094 105471489 105513214 105553200
2025 105553200 105581139 105578514 105557938 105517075 105482002 105491447 105504967 105488129 105461525 105433533 105406235 105385849
2037 105385849 105368111 105358025 105333946 105266663 105183601 105095100 105022980 105000160 105003403 105032944 105051086 105002785
2049A05002785o2470m2579k3224J3900L0022L1326L1540K6657J8929J053l13J4641
2061A05042267K0096K1438K2789K7275J7975j2893j7594k342R941L2356L5195K2743
2073A05219246P194k5123l1784j6785o767Q560J4442J4901Q445j7189j1711K7107M0009
2086A05230545M5731K8251k8877m3838l0137j5998J8974K1149j2490j6334O71Q743
2098A05206390K2179J3374l2951k8374L5385L6759k2576k7702O195K4872N4718M4006
2110A05332275j9737l4904j3710q988j4381k785L5736L4073j1658j9172J480Q201J3497
2123A05299927R369j6144p416M5899M6470j411j7739j9096j9455j3351r011n722J549
2136A05293869J5976J9836J0773J5808L6194L9528L5477J7692l0281l6384o196J0445
$$ plain form
2049 105002785 104940315 104897736 104874512 104888412 104918434 104949760 104981300 105007957 105026886 105027939 105027626 105042267
2061 105042267 105062363 105083801 105106590 105133865 105151840 105138947 105121353 105119011 105128952 105161308 105196503 105219246
2073 105219246 105226440 105201317 105169533 105152748 105145981 105154541 105168983 105183884 105192329 105175140 105163429 105190536 105230545
2086 105230545 105276276 105304527 105275650 105231812 105201675 105185677 105204651 105225800 105213310 105196976 105197647 105206390
2098 105206390 105228569 105241943 105208992 105180618 105216003 105252762 105230186 105202484 105208679 105233551 105288269 105332275
2110 105332275 105312538 105277634 105263924 105254936 105240555 105237770 105273506 105307579 105295921 105276749 105278229 105286430 105299927
2123 105299927 105309296 105293152 105285736 105331635 105378105 105376694 105358955 105339859 105320404 105307053 105298042 105292320 105293869
2136 105293869 105309845 105329681 105340454 105356262 105392456 105431984 105467461 105485153 105454872 105418488 105412292 105422737
2148A05422737L6240K9945j8577k7680j1322M623M2824L8216k1080k2476L2562L7025
2160A05543037J366r376j3016l334K9922L9261L4050K4201J762j1398k5582k1675O752
2173A05595970J4877J3520L929k6413k8778p774O126K9663K6321j0635j7883l289J267
2186A05596901l82Q011L3715L1135k342j0704j236r77m768o248r469m692J1681J5450
2200A05656075J2802K960k1820k9869k4346k4627l1548k2453M936J8547L0754K4132
2212A05595543j2833j6762R018J4351J3497o49m2457m7348k0249o241Q362J3687R400
2225A05517319O599K289k739j1421j2825p347m723j236k029p584j0963j8311j2276
2238A05434753P958K1438M0032L6972Q972m295j2947j6449r774j3732l0159l1212j3588
$$ plain form
2148 105422737 105458977 105488922 105470345 105442665 105431343 105435966 105478790 105517006 105495926 105473450 105506012 105543037
2160 105543037 105544403 105535027 105522011 105518677 105548599 105587860 105621910 105646111 105647873 105636475 105610893 105589218 105595970
2173 105595970 105610847 105624367 105628296 105601883 105573105 105565331 105571457 105601120 105627441 105616806 105598923 105595634 105596901
2186 105596901 105596519 105604530 105638245 105669380 105667038 105656334 105655098 105654121 105649353 105643105 105633636 105628944 105640625 105656075
2200 105656075 105668877 105671837 105650017 105620148 105595802 105571175 105539627 105517174 105522110 105540657 105571411 105595543
2212 105595543 105582710 105565948 105574966 105589317 105602814 105602165 105559708 105512360 105492111 105485870 105494232 105507919 105517319
2225 105517319 105523918 105526207 105523468 105512047 105499222 105491875 105487152 105485916 105483887 105476303 105465340 105447029 105434753
2238 105434753 105442711 105464149 105504181 105541153 105550125 105545830 105532883 105516434 105506660 105492928 105462769 105431557 105417969
2251A05417969j8601n0613n0903k5849q774J4168K0859J6426K502l6880l9604p530
2263A05233170M409R461R613j763n03J0994J8097K9724K4773K838j3779l8101m0627
2276A05248306k0553j0582k007K648K960K952L624l311k1362k8397l1158k5040k930
2289A05115150K121M105k0004r9495r4124M646K2126k2530l1548k4078k1339m334k7870
2302A04802826j03333j30462j29341j20240q2779p8270j09672j04096o0913n5816q3855
2313A03744049q9188p1029q8738j55349j59668j10367q4091o0990m3815k3079l4386
2324A02823349q4160j11099j36116j36902j07307r4368j00922o8764L0403K5078q5380
2335A01953812j27030j46286j31538o8283k6421P775M9278Q5762J51588K82883L00644
$$ plain form
2251 105417969 105399368 105348755 105297852 105272003 105263229 105277397 105298256 105314682 105317184 105280304 105240700 105233170
2263 105233170 105237579 105247040 105256653 105254890 105254387 105265381 105283478 105313202 105337975 105340813 105327034 105288933 105248306
2276 105248306 105227753 105217171 105215164 105217812 105220772 105223724 105227348 105224037 105202675 105174278 105143120 105118080 105115150
2289 105115150 105117271 105121376 105101372 105001877 104907753 104912399 104934525 104911995 104880447 104856369 104835030 104830696 104802826
2302 104802826 104699493 104569031 104439690 104319450 104236671 104158401 104048729 103944633 103883720 103827904 103744049
2313 103744049 103654861 103583832 103495094 103339745 103180077 103069710 102985619 102924629 102880814 102857735 102823349
2324 102823349 102739189 102628090 102491974 102355072 102247765 102153397 102052475 101983711 102014114 102039192 101953812
2335 101953812 101826782 101680496 101548958 101480675 101454254 101462029 101511307 101597069 101748657 102031540 102332184
2346A02332184K40593J38588o1653j70876k20489k74277l37311l25806k40348j62621
2356A00917984l6957m432p1244p1571n9036J4953J89682K59331K63931K48978J72043
2367A01823662J57120J98074J95457J64605J43219J05522J16729J91979K05444J66512
2377A03468323J63246J87225J83869J68182J34613O9763L2448R2L982O5109O8100K0646
2389A04565598P103J3397J1421N295O485J9981J4061j1703k3865l2807l0494j2490
2401A04531982m631M433m791m4983m5975j1871L578J9356J3305k7221k9640R76J2329
2414A04416847J9333J4404m844k1553m9950n0377k4292n821K3132K4315j0605j0299
2426A04320290K7107K2484k4391l3524j9600m051L1898L4241k388k785L4996K7726
$$ plain form
2346 102332184 102572777 102711365 102649712 102478836 102258347 101984070 101646759 101320953 101080605 100917984
2356 100917984 100881027 100876595 100805351 100733780 100674744 100689697 100879379 101138710 101402641 101651619 101823662
2367 101823662 101980782 102178856 102374313 102538918 102682137 102787659 102904388 103096367 103301811 103468323
2377 103468323 103631569 103818794 104002663 104170845 104305458 104375221 104407669 104407761 104411743 104476852 104544952 104565598
2389 104565598 104572701 104586098 104597519 104602814 104609299 104629280 104643341 104631638 104607773 104574966 104544472 104531982
2401 104531982 104527351 104531784 104526993 104482010 104436035 104424164 104427742 104447098 104460403 104433182 104403542 104404518 104416847
2414 104416847 104436180 104450584 104445740 104424187 104374237 104323860 104299568 104293747 104316879 104341194 104330589 104320290
2426 104320290 104347397 104369881 104345490 104311966 104292366 104288315 104320213 104354454 104352066 104349281 104384277 104412003
2438A04412003k5628l8047k1271j5427j0299o981j244q942l8620m0367j6235p889r445
2451A04171608l120O698J9623M7134M3389P087j0734k6222k5917j839L36j2902k1934
2464A04193207l7171l6758j9577j2276r346o248o340j007J6380J0590k5246k8519o775
2477A04030914P302K9441K9114P584j0063l5576m7157m7371m7852m9637l7002P934
2489A03837631k098p9796q7188k7680k5589p3570p6843n2262k7397J3519L4668L9292
2501A03472687M9873O5781O6879N4337M3602L3020J3732k9060k7275K4864L5912K3674
2513A03828026Q034l2021l2593K556K4269N7457N1590K983k3338n3238m8424L098J4778
2526A03803177j907o577j2566p202J7838J6258j7166j5183K0882K8778J9386J1109
$$ plain form
2438 104412003 104386375 104348328 104327057 104311630 104301331 104294350 104293106 104284164 104245544 104205177 104188942 104181053 104171608
2451 104171608 104168488 104175186 104194809 104241943 104285332 104292419 104281685 104255463 104229546 104227707 104228043 104215141 104193207
2464 104193207 104156036 104119278 104099701 104087425 104078079 104071831 104065491 104064484 104080864 104091454 104066208 104037689 104030914
2477 104030914 104038216 104067657 104096771 104104355 104094292 104058716 104011559 103964188 103916336 103866699 103829697 103837631
2489 103837631 103835533 103755737 103668549 103640869 103615280 103541710 103464867 103412605 103385208 103398727 103433395 103472687
2501 103472687 103522560 103588341 103655220 103709557 103753159 103786179 103799911 103770851 103743576 103768440 103804352 103828026
2513 103828026 103836060 103804039 103771446 103774002 103798271 103855728 103907318 103910301 103886963 103833725 103785301 103788399 103803177
2526 103803177 103801270 103794693 103782127 103774925 103792763 103809021 103791855 103776672 103797554 103826332 103845718 103856827
2538A03856827o371j0177K983k983k9587l4691k0386k0454k8610l6385n6000m7065
2550A03567101j6259K2789J04286J04950K5086j3474m8660n0621o363K030j3619j8806
2562A03658440k3941k2316j1444q057p729j1558k6421k3956k075K403m601j0154j9623
2575A03488968k4796l1898k4346R041O790l3332m1123k9800j7052J2993J4496j0895
2587A03319046k4170m2892l5958L861J6266J6113M173l0922m4700m6494m3655l4096
2599A03056572j8860J3619J7784n73j9149o0364n6984j0895J8288O0531N5390r132
2611A03046227k4796m196n318k2102k0935m601M410J8364J0704k5040l6522l2592l0587
2624A02873016k3559k2080k1431l0182n8174n7747l5240j2916K8869L3547N081j6075
$$ plain form
2538 103856827 103850456 103840279 103843262 103840279 103810692 103776001 103755615 103735161 103706551 103670166 103614166 103567101
2550 103567101 103550842 103573631 103677917 103782867 103807953 103794479 103745819 103695198 103688835 103690865 103677246 103658440
2562 103658440 103634499 103612183 103600739 103592682 103584953 103573395 103546974 103523018 103520943 103523346 103518745 103508591 103488968
2575 103488968 103464172 103432274 103407928 103416969 103423759 103390427 103349304 103319504 103302452 103315445 103329941 103319046
2587 103319046 103294876 103251984 103216026 103219887 103236153 103252266 103256439 103225517 103180817 103134323 103090668 103056572
2599 103056572 103037712 103051331 103069115 103068542 103049393 102989029 102932045 102921150 102939438 102999969 103055359 103046227
2611 103046227 103021431 103017235 103011917 102989815 102968880 102964279 102968689 102987053 102997757 102972717 102936195 102903603 102873016
2624 102873016 102849457 102827377 102805946 102775764 102717590 102659843 102624603 102611687 102640556 102674103 102679184 102663109
2636A02663109n4337n2688q202J0040K1263J7571q743j9219k1171k3941k9038k1103
2648A02473541O439J1803L815j1086m6920n4215l3859l1998m9347l7170P126K4460
2660A02262589K9136K2957n173j2916j0544N26L4027L6072J0491m273k3743k4559r346
2673A02305244R034M6402N2093L4355J0773l8528n1735l9360k1149J7067L8124N7579
2685A02419899N0095R628j4542m2442m3533j1612k144q629j839K0981J9455m341j8547
2698A02372429l4355l8956l6285k3651J1749J5686j0201j8310j8570j9173j6853j6693
2710A02166817k0500j6190%O64p363k4109o8206o5277j2497M150L838m433l3760m1107
2724A01882027l0564k8801l0975l0136k4147k8710m9873m7752k2293j3810j4686j5206
$$ plain form
2636 102663109 102608772 102556084 102547882 102557922 102579185 102596756 102588013 102568794 102547623 102523682 102494644 102473541
2648 102473541 102479980 102491783 102495598 102484512 102437592 102383377 102349518 102317520 102268173 102231003 102238129 102262589
2660 102262589 102291725 102314682 102309509 102296593 102286049 102286575 102320602 102356674 102367165 102362892 102339149 102314590 102305244
2673 102305244 102314278 102360680 102412773 102447128 102457901 102419373 102367638 102328278 102307129 102324196 102362320 102419899
2685 102419899 102469994 102479622 102465080 102422638 102379105 102367493 102365349 102356720 102354881 102375862 102395317 102390976 102372429
2698 102372429 102338074 102299118 102262833 102239182 102250931 102266617 102256416 102238106 102219536 102200363 102183510 102166817
2710 102166817 102146317 102130127 102130127 102130791 102123428 102099319 102031113 101965836 101953339 101957489 101961327 101956894 101923134 101882027
2724 101882027 101851463 101822662 101791687 101761551 101737404 101708694 101658821 101611069 101588776 101574966 101560280 101545074
2736A01545074j8768k1622k9998k2835Q293Q369k4818k7443j785k525k9259k9160l334
2749A01350189k67j4015k0027k2843k8991m5655l7742J999R422r08k3392q4182q4282
2762A00999306k3888j480J4069l289p0549r3704r2911q1581l7002l6698q2824q9547
2774A00399902o8809n8914m0055n3192j09840j23337j09909r1476l6957m8905j38946
2785I9519562j58356j31134j10168p1694n8273o9191o5064n0186m7012n4268n4764
2796I8649452n1567m9637n7129l6689L4164K7916n5145q8791j05614j01684o5545m7065
2808I8052666l1662k7870l6858m5731o6375o4370l8101k8465j5549l8460j18415j31585
2820I7409225q5403p3914p5454q2711j03378j14059j20713j23191j10695j26694j77406
$$ plain form
2736 101545074 101526306 101504684 101474686 101451851 101460144 101468513 101443695 101416252 101414467 101411942 101382683 101353523 101350189
2749 101350189 101349922 101335907 101315880 101293037 101264046 101218391 101180649 101182648 101192070 101191162 101167770 101083588 100999306
2762 100999306 100975418 100973938 100988007 100984718 100914169 100820465 100727554 100645973 100608971 100572273 100489449 100399902
2774 100399902 100331093 100272179 100232124 100178932 100069092 99945755 99835846 99744370 99707413 99658508 99519562
2785 99519562 99361206 99230072 99119904 99048210 98989937 98920746 98855682 98805496 98758484 98704216 98649452
2796 98649452 98597885 98548248 98491119 98454430 98488594 98516510 98461365 98372574 98266960 98165276 98099731 98052666
2808 98052666 98021004 97993134 97956276 97910545 97844170 97779800 97741699 97713234 97697685 97659225 97540810 97409225
2820 97409225 97323822 97249908 97174454 97091743 96988365 96874306 96753593 96630402 96519707 96393013 96215607
2831I6215607j94741j86996j89232j80359k09930k87369l25531l36151l59841l75061
2841I3570396m27627n33699n83122o09688n88532n19394m28489k84096j87088j14632
2851H9294029n7365k6367J3015N9464Q3465R1126Q7379O7543M5449J6807j5281m8287
2863H9610977r5672j69777k08069k09740k40662k90626l34648m01779m00811l30207
2873H6928986k87316k40639k18986k30598k13860j81007j45035j00418n6481l151K8565
2884H5280060M4014N2757M8477M6822N6053K7344m1153r3361j34300k00035k97715
2895H4788963l62869m10820m44839m64013m68849m66018m28437l51211k81189k04994
2905H0905724j29532l1739K793J381n9845k15050l04008l62946m07219m37782m35517
$$ plain form
2831 96215607 96020866 95833870 95644638 95464279 95254349 94966980 94641449 94305298 93945457 93570396
2841 93570396 93142769 92609070 92025948 91416260 90827728 90308334 89879845 89595749 89408661 89294029
2851 89294029 89236664 89210297 89223312 89282776 89366241 89457367 89544746 89612289 89657738 89674545 89659264 89610977
2863 89610977 89515305 89345528 89137459 88927719 88687057 88396431 88061783 87660004 87259193 86928986
2873 86928986 86641670 86401031 86182045 85951447 85737587 85556580 85411545 85311127 85254646 85251495 85280060
2884 85280060 85324074 85376831 85425308 85472130 85528183 85555527 85514374 85421013 85286713 85086678 84788963
2895 84788963 84426094 84015274 83570435 83106422 82637573 82171555 81743118 81391907 81110718 80905724
2905 80905724 80776192 80744453 80747246 80748627 80688782 80473732 80169724 79806778 79399559 78961777 78526260
2916G8526260l85666l66691l58032l63686l99300l98254l74489l39172k91420k23847
2926G5025703j09008o4301q8165o9718k1171m479r994j4496k2385l9528p1670r0004
2938G4420784q4541j24123j92665k85629m04023n48645p31613r03824j074668j255822
2948F8815231j435020j649758j905418k143028k405880k579998k711727k729821k691532
2957D8563049k439117j975369j447033p76603j27575N75519J193951J795269K247810
2966D7609901K567460K822303L012799L069019K971149K868321K712463K546547K351288
2975G2531250K160713J956795J777580J614472J463676J327705J200104J079224R77898
2984H6089417Q97888Q19084P60582O66000N15503M44466M43023M15139L89549L47023
$$ plain form
2916 78526260 78140594 77773903 77415871 77052185 76652885 76254631 75880142 75540970 75249550 75025703
2926 75025703 74916695 74852394 74764229 74694511 74673340 74668861 74658867 74644371 74621986 74582458 74510788 74420784
2938 74420784 74336243 74212120 74019455 73733826 73329803 72781158 72049545 71145721 70071053 68815231
2948 68815231 67380211 65730453 63825035 61682007 59276127 56696129 53984402 51254581 48563049
2957 48563049 46123932 44148563 42701530 41924927 41797352 42372871 43566822 45362091 47609901
2966 47609901 50177361 52999664 56012463 59081482 62052631 64920952 67633415 70179962 72531250
2975 72531250 74691963 76648758 78426338 80040810 81504486 82832191 84032295 85111519 86089417
2984 86089417 86987305 87806389 88566971 89232971 89748474 90192940 90635963 91051102 91440651 91787674
2994I1787674K81692K35932K11387J58883P0404K6962J8265M341j267j2947m5944k5268
3006I2710114N2093R8755J47987J53733J17729P8964R132j7761Q461k6993j04210j88232
3018I3039772l05199l85666m35134n01229n84984o34620o56319o77254p25746o61682
3028H7471939m90166l31001j55853M1466K94517M62647N72403O58035P31109P11060
3038H9966156N84221M85824L65639K89032K61475J95572R9449K7794l5805q0635r1339
3049I2067383j40000k31597k74155k71256l00544l54058l86429m22737m08073l36220
3059H8942314k87178k57614j80862o2607N3169J89209K98401M01924M61845M88495
3069I0047096M78218M14681L66813L19527K64023J94672J42784J05262O3210K2934
$$ plain form
2994 91787674 92069366 92305298 92516685 92675568 92745972 92772934 92791199 92795540 92794273 92781326 92735382 92710114
3006 92710114 92762207 92860962 93008949 93162682 93280411 93359375 93368507 93350746 93359207 93332214 93228004 93039772
3018 93039772 92734573 92348907 91913773 91412544 90827560 90192940 89536621 88859367 88133621 87471939
3028 87471939 86981773 86650772 86494919 86536385 86830902 87293549 87865952 88523987 89255096 89966156
3038 89966156 90550377 91036201 91401840 91690872 91952347 92147919 92247368 92275162 92239357 92158722 92067383
3049 92067383 91927383 91695786 91421631 91150375 90849831 90495773 90109344 89686607 89278534 88942314
3059 88942314 88655136 88397522 88216660 88154053 88207222 88396431 88694832 89096756 89558601 90047096
3069 90047096 90525314 90939995 91306808 91626335 91890358 92085030 92227814 92333076 92396286 92419220
3079I2419220k2079r1744j00182l2882l3974r7633j03211q0703l1113P0999J24763
3090I2021461J43052J75117K24335K27875J89399J56884J21231P0671j3253m5303l3234
3101I3238235l1280j9455k3773n2765m6272p698J6090L9223N1994N1811N8533P1045
3113I3345688P3791O7665O4278O6017N1400J5594o64j243j1490k7565l9620n2475n6839
3126I3494537n0880n1552n9128n5618l9864l4645l0632m2511q0543q9119p2716o9092
3138I2818237o7184p3822j03378r1553l1349j5114k4918m0123p5218r3178j00662j08315
3150I1993423j10458j19232j48987j30463n4504k7252j8639m3014j27457j49300j22306
3161I0941811j14205j06643j05477j15059j12442r8533r2629q8310r2003j10344j10557
$$ plain form
3079 92419220 92397141 92305397 92205215 92172333 92138359 92040726 91937515 91856812 91825699 91896698 92021461
3090 92021461 92164513 92339630 92563965 92791840 92981239 93138123 93259354 93330025 93316772 93271469 93238235
3101 93238235 93206955 93187500 93163727 93110962 93064690 93056992 93073082 93112305 93164299 93216110 93274643 93345688
3113 93345688 93419479 93487144 93551422 93617439 93668839 93684433 93683769 93682526 93671036 93643471 93603851 93551376 93494537
3126 93494537 93443657 93392105 93332977 93277359 93237495 93202850 93172218 93129707 93049164 92960045 92887329 92818237
3138 92818237 92751053 92677231 92573853 92482300 92450951 92435837 92410919 92370796 92295578 92202400 92101738 91993423
3150 91993423 91882965 91763733 91614746 91484283 91429779 91402527 91383888 91340874 91213417 91064117 90941811
3161 90941811 90827606 90720963 90615486 90500427 90387985 90289452 90196823 90108513 90016510 89906166 89795609
3172H9795609r4124q8143q1489r1606j28174j35178j19453j10001r3079r4795j20544
3183H8639023j22955r9801j07360j43387j60767j73134j73187j61270j43341j02471
3193H7251350j00441j31111j57448k10052k03842j38519j00426n3238n5885j21735
3203H5978653j38428j21979j20971j24665j27655j32415j34491j37970j31157j06697
3213H4702225j05973j21383j42258j86829j92947j68045j44669r9777r3055j20400
3223H3326889j38641j67725j71211j52115j35086j01967j00784j31249j46553j63101
3233H1918457j62437j36040j36643j64527j66039j44196j40853j53832j50276j28006
3243H0435608j28746j48033j62033j89370j79603j24832j07361j12679j16661j23901
$$ plain form
3172 89795609 89701485 89613342 89531853 89440247 89312073 89176895 89057442 88947441 88854362 88759567 88639023
3183 88639023 88516068 88416267 88308907 88165520 88004753 87831619 87658432 87497162 87353821 87251350
3193 87251350 87150909 87019798 86862350 86652298 86448456 86309937 86209511 86156273 86100388 85978653
3203 85978653 85840225 85718246 85597275 85472610 85344955 85212540 85078049 84940079 84808922 84702225
3213 84702225 84596252 84474869 84332611 84145782 83952835 83784790 83640121 83540344 83447289 83326889
3223 83326889 83188248 83020523 82849312 82697197 82562111 82460144 82359360 82228111 82081558 81918457
3233 81918457 81756020 81619980 81483337 81318810 81152771 81008575 80867722 80713890 80563614 80435608
3243 80435608 80306862 80158829 79996796 79807426 79627823 79502991 79395630 79282951 79166290 79042389
3253G9042389j40358j79344j81885j45889j38787j50917j53778j53640j54252j59645
3263G7483894j50352j20468j13251j17203j35238j81717j96320j92734j76597j29769
3273G5970245j19476j43814j43189j28204j16417r5299r7534j27861j34712j26694
3283G4737045j20926j09314j07071j06338j23474j70326j83396j67846j66481j83754
3293G3298119j59264p5340o3370j16539j30722j20331j31851j74141j65604j01204
3303G2059753q2923r6467r7061r1263r7824j23619j22696r4436q7494r5040r6008r4391
3315G0880531r5703r8251j03424j13205j18637j28983j16302p3784n6679m9896n8556
3326F9867111q6380j13586j63361j62910j13610q2901m7248l3692m3274m4822m3793
$$ plain form
3253 79042389 78902031 78722687 78540802 78394913 78256126 78105209 77951431 77797791 77643539 77483894
3263 77483894 77333542 77213074 77099823 76982620 76847382 76665665 76469345 76276611 76100014 75970245
3273 75970245 75850769 75706955 75563766 75435562 75319145 75223846 75126312 74998451 74863739 74737045
3283 74737045 74616119 74506805 74399734 74293396 74169922 73999596 73816200 73648354 73481873 73298119
3293 73298119 73138855 73063515 73000145 72883606 72752884 72632553 72500702 72326561 72160957 72059753
3303 72059753 71976830 71880363 71783302 71692039 71594215 71470596 71347900 71253464 71165970 71070930 70974922 70880531
3315 70880531 70784828 70686577 70583153 70469948 70351311 70222328 70106026 70032242 69975563 69925667 69867111
3326 69867111 69780731 69667145 69503784 69340874 69227264 69144363 69097115 69063423 69020149 68975327 68931534
3337F8931534m9805o0730p5554j10344j02234m0596l1189o7184p0213n1644m4510l5385
3349F8192146m5250r2033q3397r605k343m9278o7993r0576p1457N791K9571K4574L388
3362F7743538n9364p5127n7121m1321q087r2k1293j3611K3033K9922J3848O294l883
3375F7536736l769R445J1345Q133n04k4917k3575Q31J7403M3350M0741k426m58M3061
3389F7655396N6747N6427M9972K3942K3887N0499N5290M4129M1748M3060M3411L0136
3401F8174644N8419J51062J61430J05713O5804R53q011L5500O4255J08413J14510O8214
3413F9100906Q0178J58668J59905Q6143P2121R6916J09360J30157J27556R6985Q8501
3424G0307396Q6861J02775J50109J62773J50131J40495J16135J19354J51421J64650
$$ plain form
3337 68931534 68881729 68820999 68745445 68635101 68532867 68492271 68461082 68393898 68323685 68272041 68227531 68192146
3349 68192146 68146896 68054863 67971466 67961861 67959518 67910240 67842247 67751671 67680214 67686005 67715576 67740150 67743538
3362 67743538 67684174 67609047 67551926 67510605 67502518 67502426 67481133 67467522 67490555 67520477 67534325 67540619 67536736
3375 67536736 67532967 67542412 67553757 67561890 67561386 67536469 67512894 67513725 67531128 67574478 67615219 67612793 67612335 67655396
3389 67655396 67712143 67768570 67818542 67842484 67866371 67916870 67972160 68016289 68058037 68101097 68144508 68174644
3401 68174644 68233063 68384125 68545555 68651268 68717072 68718025 68710014 68745514 68809769 68918182 69032692 69100906
3413 69100906 69181084 69339752 69499657 69585800 69657921 69754837 69864197 69994354 70121910 70218895 70307396
3424 70307396 70394257 70497032 70647141 70809914 70960045 71100540 71216675 71336029 71487450 71652100
3434G1652100J76597J64513J13602J05575J33988J42791J40259J49200J71998J76261
3444G3126884J68137J55136J17546J26595J84685K11044K27188K27905K10449J90835
3454G4946404J46125J51894K18750K28500J92429J83632J95312J81343J34369J29822
3464G6708580J66489J73446J51970J67847K20062K46880K66075K68028K64527K17964
3474G8851868P8865Q2565K35031K76688K59086K35421J70013J52107J74095J77102
3484H0692841J73400J72547J62597J81458K48650K48123J82625J56974J36948J54594
3494H2510757K33056K47573K12143J95549J78795J68968J72684J56258J13724J02546
3504H4292053J15563J23741J40571J41022J25145J17783J10550J11793J30898J21902
$$ plain form
3434 71652100 71828697 71993210 72106812 72212387 72346375 72489166 72629425 72778625 72950623 73126884
3444 73126884 73295021 73450157 73567703 73694298 73878983 74090027 74317215 74545120 74755569 74946404
3454 74946404 75092529 75244423 75463173 75691673 75884102 76067734 76263046 76444389 76578758 76708580
3464 76708580 76875069 77048515 77200485 77368332 77588394 77835274 78101349 78369377 78633904 78851868
3474 78851868 78930733 79013298 79248329 79525017 79784103 80019524 80189537 80341644 80515739 80692841
3484 80692841 80866241 81038788 81201385 81382843 81631493 81879616 82062241 82219215 82356163 82510757
3494 82510757 82743813 82991386 83203529 83399078 83577873 83746841 83919525 84075783 84189507 84292053
3504 84292053 84407616 84531357 84671928 84812950 84938095 85055878 85166428 85278221 85409119 85531021
3514H5531021P7820P2594R9754J11252J32271J09748K3385P034N3337N7770L8406K7344
3526H6341736J1520J0872L1090K9320K3155j4877j14350j29486p4837l8337K5322K2575
3538H6123703n4359q0941p9773q5067r0767q6907p2357o1897m7775m6235n9127o2966
3550H5295532o2225o2561o2966o2065o0791n7029m7615m7303n5122o0509o5117p3166
3562H4579063q9790r0622q8409n6885Q491O3057J32012J59195J56234J32493M6920
3573H4951759N4314J62476J85203J39786J42982J86394J86585J41166J42914J93215
3583H6486794J93473J34110J51970K35222K94021L68378L87741L58459L25325K47239
3593H9182732K43431L14254L38723L47831L38311K84126K92709L76198L78441L11569
$$ plain form
3514 85531021 85608841 85681435 85781189 85892441 86024712 86134460 86157845 86164879 86218216 86275986 86314392 86341736
3526 86341736 86353256 86364128 86395218 86424538 86447693 86432816 86318466 86188980 86114143 86075806 86101128 86123703
3538 86123703 86069344 85988403 85908630 85823563 85732796 85645889 85573532 85511635 85463860 85417625 85358498 85295532
3550 85295532 85233307 85170746 85107780 85045715 84984924 84927895 84880280 84832977 84777855 84717346 84652229 84579063
3562 84579063 84489273 84398651 84310242 84253357 84261848 84324905 84456917 84616112 84772346 84904839 84951759
3573 84951759 85006073 85168549 85353752 85493538 85636520 85822914 86009499 86150665 86293579 86486794
3583 86486794 86680267 86814377 86966347 87201569 87495590 87863968 88251709 88610168 88935493 89182732
3593 89182732 89426163 89740417 90079140 90426971 90765282 91049408 91342117 91718315 92096756 92408325
3603I2408325K83020K68036K58087K59445K55463K52632K41471K14889K10709K38327
3613I4890404K22107J70517J25076L6690N9845K17682K62855K64404J93474n623q1611
3624I6355820p4173p6172q5716j7785J82847K10235P7675L7811L5149L8742P7698O6475
3636I6828606r133p057P1571Q9051P2403N0979J7807k8824j24527j25144l7125K1126
3648I6819733Q6090J29966J62934J71829J48415J38786J30486J27029J30249J29051
3658I8174568J26007J21758J11847J13197J42006J16585M1984k0599j25382j16973
3668I8684998J7524P0885J24832N9609k18460k15012N1285J60553K19108K21421J33247
3679I9309990R6748Q7387O1104M3701k4032j73279k20207k02439j53518l4622L2211
$$ plain form
3603 92408325 92691345 92959381 93217468 93476913 93732376 93985008 94226479 94441368 94652077 94890404
3613 94890404 95112511 95283028 95408104 95444794 95504639 95722321 95985176 96249580 96443054 96437431 96355820
3624 96355820 96281647 96205475 96119759 96101974 96284821 96495056 96572731 96610542 96645691 96684433 96762131 96828606
3636 96828606 96819473 96812416 96883987 96973038 97045441 97096420 97114227 97085403 96960876 96835732 96798607 96819733
3648 96819733 96905823 97035789 97198723 97370552 97518967 97657753 97788239 97915268 98045517 98174568
3658 98174568 98300575 98422333 98534180 98647377 98789383 98905968 98947952 98927353 98801971 98684998
3668 98684998 98702522 98773407 98898239 98957848 98739388 98524376 98575661 98736214 98955322 99176743 99309990
3679 99309990 99406738 99494125 99555229 99598930 99574898 99401619 99181412 98978973 98825455 98790833 98823044
3690I8823044Q4762R3651M5845K2820j91n753J8265N844n3260n2285K167K9518N6618
3703I9071045N6320K6985K053k8801n8083j01685j03660q1589k1316J18713J58073
3714I9038055J26503Q5160j0300m3701k4056l1593n7693n6817m9446Q09J27007J60385
3726I9264313J36375Q1825m5608j03760j18042j29127j49895q8524P4623J69083K72995
3737I9364258K44232N0926l7597p1167j20141k20634j58066J49895J59019j03256k02705
3748I9054764k77779k08954O8001J76499K02346J78910O1966n249q4877p1908N6626
3759I9150345J03546J29463Q8860o5903r9060k4796k2293p8872o6399Q514M4129O1417
3771I9228951P7941J03501Q1321M578m2656j06094q7044L5454P8796Q1658P1975L3501
$$ plain form
3690 98823044 98907806 99001457 99047302 99070122 99069931 99064178 99082443 99088287 99035027 98982742 98984909 99014427 99071045
3703 99071045 99127365 99154350 99156403 99127602 99069519 98967834 98864174 98782585 98761269 98879982 99038055
3714 99038055 99164558 99249718 99239418 99195717 99171661 99140068 99082375 99025558 98976112 98976921 99103928 99264313
3726 99264313 99400688 99482513 99436905 99333145 99215103 99085976 98936081 98847557 98922180 99091263 99364258
3737 99364258 99608490 99659416 99621819 99550652 99430511 99209877 99051811 99201706 99360725 99257469 99054764
3748 99054764 98776985 98568031 98636032 98812531 99014877 99193787 99255753 99250504 99165627 99093719 99150345
3759 99150345 99253891 99383354 99472214 99406311 99307251 99282455 99260162 99181290 99114891 99123405 99167534 99228951
3771 99228951 99306892 99410393 99491714 99496292 99453636 99347542 99260498 99295952 99374748 99456406 99528381 99561882
3783I9561882L075n7007l3043R4536J33392J24619R6038J3108j3970P439l738m7516
3795I9878815m2946K2316J8005o3995o1249J8715M3228N1430J9287j11771q3755J26861
3807I9814941J67847Q7303M4754p225l8696n0087o9717r1050j11824j44790j41335
3818I9460121j31935m3274J89827K33078J12488N8197R346k1027k9686m2679o2393
3829I9732063n3261P226o562j01112j25000j18019p2548N2116Q5518L0235M6227J30348
3841I9607231J34941O9527M3701L3974K4719M5044n798j25931k22038l96134l33549
3852I8875687j931J54519K54135K67578J62933R7031K1583k7206o6757o3637J4450
3863I9688385M623r5436j13609p7698m8683n485K8297O6757P6821N6625M6417M8332
$$ plain form
3783 99561882 99564957 99507950 99474907 99569443 99702835 99827454 99923492 99936600 99922630 99930069 99926331 99878815
3795 99878815 99835869 99858185 99876190 99812195 99750946 99769661 99812889 99864319 99883606 99771835 99688080 99814941
3807 99814941 99982788 100070091 100114845 100107620 100068924 100018837 99949120 99858070 99746246 99601456 99460121
3818 99460121 99328186 99284912 99474739 99707817 99820305 99878502 99887848 99866821 99837135 99794456 99732063
3829 99732063 99678802 99686028 99679466 99578354 99453354 99335335 99262787 99314903 99400421 99430656 99476883 99607231
3841 99607231 99742172 99811699 99855400 99889374 99914093 99959137 99953339 99827408 99605370 99209236 98875687
3852 98875687 98873756 99028275 99282410 99549988 99712921 99809952 99831535 99804329 99737572 99673935 99688385
3863 99688385 99693008 99597572 99483963 99406265 99357582 99352097 99380394 99447151 99523972 99580597 99627014 99675346
3875I9675346J3466q3679r2369j5778Q034J3588O41o6780m4724R0332J00022P507m1649
3888I9563957j15989q7189P6507J19400Q9165N0713l5385p6409q9935r8633j07361
3899I9288841p4119L8192L8887r1674q4252L9742R6580J43914J34681M9874J2664l837
3911I9589493j5335L700l3287j68800j46294M9545J00731O2843L1281l8933o3415n9655
3923I9311874m2297J2947K3506N394k3079r3055r8519m3487j7853j816J5167L5591
3935I9084373L8865L0616Q561n5695m6516M7706O4774K1721J2306K3819J3061k5299
3947I9218292k6863J2322J1993k2247l2776m8615j1520J19858J21902L05m4387n3719
3959I9244545o2294o7810m5158K6466L8360j0063q011M2748L8368k1934l1494o371
$$ plain form
3875 99675346 99688812 99605133 99512764 99496986 99505020 99518608 99519249 99452469 99407745 99498077 99598099 99605606 99563957
3888 99563957 99447968 99360779 99437286 99556686 99645851 99696564 99661179 99584770 99494835 99396202 99288841
3899 99288841 99214722 99252914 99291801 99200127 99115875 99155617 99252197 99396111 99530792 99580666 99593330 99589493
3911 99589493 99574158 99577858 99544571 99375771 99229477 99279022 99379753 99442596 99473877 99434944 99371529 99311874
3923 99311874 99269577 99282524 99306030 99311424 99288345 99195290 99096771 99053284 99035431 99033615 99048782 99084373
3935 99084373 99123238 99153854 99162415 99106720 99060204 99107910 99172684 99194405 99206711 99230530 99243591 99218292
3947 99218292 99191429 99203751 99215744 99193497 99160721 99112106 99100586 99220444 99342346 99342651 99298264 99244545
3959 99244545 99182251 99114441 99069283 99095749 99134109 99124046 99116035 99158783 99197151 99175217 99143723 99137352
3971I9137352J0780M1336M2061J7807p889n5648o6826m1321l8193m8546m9110n3955
3983I8887848l0258M0245N1666J6426r247n4840n8937k2125l739J0682K2529M4609
3995I8894859K4247n0286p9605p7675q8218
4000I8623322
$$ plain form
3971 99137352 99148132 99189468 99231529 99249336 99241447 99185799 99118973 99077652 99039459 98990913 98941803 98887848
3983 98887848 98857590 98897835 98949501 98965927 98956680 98901840 98842903 98820778 98817039 98827721 98850250 98894859
3995 98894859 98919106 98868820 98789215 98711540 98623322
4000 98623322
##END=$$ End of the data block
