##TITLE=$$ Begin of the data block
##JCAMP-DX=5.00 $$ ACD/SpecManager v 10.08
##SPECTROMETER/DATA SYSTEM=16PC
##DATE=18 Jun 2013 16:08:42
##DATA TYPE=INFRARED SPECTRUM
##DATA CLASS=XYDATA
##ORIGIN=
##OWNER=
##NPOINTS=3601
##FIRSTX=400.00000000
##LASTX=4000.00000000
##MAXX=4000.00000000
##MINX=400.00000000
##MAXY=293.65075684
##MINY=29.18658066
##XFACTOR=1.0000000000
##YFACTOR=0.000001000000000
##FIRSTY=46.59862518
##DELTAX=1.00000000
##XUNITS=1/CM
##YUNITS=TRANSMITTANCE
##XYDATA=(X++(Y..Y))
400D6598625P222294J0501980J4101456J4590339J4623879P011100j2509124j9701531
408H2439018k6445034r459350N2832813N0841736k0465317l1367996P059547R393456
416A14828873j6161011j7001206O681138L050041l3479145k8732109J7811107K9896233
424G6893921K2009804J2459900q885453j9806694l1282833k1617676J8022179L0606846
432G8399994J6460388L1316071J00060913O7413391j01359207j12044648L2547516
439A12794418M9443314l2356827m5880913k0523361n678486J2508297K8012871M9126106
447A47445419M8708405K5464203J1715301N589844j7746719p4508973p5004241k0085793
455E1577446L966690J9835472K3070786P756042K007271j066231k018020J055358J093438
$$ y = [46598625, 53820919, 64322899, 78424355, 93014694, 107638573, 114649673, 102140549, 82439018, 55993984, 46534634, 99367447, 150209183, 129743866, 98375870, 105435417, 114828873, 98667862, 81666656, 88347794, 91397835, 57918690, 29186581, 46997688, 76893921, 98903725, 111363625, 102478172, 82671478, 51388645, 29770969, 47793148, 78399994, 94860382, 126176453, 226237366, 293650757, 192291550, 80246902, 112794418, 162237732, 129880905, 83999992, 63476631, 57798145, 70306442, 98319313, 147445419, 196153824, 221618027, 233333328, 238923172, 221176453, 146667480, 71663239, 51577446, 55544136, 75379608, 98450394, 106206436, 108213707, 107147476, 105129456, 106184814, 107278252]
464A07278252j137810j642151j147560p38640O2485M28581M69307N73135P84729N36705
474A05467033m11895n29976J58714K17964l9863m28322j502320j228881P34825R84405
484A03421684k23778n10978l46588k32102O1035J19904m791j03218l21793k84767n455
495A01569153J93573N25520M59908j34964k01828K52700J97793k88056m87968o54892
505A01430939m94095J45790L64304L22082K76871J52565m196k87934l67218l13522
515A01225586j72516J55190L17665M17091L96660J84273J24832J69472J68464J71639
525A03158356J29272K4056k5399m3533n1285m2412k1049Q2367o622l37151m38477l68118
537A02060005l66737l70903l93891m83253m35638k90490r3696K54867M00566L29567
$$ y = [107278252, 106140442, 104498291, 103350731, 102612091, 102674576, 103103157, 103572464, 104145599, 104930328, 105467033, 105055138, 104525162, 104683876, 104901840, 104861977, 104433655, 102931335, 101702454, 102437279, 103421684, 103197906, 102686928, 102340340, 102108238, 102169273, 102289177, 102284386, 102181168, 101859375, 101574608, 101569153, 101762726, 102288246, 102748154, 102613190, 102411362, 102664062, 102861855, 102573799, 102085831, 101430939, 100936844, 101082634, 101446938, 101769020, 102045891, 102198456, 102194260, 101906326, 101539108, 101225586, 101053070, 101208260, 101525925, 101943016, 102339676, 102523949, 102648781, 102818253, 102986717, 103158356, 103287628, 103311684, 103286285, 103242752, 103191467, 103149055, 103128006, 103210373, 103203751, 102866600, 102428123, 102060005, 101693268, 101322365, 100928474, 100445221, 100009583, 99719093, 99625397, 99880264, 100280830, 100610397]
547A00610397M51706Q19756Q12462M48394K74445J52847Q7548Q8401J11969K15859
557A04073784K12646J24977M9454r6229p9773J27456J78482J40091R1843l3119m7325
568A04742287M6257P1953O0462O4423R0576N8930l5782r2743j53595j52870m2084q0849
580A04576965k88940l27843k21351k12929k71248k78336k84195k06894k7732R6443
590A02553940K16720K85439L09128L09158L09204J92909j00753k11556k03842j80557
600A03479790j16249r949K21825K44072N8342o844j3229m2489r7991q4778j6838O6475
612A03682137J96693K86629M04953L63968J54548Q55k18178k42569o0814K0783Q5403
623A04674408J06621N7274P2448J42151J71395J94267J69205P1571M1489O1485O1012
$$ y = [100610397, 101062103, 101881859, 102694321, 103142715, 103417160, 103570007, 103657555, 103745956, 103857925, 104073784, 104286430, 104411407, 104460861, 104364632, 104284859, 104412315, 104590797, 104730888, 104822731, 104789612, 104742287, 104788544, 104860497, 104920959, 104985382, 105075958, 105134888, 105099106, 105006363, 104852768, 104699898, 104657814, 104576965, 104288025, 103960182, 103738831, 103525902, 103254654, 102976318, 102692123, 102485229, 102457497, 102553940, 102770660, 103056099, 103365227, 103674385, 103983589, 104176498, 104075745, 103864189, 103660347, 103479790, 103363541, 103353592, 103575417, 103819489, 103877831, 103870987, 103857758, 103815269, 103717278, 103632500, 103615662, 103682137, 103878830, 104165459, 104570412, 104934380, 105088928, 105089783, 104871605, 104629036, 104568222, 104589005, 104674408, 104781029, 104838303, 104910751, 105052902, 105224297, 105418564, 105587769, 105659340, 105700829, 105762314, 105823326]
634A05823326M5822O3210J15341J46126J79580J75644J40496Q9195n508m9828q0658
645A06642746m4487P7530J56235K43621K60491K10167J58310N5458L3783J17424P7484
656A07988762r2247j38138o4064j08551k72537l13805l55697j47271J59478R21485
666A07577415L127938K465034j624061k598503j389260q13606N0568L32115M5257M219
676A07177116L1662K2431K579k7085o2347j21094j80313l14499n50438p06695q14538
687A04456779r30709j011711j175065j348426j704003k310920k720757l310135l021095
696H6923958j899124q20427O60759J637649K432038K663467K206612J942947J607895
705I7355774J378052J257873J052788P50160N94734N63004N04112M80744L92845K19131
$$ y = [105823326, 105869148, 105932358, 106047699, 106193825, 106373405, 106549049, 106689545, 106778740, 106773232, 106723404, 106642746, 106598259, 106675789, 106832024, 107075645, 107336136, 107546303, 107704613, 107760071, 107793854, 107911278, 107988762, 107896515, 107758377, 107694313, 107585762, 107313225, 106999420, 106643723, 106496452, 106655930, 107577415, 110705353, 113170387, 111546326, 108947823, 107558563, 106744957, 106795525, 107127640, 107172897, 107177116, 107208778, 107231209, 107233788, 107206703, 107144356, 107023262, 106842949, 106528450, 105978012, 105271317, 104456779, 103526070, 102514359, 101339294, 99990868, 98286865, 95975945, 93255188, 89945053, 86923958, 85024834, 84204407, 84865166, 86502815, 88934853, 91598320, 93804932, 95747879, 97355774, 98733826, 99991699, 101044487, 101794647, 102389381, 102952385, 103456497, 103937241, 104330086, 104549217]
715A04549217J44509J26762J49490K85004K60208Q3023n180p1068q9287m0939k7229
726A05364510j8906l1921q0277r2102n7556q7998j84944k31003k47283k66861k67411
737A03798248l05389l71292m47037n21973o57074q91807j007775j063797j042961r57183
747I6531960p75834m69711j86371J19972M13468Q21876Q69652N81528L33832k7466
757I8212906k62833m43527n24094n05180m29939k53060j12800l548J90300M83322P01477
768I7053024R01245J030449J101067J117157J084206R75967P59056N93231M23691L09898
778A05348991K38655K03232K51389J98791M0627j9600j3870j7792M509j4900q8860
789A06131172r8205l7865m7394j23665j39785j09795j04424j05430j15303j80764j12747
$$ y = [104549217, 104693726, 104820488, 104969978, 105254982, 105515190, 105598213, 105593033, 105521965, 105432678, 105391739, 105364510, 105345604, 105313683, 105233406, 105141304, 105083748, 104995750, 104810806, 104579803, 104332520, 104065659, 103798248, 103492859, 103121567, 102674530, 102152557, 101495483, 100603676, 99595901, 98532104, 97489143, 96531960, 95756126, 95286415, 95100044, 95220016, 95633484, 96455360, 97325012, 97906540, 98240372, 98212906, 97950073, 97506546, 96982452, 96477272, 96047333, 95794273, 95681473, 95677925, 95868225, 96351547, 97053024, 97954269, 98984718, 100085785, 101202942, 102287148, 103263115, 104022171, 104615402, 105039093, 105348991, 105587646, 105790878, 106042267, 106241058, 106281685, 106262085, 106248215, 106230423, 106234932, 106220032, 106131172, 106032967, 105995102, 105947708, 105824043, 105684258, 105574463, 105470039, 105364609, 105249306, 105068542, 104955795]
800A04955795J70418J53015j81526k51228r8419j35804l34663l97278m15710l19596
810A03145004M8920j2299m96795p28485q63861r53202j097961q42095j51901L81760
820I8429085J075577J253242Q97652P53494O85310M90288P7057J3733K99667L69072
830A04344177L84735K61284j4831l04146p28775r40041r38148j070954j355888j375534
840I8261879j207756r58801n72419j67373L46924P26844J067711J231766J222183J164032
850A01114990J000473Q33534O24299M26178J72851P5913J30226J44386J88919J73096
860A04884865J06880M0985l3859j31554k49267l84690m94720p54311j162720j548172
870A00273437k123260k209656k013496j388886j64459Q28293K031776K507637K362442
$$ y = [104955795, 105126213, 105279228, 105097702, 104846474, 104748055, 104612251, 104277588, 103880310, 103464600, 103145004, 103193924, 103181625, 102684830, 101956345, 101092484, 100139282, 99041321, 98199226, 98047325, 98429085, 99504662, 100757904, 101655556, 102409050, 103094360, 103584648, 103661705, 103675438, 103975105, 104344177, 104728912, 104990196, 104975365, 104671219, 103942444, 103002403, 102064255, 100993301, 99637413, 98261879, 97054123, 96095322, 95522903, 95355530, 95702454, 96429298, 97497009, 98728775, 99950958, 101114990, 102115463, 102948997, 103573296, 103999474, 104172325, 104248238, 104378464, 104522850, 104711769, 104884865, 104991745, 105032730, 104998871, 104867317, 104618050, 104233360, 103738640, 102984329, 101821609, 100273437, 98150177, 95940521, 93927025, 92538139, 92373680, 93201973, 95233749, 97741386, 100103828]
879A00103828K108216J445747J059799Q02918N79933M27773K93655J94786J14990N7892
889A07189537K5154K7222K0508J8356J0872j0872j404N3139N1834l769j9142j0826
901A07350609p416K647J503J1353l8773j79885k17171j82823j43120o1752j7716k029
913A06515427K8282P7911Q4877N8296K3552m5440o9931n8480n5763o2538l1143N2025
925A06517075Q4732Q9935P7965L3401P271R819n1163j74209k73110l82950m49775n02876
937A04986115m79195l87909k55531j9745R6443J46530J39427K4842n295J1612L2905
948A04290199R2507R7038N4260K6230p133k7871m1603m4082j9028l5904r9441j21407
960A04163765j15540j15249j13083j05599r7320p3715l5500N287N5771R9465J37542
$$ y = [100103828, 102212044, 103657791, 104717590, 105520508, 106100441, 106528214, 106821869, 107016655, 107131645, 107189537, 107214691, 107241913, 107262421, 107280777, 107291649, 107280777, 107279373, 107332512, 107384346, 107380577, 107361435, 107350609, 107343193, 107345840, 107347343, 107358696, 107319923, 107140038, 106922867, 106740044, 106596924, 106535172, 106517456, 106515427, 106543709, 106621620, 106706497, 106764793, 106788345, 106742905, 106672974, 106614494, 106558731, 106496193, 106465050, 106517075, 106601807, 106691742, 106769707, 106803108, 106810379, 106820198, 106769035, 106594826, 106321716, 105938766, 105488991, 104986115, 104506920, 104119011, 103863480, 103843735, 103940178, 104086708, 104226135, 104250977, 104245682, 104257294, 104290199, 104382706, 104479744, 104534004, 104560234, 104553101, 104525230, 104483627, 104439545, 104420517, 104384613, 104285172, 104163765, 104048225, 103932976, 103819893, 103714294, 103616974, 103543259, 103507759, 103513046, 103568817, 103668282, 103805824]
971A03805824J81633K40822K66724K62588K63550K75230K39609J53763Q7303K0699
981A05797745l7506r2621j32187j61163j72379j74957j39710n1689M6L0281O8832J33156
993A05067848J23337M9042k8824j49757k16836k47383k69294k71393k70531k55752
1003A03530457k54395k45903k85362l80089m45869n00443n57274o16791o63879p05483
1013I8874969p29270p35497p35573p28554p07077o83212o16150n29953l69217j45462
1023I2895004J31798N45837P72759Q85849R15886Q28216P30584N50872M69773M41078
1033I9167656M68780O05820O36391O12564N41710L95302K79709J79580M9805j10817
1043A02826500k52632l74245n31196p03713r15459j208206j391151j529358j553536
$$ y = [103805824, 103987457, 104228279, 104495003, 104757591, 105021141, 105296371, 105535980, 105689743, 105777046, 105797745, 105760239, 105667618, 105535431, 105374268, 105201889, 105026932, 104887222, 104835533, 104835579, 104865860, 104934692, 105067848, 105191185, 105240227, 105211403, 105061646, 104844810, 104597427, 104328133, 104056740, 103786209, 103530457, 103276062, 103030159, 102744797, 102364708, 101918839, 101418396, 100861122, 100244331, 99580452, 98874969, 98145699, 97410202, 96674629, 95946075, 95238998, 94555786, 93939636, 93409683, 93040466, 92895004, 93026802, 93572639, 94345398, 95231247, 96147133, 96975349, 97705933, 98256805, 98726578, 99167656, 99636436, 100242256, 100878647, 101491211, 102032921, 102428223, 102707932, 102887512, 102937317, 102826500, 102573868, 102199623, 101668427, 100964714, 100049255, 98841049, 97449898, 95920540, 94367004]
1052I4367004j517654j275421q54706k90421N74402J146622J635315J797226J609108
1061I7191475J407005J035355P80250N63523M11560L53554K46162J17088j312j28983
1071A01975677k18482k79046l21510l71834l15506j42738p393J73264K22038J73424
1081A00887894O6497j20979l39287n98289r08638j308945j634308k036239k073838
1090I1933868j881118j362969l94180M29039J410149J931358K133056K071213J600243
1099I7870659J246162Q35999N35629K96829J46485R5657P3189J24458J39023J47743
1109A01511833J37543J07315P4455L1090q888n2002q6067j22765j27769j16158o2180
1120A01286407M5067J36132K40280L09852L63373L74054L31711L03818K84889K29355
$$ y = [94367004, 92849350, 91573929, 90719223, 90428802, 91003204, 92149826, 93785141, 95582367, 97191475, 98598480, 99633835, 100414085, 100977608, 101389168, 101742722, 101988884, 102105972, 102104660, 101975677, 101757195, 101478149, 101156639, 100784805, 100469299, 100326561, 100319168, 100492432, 100714470, 100887894, 100954391, 100833412, 100494125, 99895836, 98987198, 97678253, 96043945, 94007706, 91933868, 90052750, 88689781, 88295601, 88724640, 90134789, 92066147, 94199203, 96270416, 97870659, 99116821, 99952820, 100488449, 100785278, 100931763, 101027420, 101100609, 101225067, 101364090, 101511833, 101649376, 101756691, 101831146, 101862236, 101853348, 101801346, 101715279, 101592514, 101464745, 101348587, 101286407, 101331474, 101467606, 101707886, 102017738, 102381111, 102755165, 103086876, 103390694, 103675583, 103904938]
1130A03904938J19163P1862P8125N7388J7288P530L1571K5627r682j3061K3864N959
1142A04320572o2821j03210j28822j64505j93718k57965l61924m45510n16343o04171
1152A01481583p06894q03322r19701r72343r93157r38179q32534o19744k87102N7747
1162I4466354N00008Q06213J054932J165291J123123J066017R45900Q17253O52672
1171A02597763N07088L57918K40585J45958P4936K1270Q675O1157N9006K9068j6434
1182A04086990q0558j63506k65816l85284n19508o80573q60878j078918j355935j588630
1192I7107384j870987j930596j856277j565193r87435m85519O2012N31631R81972J301956
1202I1288948J519486J633811J644471J553703J321342J105591Q51822O20079L87429
$$ y = [103904938, 104024101, 104095963, 104174088, 104231476, 104248764, 104256294, 104287865, 104313492, 104303810, 104290749, 104314613, 104320572, 104257751, 104154541, 104025719, 103861214, 103667496, 103409531, 103047607, 102602097, 102085754, 101481583, 100774689, 99971367, 99051666, 98079323, 97086166, 96147987, 95315453, 94695709, 94408607, 94466354, 94966362, 95772575, 96827507, 97992798, 99115921, 100181938, 101127838, 101945091, 102597763, 103104851, 103462769, 103703354, 103849312, 103924248, 103945518, 103954193, 104015350, 104074356, 104103424, 104086990, 104006432, 103842926, 103577110, 103191826, 102672318, 101991745, 101130867, 100051949, 98696014, 97107384, 95236397, 93305801, 91449524, 89884331, 88896896, 88411377, 88473389, 89005020, 89986992, 91288948, 92808434, 94442245, 96086716, 97640419, 98961761, 100067352, 100919174, 101539253, 101926682]
1211A01926682J85417K456j46865k32575l89389n82550q16437j162628j330734j483750
1221I5969627j260208o63330m1694Q63761J365281J627494J679520J425194J219719
1230A02185364R39323P23770N35057L85094K72560J90590J36406J27838J82389K11975
1240A05890366K48199K52579K34909J94313J08673O7307O2965L5263L59m6235j07070
1251A06941628j67534k20803l09036m32350n48195o59492p97295r75967j107171j285141
1261A00438644j221328r89670n82863J31607O16142J042275J261352J273842J226235
1270A03196236J042801Q79760O76827N18844L84018K74468K10548J08505l1234j26786
1280A07133987k20039k25594j39068o3683M3846J13587J67961J86852J69868J38336
$$ y = [101926682, 102112099, 102114555, 101967690, 101735115, 101345726, 100763176, 99946739, 98784111, 97453377, 95969627, 94709419, 94046089, 94004395, 94868156, 96233437, 97860931, 99540451, 100965645, 102185364, 103124687, 103848457, 104383514, 104768608, 105041168, 105231758, 105368164, 105496002, 105678391, 105890366, 106138565, 106391144, 106626053, 106820366, 106929039, 106996346, 107059311, 107094574, 107094933, 107048698, 106941628, 106774094, 106553291, 106244255, 105811905, 105263710, 104604218, 103806923, 102830956, 101723785, 100438644, 99217316, 98227646, 97644783, 97776390, 98392532, 99434807, 100696159, 101970001, 103196236, 104239037, 105118797, 105795624, 106314468, 106698486, 106972954, 107183502, 107292007, 107260773, 107133987, 106913948, 106688354, 106549286, 106485603, 106529449, 106643036, 106810997, 106997849, 107167717, 107306053]
1290A07306053O6971L5309J4831M0100J35399J68778J65008J56807J41640R6733M959
1301A08332588m2564n3589q8432j53473j63002j31089q7379k5726N8746K08046K48955
1312A08103081J89308J70990J58623J51565J64627J39000P2144L2898O080j6739l1471
1323A09140106m6249o4545o4682m7684l1448m120M456r941p18J8006N5885J25382J66992
1336A09241440K15744J90971Q2398J1543o8909r1552m7417m0032m9209n2361n7930
1347A09334686n4718k8564m7379j20277j43219j07193j52207k72491l51189m07005
1357A07650444m82033n78216o45706o86623p42699q68629q04138n68245l45185k9709
1367A01899261J41221K11143K42760K62779J01662k46521n88921j074387j300407j334305
$$ y = [107306053, 107373024, 107408333, 107423164, 107463264, 107598663, 107767441, 107932449, 108089256, 108230896, 108327629, 108332588, 108290024, 108236435, 108148003, 107994530, 107831528, 107700439, 107613060, 107587334, 107646080, 107854126, 108103081, 108292389, 108463379, 108622002, 108773567, 108938194, 109077194, 109149338, 109182236, 109188316, 109171577, 109140106, 109093857, 109029312, 108964630, 108916946, 108885498, 108881378, 108885834, 108875893, 108875175, 108893181, 108949066, 109074448, 109241440, 109457184, 109648155, 109730553, 109742096, 109673187, 109581635, 109534218, 109494186, 109444977, 109392616, 109334686, 109279968, 109251404, 109204025, 109083748, 108940529, 108833336, 108681129, 108408638, 108057449, 107650444, 107168411, 106590195, 105944489, 105257866, 104515167, 103646538, 102842400, 102274155, 101928970, 101899261, 102040482, 102251625, 102494385, 102757164, 102858826, 102612305, 102023384, 100948997, 99648590, 98314285]
1377I8314285j309494j227493r48883n00107Q4969R67956J536133K025368K104873
1386A01047607J744820J395371P96485N37941N52491N19134N85243M82323J64627Q3374
1396A07909416K19322J98197N2116K6657Q1566J32012K51220K30858M8493K052M6776
1407A09198685O3759R5581R0477L9123L0426L1326Q5000K11616K87079M10293L09517
1418A10852882q7829k19849j91612j44745L1799L5340j55594j52664L1379N8983j5114
1429A10042976p2456j95885j72805L265R3674K38159J16249l70735n07813l93890l48374
1440A08432365k63427k51297l16170l29063k60468l57513o42128p79557q60794q56704
1450A03515244p87713o01341l37936J11084R93820J209045Q67371O27228K03254P8293
$$ y = [98314285, 97004791, 95777298, 94828415, 94328308, 94413277, 95381233, 96917366, 98942734, 101047607, 102792427, 104187798, 104984283, 105522224, 106074715, 106593849, 107179092, 107661415, 107826042, 107909416, 108128738, 108326935, 108379051, 108405708, 108487274, 108619286, 108870506, 109101364, 109149857, 109151909, 109198685, 109262444, 109358025, 109448502, 109487625, 109518051, 109549377, 109634377, 109845993, 110133072, 110543365, 110852882, 110765053, 110545204, 110353592, 110208847, 110240646, 110275986, 110120392, 109967728, 109999107, 110058090, 110042976, 109970520, 109774635, 109601830, 109605095, 109698769, 109936928, 110053177, 109682442, 109174629, 108780739, 108432365, 108168938, 107917641, 107601471, 107272408, 107011940, 106654427, 106012299, 105232742, 104371948, 103515244, 102727531, 102126190, 101788254, 101899338, 102893158, 104102203, 104969574, 105596802, 105800056, 105878349]
1460A05878349K02179K92732N22309M83627J37451M7966J03737J86203L78922M66133
1470A08699608N69366M18045j15875k49740n8198k5444p3715k9800J12648J54831J33232
1481A09534958J00563K403L624J15517J27937J26213k0950l37677n96451r89983r75090
1492A07091064n65498k49626J67007L94776M76982N29961M99748M85847M15108M80606
1502A09725975O87172Q22372J139595Q37563k90009o16714l71269k65358p3242J3656
1512A11609741j8280P6554L63517L35404q2161q4587L39409L39942l868j58851k92473
1523A12424347k68341Q850K1240k23373k38297j07223J7669K67342K70027J7746q5884
1534A12104103k33673n8052O13495P22984M29482J54358l61229n03426k86957k67097
$$ y = [105878349, 106080528, 106373260, 106895569, 107379196, 107516647, 107564613, 107668350, 107854553, 108233475, 108699608, 109268974, 109687019, 109571144, 109321404, 109263206, 109237762, 109164047, 109134247, 109246895, 109401726, 109534958, 109635521, 109637924, 109641548, 109757065, 109885002, 110011215, 109990265, 109652588, 109056137, 108066154, 107091064, 106525566, 106275940, 106442947, 106837723, 107314705, 107844666, 108344414, 108830261, 109245369, 109725975, 110413147, 111235519, 112375114, 113212677, 112922668, 112305954, 111934685, 111669327, 111596085, 111609741, 111591461, 111668015, 112031532, 112366936, 112284775, 112200188, 112539597, 112879539, 112875671, 112716820, 112424347, 112156006, 112164856, 112186096, 111962723, 111724426, 111617203, 111634872, 111902214, 112172241, 112189987, 112104103, 111870430, 111812378, 112425873, 113148857, 113578339, 113732697, 113371468, 112868042, 112581085, 112313988]
1544A12313988l89481l16315l7452O8519O6712P5195L5957O2699J42837K13074K33673
1555A12469406M26727J103280P96722o94679j097489p79747n42900j6571J18996j41434
1565A11642311r6794K28165K31239l2188j81694m04427l32550J29913K30980J01662
1575A11516617l0159l46230l47732j9509P8919N6076L7269k8808o2271q5114q9668
1586A10679390q0063m7638K9778N4550M4517K5650j2992n3742j18469j37329j19141
1597A10264511r8801o2988l0418J7547K4842j8792j6281J7525M4800Q9287R3841N5695
1609A10380768M2869J3993O6307K34436K82242L22075J40434m04335n32418l47923
1619A10198448k14241Q6785M5799l98682m91714l77060k34703O7924J80275J13960
$$ y = [112313988, 111924507, 111608192, 111570740, 111639259, 111705971, 111781166, 111817123, 111879822, 112022659, 112235733, 112469406, 112896133, 113999413, 114796135, 114101456, 113003967, 112224220, 111681320, 111664749, 111783745, 111642311, 111545517, 111773682, 112004921, 111972733, 111791039, 111386612, 111054062, 111183975, 111414955, 111516617, 111486458, 111140228, 110792496, 110772987, 110851906, 110907982, 110945251, 110916443, 110854172, 110769058, 110679390, 110599327, 110551689, 110581467, 110636017, 110680534, 110706184, 110693192, 110639450, 110520981, 110383652, 110264511, 110165710, 110102722, 110072304, 110089851, 110114693, 110095901, 110079620, 110097145, 110141945, 110231232, 110325073, 110380768, 110423637, 110437630, 110503937, 110738373, 111020615, 111342690, 111483124, 111078789, 110546371, 110198448, 109984207, 110070992, 110116791, 109718109, 109226395, 108849335, 108614632, 108682556, 108862831, 108976791]
1629A08976791J72783K96448M21959O69502O21224L03741K8229m33251m80293q0108
1639A10497025L5446l6118M6967K60566L59185M84703L14758l15758m24225j76544
1649A11046005J08048Q44742O91917m56192q35106p87926p06985m01856k42134j46728
1659A09113785p0809K2606n9486m11942m62410k91351j49582J32942J26503j66748
1669A07783508l25821n37635m75647l601O942m43817m85519k51175p9369J21407L23654
1680A05632927N68245P19116R30908P20932j34018k58514K68600L87093K93091K62214
1690A09390594J73211K35435N25139N27977K69440J61720R0073J01326L48144J72852
1700A11995911n74730o36345n5168Q3114k1621q3214k28668k36313j21476m4731L7888
$$ y = [108976791, 109149574, 109446022, 109867981, 110537483, 111158707, 111462448, 111490677, 111057426, 110577133, 110497025, 110532471, 110496353, 110543320, 110803886, 111163071, 111647774, 111962532, 111646774, 111222549, 111046005, 111154053, 111998795, 112690712, 112234520, 111399414, 110611488, 109904503, 109502647, 109260513, 109113785, 109042976, 109065582, 109006096, 108594154, 108131744, 107840393, 107690811, 107823753, 107950256, 107783508, 107457687, 106920052, 106444405, 106440804, 106447746, 106003929, 105518410, 105267235, 105187866, 105309273, 105632927, 106201172, 106920288, 107851196, 108572128, 108438110, 108179596, 108448196, 108835289, 109128380, 109390594, 109563805, 109799240, 110324379, 110852356, 111121796, 111283516, 111373589, 111474915, 111823059, 111995911, 111421181, 110784836, 110729668, 110812782, 110791161, 110707947, 110479279, 110242966, 110121490, 110076759, 110114647]
1711A10114647J11099J89827K29622K91420J75858j55877l49166n59395n19730j53473
1721A09374832l4263o5995n9509r5963l9909J23284J99508K11983K61734L57887L62854
1732A10596443L57529J55807m43382m49875J70227K91138P2266J617n1903n2070J7761
1743A10665558N4458P4219J15227K08374J91597P8918k3895j97166k25334j30341l9986
1754A10771629J44913J55235l8841m9209J00784J16081M7592j3305j48751j21689R8084
1765A11062523J52351O9855R3750K24281K16980J16280j1086k66861l10829j59904
1775A11187340q6617k1248K9641Q7211P3197m7402n6434M4487M3396n2788n9937k0500
1787A11120346N1086K20902K39105J50917K5109k51267k95357j18873n8060m7821j2398
$$ y = [110114647, 110225746, 110415573, 110645195, 110936615, 111112473, 110956596, 110607430, 110048035, 109528305, 109374832, 109340569, 109274574, 109215065, 109119102, 109079193, 109202477, 109401985, 109613968, 109875702, 110233589, 110596443, 110953972, 111109779, 110666397, 110216522, 110386749, 110677887, 110750153, 110751770, 110699867, 110647797, 110665558, 110720016, 110794235, 110909462, 111117836, 111309433, 111388351, 111364456, 111167290, 110941956, 110811615, 110771629, 110916542, 111071777, 111032936, 110983727, 111084511, 111200592, 111248184, 111234879, 111086128, 110964439, 111062523, 111214874, 111284729, 111378479, 111602760, 111819740, 111936020, 111924934, 111658073, 111347244, 111187340, 111100723, 111079475, 111109116, 111196327, 111269524, 111222122, 111165688, 111210175, 111253571, 111200783, 111140846, 111120346, 111171432, 111392334, 111631439, 111782356, 111807465, 111556198, 111260841, 111141968, 111083908, 111036087, 111023689]
1798A11023689N7411M8829m5517q3611j02592r6321n5481k3774J6426L8247N8082L7140
1810A10872528m5319o7573n0804l1922J2017K6130J4038J5954K0408L2639M8851P8651
1822A10925598J61865J29464o4660o7260J27151J43051L5164l9978j69563j61697O652
1833A11025787N1453J7639R247J121j0299n7884o913J77765K20604J89141Q8691j76666
1845A11529686k28813q6235n3093p9376o1249o790J2275R606K289k3316k9991k2934
1857A10962059j8860j0918r895k2888j0826J9165N6557J29432J35758J02691K3339
1868A11355614j59264k10403j60889j22238m6509j4000j3733r559j3230j3923j8242
1879A10573624j0704J2992J9791J2680J2497R224K1767O8908N6549j9760m8263o1959
$$ y = [111023689, 111081100, 111129929, 111084412, 111000801, 110898209, 110801888, 110746407, 110722633, 110739059, 110777306, 110835388, 110872528, 110827209, 110759636, 110708832, 110676910, 110688927, 110715057, 110729095, 110745049, 110765457, 110798096, 110846947, 110925598, 111087463, 111216927, 111152267, 111085007, 111212158, 111355209, 111390373, 111350395, 111180832, 111019135, 111025787, 111077240, 111094879, 111104126, 111105247, 111094948, 111037064, 111030151, 111207916, 111428520, 111617661, 111706352, 111529686, 111300873, 111214638, 111161545, 111082169, 111020920, 111014130, 111026405, 111036011, 111038300, 111014984, 110984993, 110962059, 110943199, 110932281, 110922386, 110899498, 110888672, 110907837, 110964394, 111093826, 111229584, 111332275, 111355614, 111196350, 110985947, 110825058, 110702820, 110656311, 110642311, 110628578, 110619019, 110605789, 110591866, 110573624, 110562920, 110575912, 110595703, 110608383, 110620880, 110630104, 110651871, 110720779, 110777328, 110757568, 110709305, 110647346]
1891A10647346m0626N0354N2017l9100n0255k144J5236K6771K2766j1489p752L5835
1903A10698959M3633K1721K1171M1390L3661q55j8333l7621k7138J3756N0736J19545
1915A10960625J11458K4681k5200q6861q1299J8837K4941n1338o8207n2552l8955j2779
1927A10723351J792J0369J4396J3924P248r537j9233k3346l3379o1127m8065J1704
1939A10588097L5881N7792K6253r0218j14585o2203m8996n4649m4632j9425j2016k5345
1951A10235954j4808K3437K9442L578M151L0326K7062m555j4114j0750q392l960L883
1964A10301254K0836K2652J1902K334j8837j4282J9386L1281L2448K9327J7449Q056
1976A10463806p362o035J9623J6311k0195j9790J3878K5032K5795K3147N585J1917
$$ y = [110647346, 110606720, 110657074, 110709091, 110669991, 110619736, 110617592, 110632828, 110659599, 110682365, 110670876, 110663124, 110698959, 110742592, 110764313, 110785484, 110826874, 110860535, 110859680, 110841347, 110803726, 110776588, 110790344, 110841080, 110960625, 111072083, 111096764, 111071564, 110984703, 110903404, 110922241, 110947182, 110895844, 110827637, 110775085, 110736130, 110723351, 110725143, 110735512, 110749908, 110763832, 110771080, 110761543, 110742310, 110718964, 110685585, 110624458, 110576393, 110588097, 110623978, 110681770, 110708023, 110617805, 110503220, 110441017, 110392021, 110337372, 110292740, 110273315, 110261299, 110235954, 110221146, 110244583, 110274025, 110277603, 110281754, 110312080, 110339142, 110334587, 110320473, 110309723, 110301331, 110297371, 110301254, 110322090, 110344742, 110356644, 110358978, 110340141, 110325859, 110345245, 110376526, 110408974, 110438301, 110455750, 110463806, 110456444, 110450409, 110470032, 110486343, 110466148, 110446358, 110460236, 110485268, 110511063, 110534210, 110539795, 110551712]
1988A10551712M8615N0880L3165K403p4096p2525J6349L1784r964j3542Q461J1063
2000A10584305L13l289p278k289J8936J7929l296j4419k7924k4505k076J1277K5680
2013A10573364K8534K4918P080l8361n0262l9047k4247J1681J7784n508r293k388J427
2026A10495682Q682O866n386j0162r011j3778k8565k5245k053N463N218J000j6304
2039A10412407j4214P897J5091J5327J1658K052q751k8564l1136j6929j0582q393q62
2052A10345001J1902K0668L1380K9350J6045J37l4851l1876J7594K2102j3328j7426
2064A10396698J282N317o40J831J5548J0750j5777k1485j1230q225p606n959o317r9
2078A10354088J9859J6144j4282k2171j7594r613J3611J3573r232j8547k4559k3056
$$ y = [110551712, 110600327, 110651207, 110684372, 110686775, 110612679, 110540154, 110556503, 110588287, 110578323, 110564781, 110573242, 110584305, 110584618, 110581329, 110574051, 110571762, 110590698, 110608627, 110605331, 110590912, 110562988, 110538483, 110536407, 110547684, 110573364, 110601898, 110626816, 110633896, 110595535, 110545273, 110506226, 110481979, 110493660, 110511444, 110505936, 110496643, 110494255, 110495682, 110504364, 110511230, 110505844, 110495682, 110486671, 110472893, 110444328, 110419083, 110417030, 110422493, 110427711, 110428711, 110412407, 110398193, 110406090, 110421181, 110436508, 110448166, 110450218, 110441467, 110412903, 110381767, 110364838, 110354256, 110345863, 110345001, 110356903, 110377571, 110408951, 110438301, 110454346, 110454483, 110419632, 110387756, 110405350, 110427452, 110414124, 110396698, 110397980, 110403297, 110402657, 110404488, 110420036, 110430786, 110415009, 110393524, 110382294, 110374069, 110366463, 110360504, 110354187, 110354088, 110373947, 110390091, 110375809, 110353638, 110336044, 110326431, 110340042, 110353615, 110344383, 110325836, 110301277, 110278221]
2090A10278221m455j1658n0095n5191l1235k5817l1281l0922l0044k4369j1200n584
2102A09966370k762o745k8778k0195K3819L5096J8402K2605M4846M7394L3073K8061
2114A10161186K7512K4391K2484J3611q889j0139R659J6235J8311J5144O889o393l6835
2127A10253166l6217M28M821j8310j9981r110Q09K0599K0104j694j0872j7433j5351
2140A10170959N150j335l9337m5372k9327j5091R918J8951J7357J0422j4374j2260
2152A10075661J9478K5016J3398M219j5046j4114J3710J0994k4849k6100J976J2489
2164A10096832J8196J4756n677p530J1276O676k4368k5864J717M074j5686j5740K098
2177A10060760L197j0231j2703p866o942r819n845P348R605J121J191P057J0445J5495
$$ y = [110278221, 110273766, 110262108, 110212013, 110156822, 110125587, 110099770, 110068489, 110037567, 110007523, 109983154, 109971954, 109966370, 109963608, 109956863, 109928085, 109907890, 109931709, 109966805, 109985207, 110007812, 110052658, 110100052, 110133125, 110161186, 110188698, 110213089, 110235573, 110249184, 110240295, 110230156, 110239815, 110256050, 110274361, 110289505, 110296394, 110290001, 110253166, 110216949, 110217377, 110222198, 110203888, 110183907, 110174797, 110175606, 110196205, 110216309, 110214615, 110203743, 110186310, 110170959, 110176109, 110174774, 110135437, 110090065, 110060738, 110045647, 110055565, 110074516, 110091873, 110102295, 110087921, 110075661, 110095139, 110120155, 110133553, 110137772, 110122726, 110108612, 110122322, 110133316, 110108467, 110082367, 110084343, 110096832, 110115028, 110129784, 110124107, 110116577, 110127853, 110134529, 110110161, 110084297, 110086014, 110090088, 110074402, 110058662, 110060760, 110063957, 110053726, 110041023, 110033157, 110026215, 110016396, 110010551, 110017899, 110027504, 110028625, 110029816, 110036873, 110047318, 110062813]
2191A10062813J3778O318k648k1980k0813L578R300M883k075j9142k3964j8044j7791
2204A09974213k3384j7762K434O531o676j671K4704K4292m318p294J3733J1154j5159
2217A09980797j7311K433N059n585o241J427M27j2276p919J9074J7456j3184k0294
2230A09943863j1108r346r087j0513j6571j5442j0544k82K1911K7985K1438J6381N172
2243A09953857L983J6067J2131j0483j1825K403J4832L8459L8407J2466M410M105P988
2256A10086800K3002K4872J3519J3161K3193K1599O752O867K1095K4445K2125J8043
2268A10305473P515N219J2520R369O8j2825l7811m3488k7488l0785n2788n5046n1880
2281A10028053k4681L4622P4814J18996J26053Q6975P8605Q5358R2529J03997J18995
$$ y = [110062813, 110076591, 110082909, 110080261, 110058281, 110037468, 110041046, 110050346, 110055229, 110053154, 110034012, 110010048, 109992004, 109974213, 109950829, 109933067, 109935501, 109942032, 109935356, 109933685, 109958389, 109982681, 109978363, 109971069, 109984802, 109995956, 109980797, 109963486, 109965919, 109970978, 109965393, 109959152, 109960579, 109961006, 109948730, 109940811, 109959885, 109977341, 109964157, 109943863, 109932755, 109923409, 109914322, 109903809, 109887238, 109871796, 109861252, 109860970, 109882881, 109910866, 109932304, 109948685, 109953857, 109957840, 109973907, 109986038, 109975555, 109963730, 109966133, 109980965, 110019424, 110057831, 110070297, 110074707, 110078812, 110086800, 110109802, 110134674, 110148193, 110161354, 110184547, 110206146, 110212898, 110219765, 110240860, 110265305, 110287430, 110305473, 110312988, 110318207, 110330727, 110340096, 110340164, 110327339, 110289528, 110246040, 110218552, 110187767, 110134979, 110079933, 110028053, 110003372, 110037994, 110112808, 110231804, 110357857, 110444832, 110523437, 110608795, 110701324, 110805321, 110924316]
2292A10924316J47080J50581J29753J21094J09284J18904J56852J70685J61652J77048
2302A12367249K08282K42111K91901L17451L26256L28346L24013L02025K54372K24350
2312A15186356J75094K10785L28804M35089N92446O43615O05034N67940N08278M30679
2322A19684120K88277K63664L63663L78250L29971L38700M31152L80394J79871Q2534
2332A22720596M769K7992K00127K48008J99860K15584L29277K44209j3084k52175n19897
2343A23405266q19496j339981j322174q92853l04055P43340J304916J617264J678368
2352A24070595J336624J200386J197151J008339O45233L81256J51017n7358k23023
2361A29710220m17755o45828q18443r67530j054496j063660j096657j130386j155876
$$ y = [110924316, 111071396, 111221977, 111351730, 111472824, 111582108, 111701012, 111857864, 112028549, 112190201, 112367249, 112575531, 112817642, 113109543, 113426994, 113753250, 114081596, 114405609, 114707634, 114962006, 115186356, 115361450, 115572235, 115901039, 116336128, 116928574, 117572189, 118177223, 118745163, 119253441, 119684120, 119972397, 120236061, 120599724, 120977974, 121307945, 121646645, 122077797, 122458191, 122638062, 122720596, 122725365, 122753357, 122953484, 123201492, 123401352, 123616936, 123946213, 124190422, 124177338, 123925163, 123405266, 122585770, 121245789, 119923615, 119030762, 118726707, 119470047, 120774963, 122392227, 124070595, 125407219, 126607605, 127804756, 128813095, 129458328, 129839584, 129990601, 129933243, 129710220, 129292465, 128646637, 127828194, 126860664, 125806168, 124742508, 123645851, 122515465, 121359589]
2370A21359589j200035j164414j038834r62501r00620q53347q25531p97768p92580
2379A12823959p39639o46049n54085m46198l50334k53242j80107j30868q0513k6702
2389A09416222m174j5258j6114k0653j7257o272J740J0658J5282J7547J4924N294o94
2402A09401245p675p698J526K838N26n775k1530k4674j6166j4283j6281j5167j4679
2415A09262207o897J2566J8142J0277J2543K9327J9242k6375l1853k312O775R751M432
2428A09317825j9165j8905M196J1940J3138J0658k388j526J8150J2467k0195k9473
2440A09296722k3674k0050j3633p325P7O698J5259J6472J4000K334k8755l3142j2085
2453A09212898o698j0300q705l571k411n508m364j404M364J8662J7387K37p676j3900
$$ y = [121359589, 120159554, 118995140, 117956306, 116993805, 116093185, 115239838, 114414307, 113616539, 112823959, 112084320, 111438271, 110884186, 110437988, 110087654, 109834412, 109654305, 109523437, 109442924, 109416222, 109412048, 109396790, 109380676, 109360023, 109342766, 109336494, 109338234, 109348892, 109364174, 109381721, 109396645, 109401939, 109401245, 109393570, 109385872, 109387398, 109390236, 109390762, 109384987, 109363457, 109338783, 109322617, 109308334, 109292053, 109276886, 109262207, 109255310, 109267876, 109286018, 109296295, 109308838, 109338165, 109357407, 109331032, 109299179, 109296867, 109303642, 109313393, 109317825, 109298660, 109279755, 109283951, 109295891, 109309029, 109319687, 109317299, 109315773, 109333923, 109346390, 109326195, 109296722, 109273048, 109252998, 109239365, 109232040, 109232117, 109238815, 109254074, 109270546, 109284546, 109286880, 109258125, 109224983, 109212898, 109206200, 109195900, 109187195, 109183624, 109181213, 109175705, 109171341, 109169937, 109174301, 109192963, 109210350, 109210587, 109202911, 109189011]
2467A09189011j3497n104R08J2779P889j7715k5864k9327j5305L1540L6766N844q850
2480A09169075k3979k5467j3229j908J9142K1889O126M73K312o485l0227l3661k4254
2493A09059807p530L5713L3974j4283l1471l7926k9953K961J4999J7235J0917j5014
2505A09039429j7716J786M509n677n340N150L768r185j3184j1963j1421j4999k953
2518A08962204L2707L9963K9587J0368l6545m4685k0218n173J9097J9813n150j4495
2530A08987473j7830j8387j3901j0200m914j907k976K831J9478K0172P515k289j6762
2543A08948303k2201k1530j6999m837J953J1925L815l2257l5767j2924M35J9310J9333
2556A08858559n173p340Q248J2893J7388P271k6535l3333k0004r964P553J2809P653
$$ y = [109189011, 109175514, 109170410, 109171318, 109184097, 109191986, 109174271, 109148407, 109119080, 109103775, 109135315, 109172081, 109177925, 109169075, 109145096, 109119629, 109106400, 109104492, 109123634, 109145523, 109151649, 109152122, 109154434, 109147949, 109117722, 109084061, 109059807, 109052277, 109087990, 109121964, 109107681, 109076210, 109038284, 109008331, 109011292, 109026291, 109043526, 109054443, 109039429, 109021713, 109023499, 109028008, 109022331, 109016991, 109022141, 109025909, 109016724, 109003540, 108991577, 108980156, 108965157, 108962204, 108994911, 109034874, 109064461, 109074829, 109038284, 108993599, 108973381, 108968208, 108987305, 109007118, 109001968, 108987473, 108969643, 108951256, 108937355, 108927155, 108922241, 108920334, 108917358, 108920189, 108939667, 108959839, 108967354, 108965065, 108948303, 108926102, 108904572, 108887573, 108882736, 108884689, 108896614, 108900429, 108868172, 108832405, 108819481, 108819916, 108839226, 108858559, 108853386, 108846046, 108854294, 108867187, 108884575, 108891846, 108865311, 108831978, 108811974, 108802010, 108809563, 108822372, 108830025]
2569A08830025M142j167o676j0940k1553m9996m2991Q85K2606M6653L4050l2569m5014
2582A08727455j5449l746O820Q965J91k480p17n051k0462j6853J4183Q827m0840l9459
2596A08621384J3488K0531q705j5610j1520j0086q225m669J663M891K357J0254L9223
2609A08654976L0350k5895l2592J716J4046K3415J6517j5159k4437j9097j5358n767
2621A08602715m052q392j2421k1583k0523p584m959r705j1726j5289j3443o935n4R972
2635A08476021J6090K1408K0386R705Q033J9219R247l1113l1181J1970J5610j4496
2647A08530899j8829m151l311j3710j2970J976l624m0558l1013K9182M5182L2470K3629
2660A08535172O530l265o676j5709l4553l4661j6761o585R08J1063K8061K9854J7425
$$ y = [108830025, 108834167, 108833000, 108826324, 108815384, 108793831, 108743835, 108700844, 108701729, 108724335, 108770988, 108805038, 108772469, 108727455, 108712006, 108708260, 108715080, 108724045, 108724236, 108721756, 108721039, 108715988, 108695526, 108678673, 108692856, 108701683, 108660843, 108621384, 108634872, 108655403, 108646698, 108631088, 108619568, 108609482, 108601257, 108596588, 108598251, 108603142, 108605499, 108615753, 108654976, 108685326, 108659431, 108626839, 108628555, 108642601, 108666016, 108682533, 108667374, 108642937, 108623840, 108608482, 108602715, 108598663, 108590271, 108577850, 108556267, 108535744, 108528160, 108523201, 108513496, 108501770, 108486481, 108473038, 108466103, 108466049, 108476021, 108492111, 108513519, 108533905, 108543610, 108551643, 108570862, 108580109, 108548996, 108517815, 108529785, 108545395, 108530899, 108512070, 108507919, 108504608, 108490898, 108477928, 108479904, 108476280, 108435722, 108404709, 108433891, 108479073, 108511543, 108535172, 108541702, 108538437, 108531761, 108516052, 108481499, 108446838, 108430077, 108423492, 108424400, 108435463, 108463524, 108493378, 108510803]
2673A08510803Q797l983p461j717j22K220r99j1322j6602j8547k2384l2113k6870k625
2687A08377075L624j976p202k0172k0767j2162j930K2148J8479j8830k4894q965J053
2700A08305481K1790J4564k9686l5995j0849l457o034o87Q957J9195M3274L1784k3460
2713A08334877m0581l2951k9251k2438j2161O965J2947Q560M525l098r323j9096j7907
2726A08181068l906O87O25p85o539q056o150o439j0399o836R102O508k0477j7784J4259
2741A08124878K2743J6831J2611L677o94j572m058r819p126L998J1756K5849J8852
2754A08217926j6754k3461p087j877M600l318l8880l3714R415L3073N9837N6580J9386
2767A08275726l196k9328l5240k0622j0750L792J0368J6335M646l9002m0390K381P202
$$ y = [108510803, 108519600, 108515617, 108508156, 108506439, 108506317, 108508537, 108507538, 108496216, 108479614, 108461067, 108438683, 108406570, 108379700, 108377075, 108380699, 108378723, 108371521, 108351349, 108330582, 108318420, 108316490, 108338638, 108357117, 108338287, 108313393, 108304428, 108305481, 108327271, 108341835, 108312149, 108276154, 108265305, 108261848, 108255814, 108255127, 108264084, 108283279, 108326553, 108358337, 108334877, 108294296, 108261345, 108232094, 108209656, 108197495, 108204460, 108217407, 108225967, 108230492, 108227394, 108218071, 108198975, 108181068, 108177162, 108177849, 108178474, 108177689, 108171150, 108163094, 108156944, 108150505, 108140106, 108133270, 108142372, 108148880, 108128403, 108110619, 108124878, 108147621, 108164452, 108177063, 108180740, 108180046, 108178474, 108174416, 108164597, 108157471, 108161469, 108173225, 108199074, 108217926, 108201172, 108177711, 108170624, 108168747, 108173347, 108170029, 108131149, 108097435, 108106850, 108139923, 108199760, 108256340, 108275726, 108272530, 108243202, 108207962, 108187340, 108176590, 108180382, 108190750, 108207085, 108211731, 108172729, 108132339, 108134720, 108141922]
2780A08141922j7593k3438k0317j6945j0879l617R606J1085M647p317l3661m1420l4805
2793A07957268l0136j8906j9028l2142l3898k7778k4506j9791k0172k6748k8710k7748
2805A07647705k7992k8038k9610l1929l6545m8973m5845k5749j7906j4855j7357l2402
2817A07290504l1349j0086j3778m5136m8256k4391k4674m2633n3115o6803o6475m3106
2829A06820702n0141r2216r7657p0739o6262p5309p8965p5126r1294j25076j58737
2840A05839180k07520k28401k27264k23831k06589k01935k03110k10838k43568k26807
2850A03659317j63765j16348o1302k9801k2003o317J3992K0195J5351N607j5312k8725
2862A03270889k7870n8609j34987j55212j25031j23497j40648j37565j18256j05781
$$ y = [108141922, 108124329, 108100891, 108080574, 108063629, 108052750, 108049133, 108058739, 108069824, 108074471, 108067154, 108033493, 107992073, 107957268, 107927132, 107908226, 107889198, 107857056, 107823158, 107795380, 107770874, 107751083, 107730911, 107704163, 107675453, 107647705, 107619713, 107591675, 107562065, 107530136, 107493591, 107444618, 107398773, 107373024, 107355118, 107340263, 107322906, 107290504, 107259155, 107249069, 107235291, 107190155, 107141899, 107117508, 107092834, 107050201, 106997086, 106930283, 106863808, 106820702, 106770561, 106678345, 106580688, 106509949, 106443687, 106368378, 106289413, 106214287, 106122993, 105997917, 105839180, 105631660, 105403259, 105175995, 104952164, 104745575, 104543640, 104340530, 104129692, 103886124, 103659317, 103495552, 103379204, 103317902, 103288101, 103266098, 103259781, 103273773, 103293968, 103309319, 103314926, 103299614, 103270889, 103243019, 103184410, 103049423, 102894211, 102769180, 102645683, 102505035, 102367470, 102249214, 102143433]
2872A02143433j01738p6912l2303O790N4550P9323Q5762Q6708P7774O3728K7253L2715
2884A02447083Q7783R7153P3364O1486M3777M6158P9109P4570L4691J8837J5335J1535
2896A03090881R751J3450L1731K4506k572l2325q3092r8709q1444p8438p4768q3015
2908A02635956r6535j29372j98524k22038k08573k05589j97578j99410k17056k11884
2918A00749397j85562j70395j58241j49490j61385j24618l6889K3301Q0986J14181
2928I9981285J27525J24390Q7898Q1856J03973R9396P6027N7060K3362K7969P4669
2939A00865410R5131J01661J13060J28075J32607J38000J12679M4128J3832J0101j976
2950A01752708j8524k0241o439N72Q629Q606n745n18J9073L9619O7261R0744J18065
$$ y = [102143433, 102041695, 101964783, 101932480, 101939270, 101993820, 102073143, 102158905, 102245613, 102323387, 102387115, 102414368, 102447083, 102534866, 102632019, 102705383, 102766869, 102810646, 102856804, 102935913, 103010483, 103045174, 103064011, 103079346, 103090881, 103100632, 103114082, 103145813, 103170319, 103167747, 103135422, 103052330, 102953621, 102872177, 102793739, 102718971, 102635956, 102539421, 102410049, 102211525, 101989487, 101780914, 101575325, 101377747, 101178337, 100961281, 100749397, 100563835, 100393440, 100235199, 100085709, 99924324, 99799706, 99762817, 99786118, 99867104, 99981285, 100108810, 100233200, 100321098, 100402954, 100506927, 100606323, 100682350, 100739410, 100762772, 100790741, 100865410, 100960541, 101062202, 101175262, 101303337, 101435944, 101573944, 101686623, 101730751, 101744583, 101754684, 101752708, 101734184, 101713943, 101707504, 101708076, 101716705, 101725311, 101719566, 101719048, 101738121, 101777740, 101845001, 101935745, 102053810]
2963A02053810J28479J21597J19660J14204J16852J32942J29151J08123R2385P3646
2973A03190849O2393O0822M9500M0954M440p2723j09291j07384j40068j99417k44423
2984A02535652k83386l24341l77540l94150l88214l52433k88635j97121o1775N3047
2994I9921104J64940K67769L79967M33823M27894M35661M38218M37492M40697M17114
3004A03764679L63296L23586K83646K56279K49267K18460J63193J30249J16158Q7760
3014A05956573M6875J9150L311k1530m9019q3992j38618j59645j44554j56975j90476
3025A05081100k07252k24114k11929j66916j33491j09291n9655J8624P7820J41693
3035A04206589J62887J24855J40808K08596K23495K01317J83296J55022J32851J13388
$$ y = [102053810, 102182289, 102303886, 102423546, 102537750, 102654602, 102787544, 102916695, 103024818, 103117203, 103190849, 103253242, 103314064, 103363564, 103404518, 103408958, 103336235, 103226944, 103119560, 102979492, 102780075, 102535652, 102252266, 101927925, 101550385, 101156235, 100768021, 100415588, 100126953, 99929832, 99868057, 99921104, 100086044, 100353813, 100733780, 101167603, 101595497, 102031158, 102469376, 102906868, 103347565, 103764679, 104127975, 104451561, 104735207, 104991486, 105240753, 105459213, 105622406, 105752655, 105868813, 105956573, 106003448, 106022598, 106025909, 106004379, 105955360, 105871368, 105732750, 105573105, 105428551, 105271576, 105081100, 104873848, 104649734, 104437805, 104270889, 104137398, 104028107, 103968452, 103987076, 104064896, 104206589, 104369476, 104494331, 104635139, 104843735, 105067230, 105268547, 105451843, 105606865, 105739716, 105853104]
3045A05853104R3673P5768N4222L3615R77n0263q1199j06789j06407o9214n9441o4033
3057A05574013p1030q8997r5634j05423q2901k6421K1774P5623J21452J76979J84990
3068A05684425J36925J24191J37230J22788P8155O7086R0911Q0559M6257J6045k7825
3079A06556747m2625l2761k3483m982Q392J7403L3165N9296P0114P0335O6712M7828
3091A06826141N2307P8675R3963J11626J10695R3964P1052L4569M265l6598m1077p080
3103A07392502R842K6184L1303K5536J8043n958L578N1689O8070O3079O5232P2815
3115A07821915O4064L8170K0050k808n531J9569J6861q324k1911m3175k9114L4027
3127A07903793M8088K7657J2398j8288k1744M746P629r468p584Q660J8738L9383K4009
$$ y = [105853104, 105946777, 106022545, 106076767, 106110382, 106111359, 106061096, 105979897, 105873108, 105766701, 105697487, 105638046, 105574013, 105502983, 105413986, 105318352, 105212929, 105130028, 105103607, 105125381, 105201004, 105322456, 105499435, 105684425, 105821350, 105945541, 106082771, 106205559, 106283714, 106350800, 106441711, 106522270, 106568527, 106584572, 106556747, 106514122, 106481361, 106457878, 106452896, 106461288, 106478691, 106511856, 106571152, 106641266, 106711601, 106778313, 106826141, 106878448, 106957123, 107051086, 107162712, 107273407, 107367371, 107438423, 107472992, 107477257, 107440659, 107399582, 107392502, 107402344, 107428528, 107459831, 107485367, 107503410, 107497452, 107501030, 107552719, 107620789, 107683868, 107749100, 107821915, 107885979, 107924149, 107944199, 107941391, 107935860, 107955429, 107972290, 107963966, 107942055, 107898880, 107869766, 107903793, 107951881, 107979538, 107991936, 107973648, 107951904, 107956650, 107964279, 107954811, 107947227, 107955887, 107974625, 108014008, 108038017]
3140A08038017m4319n1521l220R033m5K029J6426N837l9574m3129j2421O150L2829
3153A07916092L2928K808q652j6212r819K1599K3483j625r583j2634o126K0980J9883
3166A07973122j0682j6830n363l052k556o767k0432k1934j3024q362m150j266j809
3179A07856895L266K0790J4374k5078k4941J4946K1363K029r31M410Q225J8051J3466
3192A07926865o363j7784l4165k5848J7502K4559m174L82L9360L8864Q32q652j022
3205A07950356L120J4328J0918r629j5525j1940r942k960o218k7229k1126J6853K2561
3218A07913567L219o203j8714j7212N508L479k1767l0662l5408k6772J694J4946K2125
3231A07807800K1698J2329Q78j8639k9159m3229k7725L0991M5090K7267J4427p652
$$ y = [108038017, 107993698, 107942177, 107938957, 107947990, 107947945, 107949974, 107966400, 107972237, 107932663, 107889534, 107877113, 107883263, 107916092, 107949020, 107951828, 107943176, 107926964, 107917145, 107938744, 107962227, 107960602, 107951019, 107938385, 107932259, 107953239, 107973122, 107962440, 107945610, 107940247, 107937195, 107934639, 107927872, 107907440, 107885506, 107872482, 107864120, 107859970, 107858704, 107856895, 107860161, 107880951, 107895325, 107870247, 107845306, 107860252, 107881615, 107883644, 107882713, 107887123, 107895348, 107913399, 107926865, 107920502, 107902718, 107868553, 107842705, 107860207, 107884766, 107880592, 107880974, 107920334, 107959198, 107960030, 107951378, 107950356, 107953476, 107967804, 107978722, 107969093, 107953568, 107941628, 107931686, 107928726, 107922508, 107895279, 107874153, 107891006, 107913567, 107916786, 107910583, 107891869, 107874657, 107880165, 107883644, 107861877, 107831215, 107795807, 107769035, 107770729, 107785675, 107807800, 107829498, 107841827, 107842705, 107824066, 107794907, 107751678, 107723953, 107754944, 107800034, 107827301, 107841728, 107834076]
3243A07834076j9241k6108k4864j4046l075K0317J6350j8738l0113l1158k3201M104
3255A07684303J0605m265J763L4858K7871k1859l6651l4882k0950K3025K9496N600
3267A07698914r987l6408l5927j0490R895M8561M1962k0454l3333q507m196k647j6716
3280A07620667o2012o3202k3651n249P103J4641J4755J6433K0524J4381k670j5694
3292A07536026m1672k7702M7325M5754l0495n1766m2289l5004j2657j1421m1199k6466
3304A07308434M2320N1163J4976j1879n6786o4804l7483k3620r919r08N677N119p866
3317A07214424p416M105J0178K0004J3237j3878k6253l3378l2494k0462j2772l364
3329A07111931j381j2451n097K8725K4986j9432k8343j2566n027Q010M265j8242k9327
$$ y = [107834076, 107814835, 107788727, 107763863, 107749817, 107746742, 107767059, 107783409, 107764671, 107734558, 107703400, 107680199, 107684303, 107694908, 107690643, 107692406, 107727264, 107755135, 107733276, 107696625, 107661743, 107640793, 107663818, 107693314, 107698914, 107688927, 107652519, 107616592, 107606102, 107615997, 107664558, 107706520, 107686066, 107652733, 107644226, 107640030, 107637383, 107620667, 107558655, 107495453, 107471802, 107466553, 107473656, 107488297, 107503052, 107519485, 107540009, 107554390, 107551720, 107536026, 107494354, 107466652, 107513977, 107559731, 107529236, 107477470, 107435181, 107400177, 107387520, 107376099, 107334900, 107308434, 107350754, 107401917, 107416893, 107405014, 107348228, 107283424, 107245941, 107222321, 107212402, 107211494, 107217171, 107222290, 107214424, 107207008, 107211113, 107221291, 107241295, 107254532, 107240654, 107214401, 107181023, 107148529, 107128067, 107115295, 107111931, 107110550, 107098099, 107093002, 107121727, 107146713, 107127281, 107098938, 107086372, 107081345, 107089355, 107093620, 107075378, 107046051]
3342A07046051m3220l3478J4549J5663k2865m4991p6912p0076j7952M723J2489K1675
3354A06805656L8315K1813m4365n3597j1757j953j2062p774K189J8219O0151M8065
3366A06862900k3628n2666n9677o4469o0623n3985m3511k7702K098R422n081p751o676
3379A06468651l456J0635K144l9436l8742K052J5976K2529J0636l6698m0458J434J305
3392A06376572l3875m4273m1535l8910l5163k2271M959J7807K3865K1225M959l387
3404A06229973n791j6121l5644m5540n4810m6249j1376j571j1849j1184k266n677k2171
3417A05959724k8396k7870l0068l8383k9969K099P316j5068j1581J7738J9402l243
3429A05821701j0269q682j0468r628j8288m8950l9574J8212K8709L052p775j6830k3201
$$ y = [107046051, 107002831, 106969353, 106983902, 106999565, 106976700, 106931709, 106854797, 106784721, 106766769, 106771492, 106783981, 106805656, 106843971, 106865784, 106821419, 106767822, 106756065, 106754112, 106742050, 106734276, 106736465, 106754684, 106814835, 106862900, 106839272, 106786606, 106726929, 106662460, 106601837, 106547852, 106504341, 106476639, 106478737, 106488159, 106483078, 106475327, 106468651, 106465195, 106475830, 106477974, 106438538, 106399796, 106401848, 106417824, 106440353, 106450989, 106414291, 106373833, 106375267, 106376572, 106342697, 106298424, 106256889, 106217979, 106182816, 106160545, 106165504, 106183311, 106207176, 106228401, 106233360, 106229973, 106224182, 106208061, 106172417, 106126877, 106072067, 106025818, 106014442, 106012871, 106001022, 105989838, 105987572, 105981895, 105959724, 105931328, 105903458, 105873390, 105835007, 105805038, 105807137, 105814453, 105799385, 105787804, 105805542, 105824944, 105821701, 105811432, 105802750, 105792282, 105782654, 105764366, 105715416, 105675842, 105694054, 105722763, 105725815, 105718040, 105701210, 105678009]
3442A05678009k7466k8183k0454k5345m3961n0979n8388m3556J594K1820K8229L1418
3454A05462738L4714J3923m7226n9440l6286j2779M3129L8193l9429m9240m906P576
3466A05350967R77J0254L3401M3229M8133M1603K3156R30m0489m7706k5841p988K3201
3479A05453827L1280J7548J2993O653J1108K9488L6674M0886L4142Q728L387J6976
3491A05703690J5228J22k075j808J6258O1180Q1108R3269Q0300L0807P553j1947n19
3504A06073166O2866O6620J3870L487K1835K4246K0272J6235N127Q575K7779L6339
3516A06380417L4737M7088P6508Q6113Q6761P1762L0495J2016R77R704N5649N6603
3528A06948830J9096p86k5253k1668J9837K7084P034M029j030K3918R5940J14463R8443
$$ y = [105678009, 105650543, 105622360, 105601906, 105576561, 105532600, 105481621, 105423233, 105379677, 105381271, 105403091, 105431320, 105462738, 105497452, 105511375, 105464149, 105404709, 105368423, 105355644, 105398773, 105436966, 105397537, 105348297, 105343391, 105350967, 105351944, 105362198, 105395599, 105438828, 105486961, 105528564, 105551720, 105552650, 105512161, 105464455, 105438614, 105430626, 105453827, 105485107, 105502655, 105515648, 105522301, 105533409, 105562897, 105599571, 105640457, 105674599, 105683327, 105686714, 105703690, 105718918, 105719040, 105716965, 105715157, 105731415, 105792595, 105873703, 105966972, 106047272, 106078079, 106085632, 106073685, 106073166, 106136032, 106202652, 106216522, 106220009, 106241844, 106266090, 106286362, 106302597, 106307724, 106316299, 106344078, 106380417, 106415154, 106462242, 106538750, 106624863, 106711624, 106783386, 106813881, 106825897, 106826874, 106836578, 106892227, 106948830, 106967926, 106967140, 106941887, 106920219, 106940056, 106967140, 106974174, 106978203, 106977173, 107001091, 107097031, 107211494, 107309937]
3541A07309937P2433J7548j5503n0064m3724J2916L9871O3416N8319J7403n486k8130
3553A07448936l3264k3864n288L9673M7203O272K4864J06148J29364J17180R9472P6149
3565A08032845J7616j05141j46698j37497j01234J747L6453K0882J8074O508R155K6443
3577A07679153L3593L3500L9070L9696O4614J25099J46675J60408J16302j9882o1226
3588A08357002m3464j0590P7896J03783Q1299P1594O3972M0100r346k8892l0235k2362
3600A08650757O363J8074J2138K8725P7392P9682M2221J6640k6581k1271L8795O2607
3612A08985542O5399P7103R6871R8083R6970N5122o4377p5531O149N6344J09336J52207
3624A09659218K19108J86158N9982o2393k69005l04871j71516j18065q3115o3415p6363
$$ y = [107309937, 107382370, 107399918, 107384415, 107334351, 107290627, 107303543, 107343414, 107406830, 107465149, 107482552, 107477066, 107448936, 107415672, 107391808, 107386520, 107426193, 107473396, 107479668, 107504532, 107610680, 107740044, 107857224, 107956696, 108032845, 108050461, 107945320, 107798622, 107661125, 107559891, 107561638, 107598091, 107618973, 107637047, 107643555, 107652710, 107679153, 107712746, 107746246, 107785316, 107825012, 107889626, 108014725, 108161400, 108321808, 108438110, 108418228, 108357002, 108313538, 108302948, 108380844, 108484627, 108565926, 108637520, 108701492, 108741592, 108732246, 108703354, 108673119, 108650757, 108657120, 108675194, 108687332, 108716057, 108793449, 108873131, 108915352, 108931992, 108905411, 108884140, 108922935, 108985542, 109050941, 109128044, 109224915, 109322998, 109419968, 109475090, 109410713, 109335182, 109341331, 109397675, 109507011, 109659218, 109878326, 110064484, 110124466, 110062073, 109793068, 109488197, 109316681, 109198616, 109115501, 109052086, 108975723]
3635A08975723n5984L174J3229l0968k1148K1072P3700J56876K11952K81242K53960
3646A09882828J43982O294k44690l21884k69821j97579k5535L6720L0823k37j07139
3657A08933762j30494j00944n5313M1031Q6357R4009J12221J24313J48796K11716J90353
3668A09655807P4814K7161O935J3779J04362N2285j63155k32697k25471j74446k3491
3679A09115883L5499K2820M9019Q2901J38611K58949K58522J58188N9631j10512j60835
3690A09908676j01898q3160p7088m4578K0576N4047O7688P8438R3292O7306j3847m7905
3702A09921547p2098l9764P7438J19354J29677R3720j0018q1032j55426j89712k08214
3713A09585472j57165j3611P6744J59485J97693J95671J73187J08932O8047K1118K0599
$$ y = [108975723, 108919739, 108922913, 108936142, 108905174, 108884026, 108905098, 108978798, 109135674, 109347626, 109628868, 109882828, 110026810, 110033104, 109788414, 109466530, 109196709, 108999130, 108973595, 109010315, 109041138, 109040901, 108933762, 108803268, 108702324, 108647011, 108688042, 108774399, 108868408, 108980629, 109104942, 109253738, 109465454, 109655807, 109730621, 109757782, 109764717, 109778496, 109882858, 109935143, 109771988, 109539291, 109313820, 109139374, 109115883, 109151382, 109174202, 109223221, 109306122, 109444733, 109703682, 109962204, 110120392, 110180023, 110069511, 109908676, 109806778, 109723618, 109646530, 109601952, 109622528, 109676575, 109744263, 109822701, 109915993, 109983299, 109969452, 109921547, 109849449, 109809685, 109887123, 110006477, 110136154, 110229874, 110219856, 110138824, 109983398, 109793686, 109585472, 109428307, 109414696, 109491440, 109650925, 109848618, 110044289, 110217476, 110326408, 110394455, 110415573, 110436172]
3724A10436172R1965Q0513l0784j9265J09986J54396J81938J23238n1659j53786k51289
3735A10671425k60430j70227j08337m0939K4109J08238J33209J17394O5307p7774r7587
3746A10364388J1329J2657m7470j17370k63382k72042j46454q7905m6181k0790j1826
3757A09374954j9531o7856o0913o653L0785Q6136Q4236J3038m219K6177O035o3469
3769A09398720q9211r8205p5821p172L3371P5798P4555K4940q804n7053o2515j8166
3781A09190437r536k9374k1217J8478J8952j7975k8900l8361j1749O3324J02592J30127
3793A09366798J33583J18401P4890l6506m8134N2475M7660n0590p2884m1511l6766
3804A09507416k7634n8052j67801j53923l0060N5146J61117J98677J81725J43455M1054
$$ y = [110436172, 110528137, 110608650, 110577866, 110558601, 110668587, 110822983, 111004921, 111128159, 111076500, 110922714, 110671425, 110410995, 110240768, 110132431, 110091492, 110115601, 110223839, 110357048, 110474442, 110539749, 110461975, 110364388, 110375717, 110388374, 110340904, 110223534, 109960152, 109688110, 109541656, 109453751, 109407570, 109386780, 109374954, 109355423, 109287567, 109226654, 109220001, 109250786, 109336922, 109421158, 109434196, 109429977, 109456154, 109462189, 109398720, 109309509, 109211304, 109135483, 109128311, 109161682, 109237480, 109312035, 109336975, 109328171, 109271118, 109208603, 109190437, 109180901, 109151527, 109130310, 109148788, 109167740, 109149765, 109120865, 109082504, 109070755, 109134079, 109236671, 109366798, 109500381, 109618782, 109693672, 109657166, 109609032, 109661507, 109709167, 109658577, 109585693, 109544182, 109507416, 109479782, 109421730, 109253929, 109100006, 109069946, 109125092, 109286209, 109484886, 109666611, 109810066, 109851120]
3815A09851120J2421M8805M6966N2239j3634k00439k31102j31607p5127l647K3987
3826A09379982k953J7113P3769J07101J43669J36849P4653N1308O3965K9518n8746
3837A10016228r1080p3860r1316j47553j42029q1779l9314o127N6008J66267K09717
3848A09775162K09785J87248J47919M7829j59813k44118k54227k24617j24404m2862
3858A09317902P1380J01830M5082L1135L8964K2667l0732k3574N2375O6498N6671J763
3870A09751961j49300j71081p8705l7407j9936K9755J30127J50970J13228O3080n0423
3881A09732269o9786J0132J1208m3396o8375j00471p8225K9015L6957n2002o3324m1985
3893A09302017J7334J65390J93810J15967Q6456R0309L2402j15517j45645n2284o6399
$$ y = [109851120, 109863541, 109912346, 109959312, 110011551, 109997917, 109797478, 109566376, 109434769, 109359642, 109355995, 109379982, 109377029, 109394142, 109467911, 109575012, 109718681, 109855530, 109930183, 109981491, 110045456, 110074974, 110016228, 109925148, 109851288, 109759972, 109612419, 109470390, 109388611, 109349297, 109343170, 109399178, 109565445, 109775162, 109984947, 110172195, 110320114, 110367943, 110208130, 109964012, 109709785, 109485168, 109360764, 109317902, 109389282, 109491112, 109536194, 109567329, 109606293, 109628960, 109598228, 109574654, 109627029, 109693527, 109750198, 109751961, 109602661, 109431580, 109352875, 109315468, 109295532, 109325287, 109455414, 109606384, 109719612, 109782692, 109732269, 109662483, 109672615, 109683823, 109640427, 109572052, 109471581, 109393356, 109422371, 109459328, 109407326, 109344002, 109302017, 109319351, 109484741, 109678551, 109794518, 109880974, 109971283, 110003685, 109888168, 109742523, 109690239, 109623840]
3904A09623840j89407j84746n9059k2621n0575l2204J7281M7897P5630Q6449Q9744
3915A09402229O1989j4877m5281m6325m5273l4569j7189K0096K7275N508k3k960N959
3928A09316559M4990L1807l9383o3377o6948m8370J5709L0021O264p362l5668k7900
3940A09156342K2750L8102L1845K7252J5091Q919P583K030l106j7639n6198n0804L388
3953A09185555J8852P988Q751K0195P919l6385m5089l3020q675M8538O4377N2094L2737
3966A09323837j2138k9877k9777k7558j0017j4420m9759m3159J4549J3520n0789n0614
3978A09033798N95K8633O3233N9654Q553q011q751j000K5467L6789M7249L3241j8669
3991A09300781l1326j6403m418K6108J9623l6240l6453K0050K3987
$$ y = [109623840, 109434433, 109249687, 109190628, 109168007, 109117432, 109085228, 109102509, 109150406, 109226036, 109312485, 109402229, 109464218, 109449341, 109404060, 109357735, 109312462, 109277893, 109260704, 109280800, 109308075, 109313583, 109313560, 109310600, 109316559, 109361549, 109393356, 109353973, 109290596, 109223648, 109175278, 109190987, 109221008, 109227272, 109219910, 109184242, 109156342, 109179092, 109217194, 109249039, 109276291, 109291382, 109300301, 109307884, 109309914, 109306808, 109289169, 109232971, 109182167, 109185555, 109204407, 109212395, 109221146, 109241341, 109249260, 109212875, 109167786, 109134766, 109126091, 109174629, 109239006, 109291100, 109323837, 109311699, 109281822, 109252045, 109224487, 109214470, 109200050, 109150291, 109107132, 109121681, 109135201, 109084412, 109033798, 109034393, 109063026, 109126259, 109185913, 109194466, 109186455, 109177704, 109176704, 109202171, 109238960, 109286209, 109319450, 109300781, 109269455, 109253052, 109248634, 109274742, 109294365, 109258125, 109221672, 109241722, 109265709]
4000A09265709
$$ y = [109265709]
##END=$$ End of the data block
