##TITLE=$$ Begin of the data block
##JCAMP-DX=5.00 $$ ACD/SpecManager v 10.08
##SPECTROMETER/DATA SYSTEM=16PC
##DATE=25 Jun 2013 10:39:12
##DATA TYPE=INFRARED SPECTRUM
##DATA CLASS=XYDATA
##ORIGIN=
##OWNER=
##NPOINTS=3601
##FIRSTX=400.00000000
##LASTX=4000.00000000
##MAXX=4000.00000000
##MINX=400.00000000
##MAXY=344.02984619
##MINY=8.50822830
##XFACTOR=1.0000000000
##YFACTOR=0.000001000000000
##FIRSTY=176.74417114
##DELTAX=1.00000000
##XUNITS=1/CM
##YUNITS=TRANSMITTANCE
##XYDATA=(X++(Y..Y))
400A76744171j68235943J2325096q963537J1148096M2605M939485J3173222K8186134
$$ 176744171 8508228 20833324 11869787 23017883 23060488 27999973 41173195 69359329
408F9359329P3962082N1123032o5811615p5541924J7290764K9951637j7475624k2591018
$$ 69359329 143321411 194444443 128632828 53090904 70381668 100333305 82857681 60266663
416F0266663K01248O118011L630661L636597j057739P424331M1224526L3899193k3231842
$$ 60266663 60467911 66585922 70216583 73853180 72795441 80219772 121444298 155343491 132111649
425A32111649k9004319J0376099J8567841J716049J1581512O6325791M1541732r2790161
$$ 132111649 103107330 113483429 132051270 133767319 145348831 211674622 253216354 160426193
433A60426193r2184738M6594071O6116836j9343933r448975J12661286P9209106j41854751
$$ 160426193 68241455 114835526 180952362 161608429 152159454 264820740 344029846 202175095
441B02175095j54556061K3567200O6692535L3885849J4705933k5471756l7707688k9427978
$$ 202175095 47619034 71186234 137878769 171764618 186470551 160998795 123291107 93863129
449I3863129j9867874m78646J3779808L4844391K9927307o818969j9216630j8599914
$$ 93863129 73995255 73516609 87296417 122140808 152068115 145249146 126032516 107432602
457A07432602j5810082l982666K65572k23251k00844j881050j656746O42822P27509
$$ 107432602 91622520 87639854 87905426 87682175 87481331 85600281 83943535 84586357 85313866
466H5313866j194573j665970j429298r71794k4391Q23829K369980K014565p01638j342392
$$ 85313866 84119293 82453323 81024025 80052231 80027840 80851669 83221649 85236214 84534576 83192184
476H3192184n01564k40066n1231R9128L44231J16966q91655q78525L03124K62947r05914
$$ 83192184 82690620 82450554 82399323 82498451 82842682 82959648 82067993 81189468 81492592 81755539 80849625
487H0849625j185822q31253q41873j160507j016304m01787j18088j55899K48619J193237
$$ 80849625 79663803 78832550 77990677 76830170 75813866 75412079 75293991 75138092 75386711 76579948
497G6579948J522881J386757J342918J339318J025886J91551L0495N15839N60928L14949
$$ 76579948 78102829 79489586 80832504 82171822 83197708 83389259 83419754 83935593 84496521 84811470
507H4811470K67769M09317K89917n4047l18672o18645p99255r44443q73184m40628
$$ 84811470 85079239 85488556 85778473 85724426 85405754 84787109 83987854 83043411 82170227 81729599
517H1729599m07333o48095r03251j327057j562286j692177j741127j790642j490402
$$ 81729599 81322266 80674171 79770920 78443863 76881577 75189400 73448273 71657631 70167229
526G0167229o68526l63159m20548m17778m84298n25284o28258n37918l23776L6812
$$ 70167229 69498703 69135544 68714996 68297218 67812920 67287636 66659378 66121460 65797684 65834496
536F5834496O38511J080010J492263J752808J930138J872421J518158J265167J016571
$$ 65834496 66473007 67553017 69045280 70798088 72728226 74600647 76118805 77383972 78400543
545G8400543P61765M36142L08632L70643L87528M34135M45389M84062L63854J9050
$$ 78400543 79162308 79598450 79907082 80277725 80665253 81099388 81544777 82028839 82392693 82411743
555H2411743j01448p0549m5586P6317M1008j78840k19796j39999p0358N7678J00563
$$ 82411743 82310295 82239746 82194160 82270477 82311485 82132645 81912849 81772850 81702492 81760170 81860733
566H1860733R0836M1725r0340j44577j69609j32088M6570J8479k39617k86980j88064
$$ 81860733 81951569 81993294 81902954 81758377 81588768 81456680 81503250 81521729 81282112 80995132 80807068
577H0807068j26152k2888q461o9504j29532k58774k53105p1030q2870k84699l22052
$$ 80807068 80680916 80658028 80649567 80580063 80450531 80191757 79938652 79867622 79784752 79500053 79178001
588G9178001k50534k02491j48888p3792Q3641O4057j43929k35443k70172l14140l40912
$$ 79178001 78927467 78724976 78576088 78502296 78585937 78649994 78506065 78270622 78000450 77686310 77345398
599G7345398l90389m77485n02800m69635m64440m96055m42909l44086j64917J31225
$$ 77345398 76955009 76477524 75974724 75505089 75040649 74544594 74101685 73757599 73592682 73723907
609G3723907L62946O44165P00348N48416L95226J66656m7829l75488l96896j26763
$$ 73723907 74086853 74731018 75431366 75979782 76375008 76541664 76493835 76118347 75721451 75594688
619G5594688P4219M10011M25385J08475l8307j53878j85371j04950p7133o6735n0087
$$ 75594688 75668907 76078918 76504303 76612778 76574471 76420593 76235222 76130272 76053139 75986404 75936317
630G5936317k2720k6535p5249p2265k4987m04M5036L838j42860k12403k82692k25021
$$ 75936317 75913597 75887062 75811813 75739548 75714561 75714157 75759193 75763031 75620171 75407768 75125076 74900055
642G4900055L4454P1617r8297j12373P301j3809j81122j98486p1068p4631j60522k47673
$$ 74900055 74934509 75006126 74907829 74795456 74802757 74788948 74607826 74409340 74338272 74263641 74103119 73855446
654G3855446l43941m99084q03109q46244o49742n38346m24484l33855k61879k01561
$$ 73855446 73511505 73012421 72209312 71363068 70713326 70174980 69750496 69416641 69154762 68953201
664F8953201j34727j41030k92678k21253J03951J91398J35948M9592j32729k62833
$$ 68953201 68818474 68677444 68384766 68163513 68267464 68458862 68594810 68644402 68511673 68248840
674F8248840l73886m81483n64171o92299p92976j087433j524994k087044k749157l627991
$$ 68248840 67874954 67393471 66829300 66137001 65344025 64256592 62731598 60644554 57895397 54267406
684E4267406m791568n851273p334991p520035o743311n380034k947641j001167R83238
$$ 54267406 49475838 43624565 36289574 28769539 22026228 16646194 13698553 12697386 13680624
693A3680624K464891L479527M424858N384495N625984N098511M737594M313015L809834
$$ 13680624 16145515 19625042 24049900 29434395 35060379 40158890 44896484 49209499 53019333
702E3019333L177856K632450K091717J667763J332737J085613R70291Q12035O64879
$$ 53019333 56197189 58829639 60921356 62589119 63921856 65007469 65977760 66789795 67454674
711F7454674M87373K53700J08315M4174n5237j06857l26752p57080j013206j085182
$$ 67454674 67942047 68195747 68304062 68348236 68292999 68186142 67859390 67102310 66089104 65003922
721F5003922j397805j820991k450302l373478m144238n046226n391430n386593m892944
$$ 65003922 63606117 61785126 59334824 55961346 51817108 46770882 41379452 35992859 31099915
730C1099915l763819k724768j449417n17797K76708O87409O92916O25180L52287O9859
$$ 31099915 27336096 24611328 23161911 22644114 22920822 23608231 24301147 24926327 25278614 25348473
740B5348473l78634n62715n80216m70470k01607J38210O09707J058102J501514K022146
$$ 25348473 24969839 24407124 23826908 23356438 23154831 23293041 23902748 24960850 26462364 28484510
750B8484510K633000L199575L851177M205109M328251M335449M215908L897763L325439
$$ 28484510 31117510 34317085 38168262 42373371 46701622 51037071 55252979 59150742 62476181
759F2476181K792740K156708J695114J355095J069977Q68507P01980O15288M77242
$$ 62476181 65268921 67425629 69120743 70475838 71545815 72414322 73116302 73731590 74208832
768G4208832K85171J80626J64200R1698o844j07460k27020l22151l91838m83590n94993
$$ 74208832 74494003 74674629 74838829 74930527 74923683 74816223 74589203 74267052 73875214 73391624 72796631
779G2796631o88149p53830q66798j046371j140809j174972j201347j194573j203842
$$ 72796631 72108482 71354652 70487854 69441483 68300674 67125702 65924355 64729782 63525940
788F3525940j229431j221180j199913j132725r87389r25945r44446q96767q12458p19593
$$ 63525940 62296509 61075329 59875416 58742691 57755302 56829357 55884911 54988144 54175686 53456093
798E3456093p20696l77700M65869P45701M99893O40107J128219J204922R14787Q38612
$$ 53456093 52735397 52357697 52823566 53569267 54069160 54709267 55837486 57042408 57957195 58795807
808E8795807Q61359Q62098R47525Q11623L79013K57160L17501M66728P88712J040939
$$ 58795807 59657166 60519264 61466789 62278412 62657425 62914585 63232086 63698814 64487526 65528465
818F5528465J422478J379295P99660O84235R10713R67354J110656Q26210o0363l37197
$$ 65528465 66950943 68330238 69129898 69814133 70724846 71692200 72802856 73629066 73568703 73231506
828G3231506j24885j52947k57827l64373p12463m17854O80923J053597R84527Q66295
$$ 73231506 73106621 72953674 72695847 72331474 71619011 71201157 71882080 72935677 73920204 74786499
838G4786499M41475L47115N18272N77400O40160O21223N20584M23645K79450K06238
$$ 74786499 75227974 75575089 76093361 76670761 77310921 77932144 78452728 78876373 79155823 79362061
848G9362061J69158J89087K54891L90098O64139P75673P98111P38976N29838M36760
$$ 79362061 79531219 79720306 79975197 80365295 81029434 81805107 82603218 83342194 83872032 84308792
858H4308792M42146L50167J39923R0820J82243K17125K55829K53960J94527J89880
$$ 84308792 84750938 85101105 85241028 85331848 85514091 85731216 85987045 86241005 86435532 86625412
868H6625412K31003K41539K42378K26090J62055J80199L03169L10158J89713K08305
$$ 86625412 86856415 87097954 87340332 87566422 87728477 87908676 88211845 88522003 88711716 88920021
878H8920021L64136L97896L38722L29231L47183L38845L22532K78641J87775J47079
$$ 88920021 89284157 89682053 90020775 90350006 90697189 91036034 91358566 91637207 91824982 91972061
888I1972061J36780J38809J78192J72570J38740R1576J1085l7910n6412j05568j62887
$$ 91972061 92108841 92247650 92425842 92598412 92737152 92828728 92839813 92801903 92745491 92639923 92477036
899I2477036k57538l96347n22927o31477q01582j023819j256371j601173j692437j578430
$$ 92477036 92219498 91823151 91300224 90668747 89867165 88843346 87586975 85985802 84293365 82714935
909H2714935j432129j156784r66522p83470p05292p38693p59239q67821p85683n81955
$$ 82714935 81282806 80126022 79159500 78376030 77670738 76932045 76172806 75304985 74519302 73937347
919G3937347k59239K40547O87691J205162J530739J751587J781273J589035J384353
$$ 73937347 73678108 73918655 74606346 75811508 77342247 79093834 80875107 82464142 83848495
928H3848495J089295Q05992M72405K34535Q5472r3346k85095m38766n72320o64833
$$ 83848495 84937790 85743782 86216187 86450722 86536194 86442848 86157753 85718987 85146667 84481834
938H4481834o88385p75764r09927j026535j152207j245018j275543j403763j604530
$$ 84481834 83793449 83017685 82107758 81081223 79929016 78683998 77408455 76004692 74400162
947G4400162j818680k070831k321938k566765k865341l203819l577637m020550m402324
$$ 74400162 72581482 70510651 68188713 65621948 62756607 59552788 55975151 51954601 47552277
956D7552277m819943n015873n104042m886627m353357l743315k920937k189756j432705
$$ 47552277 42732334 37716461 32612419 27725792 23372435 19629120 16708183 14518427 13085722
965A3085722q14533l26062J60695N83744J062989J574469K094077K712108L091431
$$ 13085722 12271189 11945127 12105822 12689566 13752555 15327024 17421101 20133209 23224640
974B3224640L379345L323601K980327K377083J305389N71511r1049m22574m09053l66452
$$ 23224640 26603985 29927586 32907913 35284996 36590385 37161896 37070847 36648273 36239220 35872768
984C5872768j35231l7765K1412j7239j55330l26966n91686p77386r12571j055576j258062
$$ 35872768 35737537 35699772 35721184 35703945 35548615 35221649 34629963 33852577 32940006 31884430 30626368
995C0626368j255251j127480q18516j16466P4791o4135l51976j050545j294113j246332
$$ 30626368 29371117 28243637 27425121 27308655 27383446 27319311 26967335 25916790 24622677 23376345
1005B3376345j118494p70306n51773l83377k33174j24359L649J37877K69462L92031
$$ 23376345 22257851 21487545 20935772 20552395 20319221 20194862 20198511 20336388 20605850 20997881
1015B0997881N39709P21478Q66962R97780J097729J162218J225567J301408J300621
$$ 20997881 21537590 22259068 23126030 24123810 25221539 26383757 27609324 28910732 30211353
1024C0211353J257801J123688P69997P58865Q94737J397538K517913L033329L255963
$$ 30211353 31469154 32592842 33362839 34121704 35016441 36413979 38931892 41965221 45221184
1033D5221184L159572K577446K202488J857041J558544J304340J087498R10618P70164
$$ 45221184 48380756 50958202 53160690 55017731 56576275 57880615 58968113 59878731 60648895
1042F0648895O87477N80456M67610L56842K34222J47316J00517K8588m5655j48582
$$ 60648895 61336372 61916828 62384438 62741280 62975502 63122818 63223335 63251923 63206268 63057686
1052F3057686k79644m14753n57305p18017q78502j101948j373886j689197k060509
$$ 63057686 62778042 62363289 61805984 61087967 60209465 59107517 57733631 56044434 53983925
1061E3983925k442742k899406l221752l540276l541828l421902k711704j464294O3564
$$ 53983925 51541183 48641777 45420025 41879749 38337921 34916019 32204315 30740021 30803585
1070C0803585K412197L677086M448578M269695K873207J784684M72282m62246j113533
$$ 30803585 33215782 36892868 41341446 45611141 48484348 50269032 50741314 50279068 49165535
1079D9165535j705124k184391k538300k781486k868603k771332k648353k486252k180027
$$ 49165535 47460411 45276020 42737720 39956234 37087631 34316299 31667946 29181694 27001667
1088B7001667j686001j283956r31288n18894m9542L78655P91027J184200J606583J867843
$$ 27001667 25315666 24031710 23100422 22581528 22531986 22910641 23701668 24885868 26492451 28360294
1098B8360294K003432K061891J996254J945759J805019J856114K055073K295494K692150
$$ 28360294 30363726 32425617 34421871 36367630 38172649 40028763 42083836 44379330 47071480
1107D7071480K892208L001331K949383K702808K465771K166103J888138J581093J363564
$$ 47071480 49963688 52965019 55914402 58617210 61082981 63249084 65137222 66718315 68081879
1116F8081879J217819J095940J025650R43687Q61809P96104P49207O94275O32187N86273
$$ 68081879 69299698 70395638 71421288 72364975 73226784 74022888 74772095 75466370 76098557 76684830
1126G6684830N53871N22087M94553M69451M46030M28894M16847M09821M08005M10484
$$ 76684830 77238701 77760788 78255341 78724792 79170822 79599716 80016563 80426384 80834389 81244873
1136H1244873M30512M15779L76770L23631K18658K02149K85393K82905K32529J68350
$$ 81244873 81675385 82091164 82467934 82791565 83010223 83212372 83497765 83780670 84013199 84181549
1146H4181549P1549j6953p6935k30438m63173p10396j116417j168823j011040n81855
$$ 84181549 84253098 84236145 84159210 83928772 83465599 82755203 81638786 80469963 79458923 78877068
1156G8877068L14613Q33488J229454J328324J075172Q63915N49194L18382J03188j0704
$$ 78877068 79191681 80025169 81254623 82582947 83658119 84522034 85071228 85389610 85492798 85482094
1166H5482094R804n3650j54351k60856l86994n09147o38314p54196r14619r08615p56310
$$ 85482094 85491898 85438248 85283897 85023041 84636047 84126900 83488586 82734390 81819771 80911156 80154846
1177H0154846n88127l58513j19446J97625L70384M75616M28177J79695Q751j51039
$$ 80154846 79566719 79208206 79088760 79286385 79656769 80132385 80560562 80740257 80749008 80597969
1187H0597969l13042m93690o14021o78666p48085q18367q44932q48152p91291o58722
$$ 80597969 80284927 79791237 79177216 78498550 77750465 76932098 76087166 75239014 74447723 73789001
1197G3789001n49842m40262l28446k21275r3010N8083J99173L69598M44595M46396
$$ 73789001 73239159 72798897 72470451 72249176 72156166 72214249 72413422 72783020 73227615 73674011
1207G3674011M10652L17978K10121M2962m8829r7679j08673o4018k9800J0536N6602
$$ 73674011 74084663 74402641 74612762 74655724 74606895 74509216 74400543 74336525 74306725 74317261 74373863
1218G4373863J11298J63292K12021K70919L44803M00635M42528M87114N29411N72342
$$ 74373863 74485161 74648453 74860474 75131393 75476196 75876831 76319359 76806473 77335884 77908226
1228G7908226O33743O39344N88157N58136N44258M88571L70881L29589L80043L22197
$$ 77908226 78541969 79181313 79769470 80327606 80871864 81360435 81731316 82060905 82440948 82763145
1238H2763145J62987P4738L5957l9673j25404k42211l98185n40138o63926q39660j056458
$$ 82763145 82926132 83000870 83036827 82997154 82871750 82629539 82231354 81691216 81027290 80187630 79131172
1249G9131172j288009j541398j814628k175072k355308k453591k344559k008705j649784
$$ 79131172 77843163 76301765 74487137 72312065 69956757 67503166 65158607 63149902 61500118
1258F1500118j184154p42695k69104J42216N09765Q53752J184033J440883J677491
$$ 61500118 60315964 59573269 59304165 59446381 59956146 60809898 61993931 63434814 65112305
1267F5112305J740600J659226J470352J087234Q19756N73372M16015L37601L10539
$$ 65112305 66852905 68512131 69982483 71069717 71889473 72462845 72878860 73216461 73527000
1276G3527000L66044M06883M66278N08575N69367N41633M55452K97264M1840j96648
$$ 73527000 73893044 74299927 74766205 75274780 75844147 76385780 76841232 77138496 77180336 76983688
1286G6983688m80720o74561q17558q87993q80813q38021p66510n96931k90749p1693
$$ 76983688 76502968 75828407 75010849 74122856 73242043 72404022 71637512 71040581 70749832 70678139
1296G0678139J18614K70271L85735M64844N03807N17791N02350M59908L60351L21526
$$ 70678139 70796753 71067024 71452759 71917603 72421410 72939201 73441551 73901459 74261810 74583336
1306G4583336L34885L16787K97425K39471J19545O8451N3924P3983J63292J84898J55136
$$ 74583336 74918221 75235008 75532433 75771904 75891449 75959900 76013824 76087807 76251099 76435997 76591133
1317G6591133J45317J53252J16188L3592k9922r9999j38756j46034j60454j75026j79451
$$ 76591133 76736450 76889702 77005890 77039482 77009560 76909561 76770805 76624771 76464317 76289291 76109840
1328G6109840j81747j60194j17806o4300L578Q2138J94114K51938K86698K61543J50612
$$ 76109840 75928093 75767899 75650093 75585793 75589371 75671509 75865623 76117561 76404259 76665802 76816414
1339G6816414R4078O8169K7656k8351n1307l2975n4954j13938j41815j34277j76903
$$ 76816414 76910492 76978661 77006317 76977966 76926659 76893684 76838730 76724792 76582977 76448700 76271797
1350G6271797k56370l40706m44031n42091o48285p33399p94578q72559r67193j038575
$$ 76271797 76015427 75674721 75230690 74688599 74040314 73306915 72512337 71639778 70672585 69634010
1360F9634010j115707j122597j065178r95826q83225q00514p66274o33384m07555k13333
$$ 69634010 68518303 67395706 66330528 65334702 64451477 63650963 62884689 62251305 61843750 61630417
1370F1630417r873J63914L14068M55093O09040O72935O54625O25710N51963M98482
$$ 61630417 61620544 61784458 62098526 62553619 63162659 63835594 64490219 65115929 65667892 66166374
1380F6166374M51470M00970L53195K93137K01630J70158J96960J97579K16911J59790
$$ 66166374 66617844 67018814 67372009 67665146 67866776 68036934 68233894 68431473 68648384 68808174
1390F8808174K1912q4381k21299k52647j51421j61987k68387k90062k54722k32147
$$ 68808174 68830086 68745705 68524406 68271759 68120338 67958351 67689964 67399902 67145180 66913033
1400F6913033j81794j96388k89299l14545k93274k87155k81311k73704k76322k43377
$$ 66913033 66731239 66534851 66245552 65931007 65637733 65350578 65069267 64795563 64519241 64275864
1410F4275864j69373j22337r2003n1453Q465K4151l1448J3473J46599K45338L86666
$$ 64275864 64106491 63984154 63892151 63840698 63849163 63873314 63841866 63855339 64001938 64247276 64633942
1421F4633942L85185K10670J69373K24258K17148J75766J47415J15631R8938J00686
$$ 64633942 65019127 65229797 65399170 65623428 65840576 66016342 66163757 66279388 66378326 66479012
1431F6479012Q8813R8107K1415j64245k60025k65427l81592n24902q28888j239250
$$ 66479012 66567825 66665932 66687347 66523102 66263077 65997650 65616058 65091156 64262268 63023018
1441F3023018j839684k663971l493309m761123m952576m675743l013279O94084K891754
$$ 63023018 61183334 58519363 55026054 50264931 45312355 40636612 37623333 38317417 41209171
1450D1209171M661656N230617M378105L759266K742218K199028K025658J766060J545189
$$ 41209171 45870827 51101444 55479549 59238815 61981033 64180061 66205719 67971779 69516968
1459F9516968J319313J069282R15100Q36464P94365Q23616Q23883Q51365P81272N91805
$$ 69516968 70836281 71905563 72820663 73657127 74451492 75275108 76098991 76950356 77731628 78323433
1469G8323433M94720M17305M38477O07941O47834O17714N56832M32914L35480K76283
$$ 78323433 78818153 79235458 79673935 80281876 80929710 81547424 82104256 82537170 82872650 83148933
1479H3148933J18615j34163l59108n11711q93166j478531k066345k438934l668732
$$ 83148933 83267548 83133385 82774277 82262566 81369400 79890869 77824524 75385590 71716858
1488G1716858n994248p389381r175728q093097m218266n04494M773876P667351R136463
$$ 71716858 65722610 58333229 49157501 41064404 36846138 36341644 41115520 48782871 57919334
1497E7919334R288262P531311O124161M254654K912880J842018J079086O03218M60655
$$ 57919334 67207596 74738907 80863068 85117722 88030602 89872620 90951706 91554924 92015579
1506I2015579Q79471R00795O80779N53329M21257L39272L39027K39159j6282k2361
$$ 92015579 92895050 93795845 94476624 95029953 95451210 95790482 96129509 96368668 96352386 96330025
1516I6330025K65930K63382O248o5612o0944J5213K84363K65259q2894j15776J22307
$$ 96330025 96595955 96859337 96865585 96799973 96739029 96754242 97038605 97303864 97220970 97105194 97227501
1527I7227501J64223J04812L1662j39404j59386p2860M9278L66165L12065j49078l07373
$$ 97227501 97391724 97496536 97528198 97388794 97229408 97156548 97205826 97571991 97884056 97734978 97427605
1538I7427605l69904k18346K95166M60717L59062L77029M76197M23408K11311J02257
$$ 97427605 97057701 96839355 97134521 97595238 97954300 98331329 98807526 99230934 99442245 99544502
1548I9544502K2957L914R7557O3515j01586j43959j4732j63391p55715o79374N5023
$$ 99544502 99567459 99571373 99668930 99732445 99630859 99486900 99472168 99308777 98553062 97873688 97928711
1559I7928711L77541O11396N33249n26j92162j28723k59880n55916o86004o89484p39975
$$ 97928711 98306252 98917648 99450897 99450371 99258209 99129486 98869606 98313690 97627686 96938202 96198227
1570I6198227o20628j025322j920006k747017m492996l769059m26391J550529L582077
$$ 96198227 95577599 94552277 92632271 89885254 85392258 81623199 81196808 82747337 86329414
1579H6329414L971077K512070J723816Q92258L54744Q0650j44882k04827l52714n09911
$$ 86329414 90300491 92812561 94536377 95428635 95783379 95864029 95719147 95514320 95161606 94651695
1589I4651695p37709r79042j401260k105568k520111k985977k710770j750519o73866
$$ 94651695 93913986 92934944 91533684 89428116 86908005 83922028 81211258 79460739 78786873
1598G8786873R56108J960037K669480K937454K699165K360603J678231J219986Q16230
$$ 78786873 79742981 81703018 84372498 87309952 90009117 92369720 94047951 95267937 96084167
1607I6084167N77469N45929M42101L29689K33337J80817L6217k95494k98333O1653
$$ 96084167 96661636 97207565 97649666 97979355 98212692 98393509 98429726 98134232 97835899 97897552
1617I7897552J32515L7308o4491k92397l27919k00866j10840L4118O5659m9164j0490
$$ 97897552 98030067 98067375 98002884 97710487 97382568 97181702 97070862 97104980 97170639 97121475 97110985
1628I7110985K04757K04415L5789r8274k97073l66303l79516k36893K07207K70202
$$ 97110985 97315742 97520157 97555946 97457672 97160599 96794296 96414780 96177887 96385094 96655296
1638I6655296n935j06812j17493k12242l61129n09888p36038p84020o47590o07300
$$ 96655296 96649361 96542549 96425056 96212814 95851685 95341797 94605759 93821739 93174149 92566849
1648I2566849m67804p30156j587013j767014j556374j081962o012M46869M18022N66528
$$ 92566849 92099045 91368889 89781876 88014862 86458488 85376526 85370514 85817383 86235405 86801933
1658H6801933P95433Q33321O36696O50932Q69179Q73306P21764N98503M10438L45894
$$ 86801933 87597366 88430687 89067383 89718315 90587494 91460800 92182564 92781067 93191505 93537399
1668I3537399L74153M29535O33217N65979J53496J12083M00322M67568M41910L61442
$$ 93537399 93911552 94341087 94974304 95540283 95693779 95805862 96206184 96673752 97115662 97477104
1678I7477104J59996O4041O3729k8275l26225j85921N25643O32049K36839J02166M6226
$$ 97477104 97637100 97701141 97764870 97736595 97410370 97224449 97750092 98382141 98618980 98721146 98767372
1689I8767372L3669J44600R3742j17325k09946k87872k14813J36444J20575l48167
$$ 98767372 98801041 98945641 99039383 98922058 98712112 98424240 98209427 98345871 98466446 98118279
1699I8118279k81785L39821M48006J68632O6788j4259j2924J16562J29531O1989J4382
$$ 98118279 97836494 98176315 98624321 98792953 98859741 98845482 98832558 98949120 99078651 99140640 99155022
1710I9155022m4274r0675j31935j63178k09190j75621p7675N1094L03940L41080J66107
$$ 99155022 99110748 99020073 98888138 98724960 98515770 98340149 98262474 98313568 98617508 98958588 99124695
1721I9124695J04500P4478P7507J58935J35849k525l0403L6651L4897J4283o1127l25493
$$ 99124695 99229195 99303673 99381180 99540115 99675964 99673439 99643036 99679687 99714584 99728867 99667740 99342247
1733I9342247k06612M20998M82872O2729r9877k03796j93191J5853L1731j25832j44340
$$ 99342247 99135635 99556633 100039505 100102234 100002357 99798561 99605370 99621223 99652954 99527122 99382782
1744I9382782m4777n5977j77673j82175j13800k3102J35544K30072L27377K91848N4977
$$ 99382782 99338005 99282028 99104355 98922180 98808380 98785278 98920822 99150894 99478271 99770119 99825096
1755I9825096K6131J80771K07657J61293J34780P3334J02829K75971K55989M5608k9487
$$ 99825096 99851227 100031998 100239655 100400948 100535728 100609062 100711891 100987862 101243851 101289459 101259972
1766A01259972k7230m1702k3384p6416k66411k26684P3501J44386M4014K9969N4718
$$ 101259972 101232742 101191040 101167656 101091240 100824829 100598145 100671646 100816032 100860046 100890015 100944733
1777A00944733N0689J9715K1675O9687N1285m7257n8792Q415K0172K1431l3783j65176
$$ 100944733 100995422 101015137 101036812 101106499 101157784 101110527 101051735 101060150 101080322 101101753 101067970 100902794
1789A00902794k48001l58628l16459o7902q194p1220j26480k38297k80075k91588k40585
$$ 100902794 100654793 100296165 99979706 99911804 99903610 99832390 99705910 99467613 99187538 98895950 98655365
1800I8655365j03210p271R1697J43647J51062J53801J37977J19156O6239Q7829J89163
$$ 98655365 98552155 98544884 98636581 98780228 98931290 99085091 99223068 99342224 99408463 99496292 99685455
1811I9685455K40441K91923K72324J50680J21926J54136J79909K37732K41066J99173
$$ 99685455 99925896 100217819 100490143 100640823 100762749 100916885 101096794 101334526 101575592 101774765
1821A01774765J61530P6957J00617K65259K84461J73615J57288J91925K27096L14301
$$ 101774765 101936295 102013252 102113869 102379128 102663589 102837204 102994492 103186417 103413513 103727814
1831A03727814K97691J65535J20285J27197J22712J26480J23336J35468Q9241l4073
$$ 103727814 104025505 104191040 104311325 104438522 104561234 104687714 104811050 104946518 105035759 105001686
1841A05001686q6235j35208n7694K31141K68371P4623L0113Q0155O2965r849k3148
$$ 105001686 104915451 104780243 104722549 104953690 105222061 105296684 105326797 105406952 105469917 105460068 105436920
1852A05436920K1103J5610l0869m6280l5690n1117q7952j12915j26815j59836k08786
$$ 105436920 105458023 105473633 105442764 105396484 105360794 105309677 105221725 105108810 104981995 104822159 104613373
1863A04613373k56584l05436l63784m69445m62982l37219k80624k42135k37823k98141
$$ 104613373 104356789 104051353 103687569 103218124 102755142 102417923 102137299 101895164 101657341 101359200
1873A01359200k85317k21657j55784o0631L868M9728Q8410J12678J39595J77185J76079
$$ 101359200 101073883 100852226 100696442 100635811 100639679 100689407 100777817 100890495 101030090 101207275 101383354
1884A01383354J38855J04164M1535L4210P6843J07262J64131J54800N9937M9622J09527
$$ 101383354 101522209 101626373 101667908 101702118 101778961 101886223 102050354 102205154 102265091 102314713 102424240
1895A02424240J26602J11389J34583K08878K12669J40694J35513J91452J88446J36612
$$ 102424240 102550842 102662231 102796814 103005692 103218361 103359055 103494568 103686020 103874466 104011078
1905A04011078J15280J11099R7901P7125O9092P8438O6215M7989L82j00472j36017
$$ 104011078 104126358 104237457 104335358 104412483 104481575 104560013 104626228 104674217 104674599 104574127 104438110
1916A04438110j34964j01135J3016K0836p3433j00449r3124q9386o3706q0291j49109
$$ 104438110 104303146 104202011 104215027 104235863 104162430 104061981 103968857 103879471 103815765 103735474 103586365
1927A03586365j66153j42365j38115j34040j47599j83418k05711k15027k45117k90444
$$ 103586365 103420212 103277847 103139732 103005692 102858093 102674675 102468964 102253937 102008820 101718376
1937A01718376l39653m13917m40216m31633m09150l57437l16833k89894k26326j13778
$$ 101718376 101378723 100964806 100524590 100092957 99683807 99326370 99009537 98719643 98493317 98379539
1947I8379539n2307l6720J2039Q7334J36497J63269K05254K72987K86561K55203K21679
$$ 98379539 98327232 98290512 98302551 98389885 98526382 98689651 98894905 99167892 99454453 99709656 99931335
1958I9931335J54709J36566J67321J64131J36398J29219J37070J36948J21620J42952
$$ 99931335 100086044 100222610 100389931 100554062 100690460 100819679 100956749 101093697 101215317 101358269
1968A01358269K14363K30118K01446J88919J72684J71478J95641J84776J39214J17660
$$ 101358269 101572632 101802750 102004196 102193115 102365799 102537277 102732918 102917694 103056908 103174568
1978A03174568J11389R6489O9855O7780Q5876J05362J48155J45317J01158O7284J2108
$$ 103174568 103285957 103382446 103452301 103520081 103605957 103711319 103859474 104004791 104105949 104173233 104185341
1989A04185341J0322O6880Q6998Q9714R3559R8228Q6380N2903L5331K8496J5496l434
$$ 104185341 104195663 104262543 104349541 104439255 104532814 104631042 104717422 104770325 104805656 104834152 104849648 104846214
2001A04846214j2397j5999j2017L457J2229K3941J8075j8265j3237K8831N3215Q2512
$$ 104846214 104833817 104817818 104805801 104809258 104821487 104845428 104863503 104845238 104832001 104860832 104914047 104996559
2013A04996559Q1040M0985K9060L5385L2807K2575K6657M8950N1590L4241L5805N5557
$$ 104996559 105077599 105118584 105147644 105183029 105215836 105238411 105265068 105314018 105365608 105399849 105435654 105491211
2025A05491211N7289M8256L5599J999R445O9137P4219L3760J8006L975J2969O1684
$$ 105491211 105548500 105596756 105632355 105634354 105643799 105712936 105787155 105820915 105838921 105842896 105855865 105917549
2037A05917549O1676J6403N27o41l220o012K098K7871L2882K5269J0658k5558l0663
$$ 105917549 105979225 105995628 105996155 105995514 105992294 105986282 105988380 106016251 106049133 106074402 106085060 106059502 106028839
2050A06028839p080J884P988P462k121p462j9386q011L6431M4990K7565J3420j4091
$$ 106028839 106021759 106023643 106031631 106039093 106036972 106029510 106010124 106002113 106038544 106083534 106111099 106124519 106110428
2063A06110428j7853k44J1108K9427K9320J5999o127n7625o0722r918n127l5645m4418
$$ 106110428 106092575 106092331 106103439 106132866 106162186 106178185 106172058 106114433 106053711 106043793 106038666 106003021 105958603
2076A05958603m1962m3411m4251m7660n3383n9509p1167o9863n5092m7470l4714m5448
$$ 105958603 105916641 105873230 105828979 105781319 105727936 105668427 105597260 105527397 105472305 105424835 105390121 105344673
2088A05344673q0536j07856j46370j52611j17203j21429j61004j71852j61575j64108
$$ 105344673 105264137 105156281 105009911 104857300 104740097 104618668 104457664 104285812 104124237 103960129
2098A03960129j73401j80008k08328j70349m5731l929l0403j4282J6624O2340J49353
$$ 103960129 103786728 103606720 103398392 103228043 103182312 103178383 103147980 103133698 103150322 103212662 103362015
2109A03362015J71661J29341J28006J52443J57738J53831J45501J26670J16875J12534
$$ 103362015 103533676 103663017 103791023 103943466 104101204 104255035 104400536 104527206 104644081 104756615
2119A04756615J08055J07002J00349Q9768P7576O0295M9568M4586L6881K3536K4651
$$ 104756615 104864670 104971672 105072021 105161789 105239365 105299660 105349228 105393814 105430695 105454231 105478882
2130A05478882M5082M5326L2402J7716j0468j6853r423Q225M9355O4209N9387N8273
$$ 105478882 105523964 105569290 105601692 105619408 105608940 105592087 105582664 105590889 105640244 105704453 105763840 105822113
2142A05822113N8266M5967J8883R9k2866k3345M890J0223o8l716p278p004j335n04
$$ 105822113 105880379 105926346 105945229 105945328 105922462 105899117 105904007 105914230 105914162 105910446 105903168 105896164 105894829 105894325
2156A05894325n409k457R278J2420J4016L173l3187l2044M883K1316M3229K2743o7162
$$ 105894325 105888916 105886459 105895737 105908157 105922173 105925346 105892159 105860115 105864998 105886314 105929543 105952286 105885124
2169A05885124p0595Q248L0113K5436J1612l4073l8452k121L861j2497j2322l151O035
$$ 105885124 105814529 105822777 105852890 105878326 105889938 105855865 105817413 105815292 105819153 105806656 105794334 105791183 105797218
2182A05797218J9692K8824L8009L7667K1484K4055N0309M5700P347J289K2766K4674
$$ 105797218 105816910 105845734 105883743 105921410 105942894 105966949 106017258 106062958 106070305 106071594 106094360 106119034
2194A06119034J3756R780M052J1398L9719M2488K5673J1825q148k0439k9633l1326
$$ 106119034 106132790 106142570 106146622 106158020 106197739 106240227 106265900 106277725 106269577 106249138 106219505 106188179
2206A06188179l1357j1040M6494N4718J8311N104m792K3L1090L0830J976q987n226
$$ 106188179 106156822 106145782 106192276 106246994 106265305 106270409 106265617 106265640 106296730 106327560 106329536 106320549 106315323
2219A06315323k0737p4440n6976M6158O7184K8755P866k9373k4605L0541M3968L3806
$$ 106315323 106294586 106220146 106163170 106209328 106276512 106305267 106313133 106283760 106259155 106289696 106333664 106367470
2231A06367470J9356j4420k6802k6962j8906J0056J3214o867j3923j2856k0523l5049
$$ 106367470 106386826 106372406 106345604 106318642 106299736 106309792 106323006 106316139 106302216 106289360 106268837 106233788
2243A06233788m7326p0716o1181j0223M166o386j0422k2125j6495J1780J6212j648
$$ 106233788 106186462 106115746 106054565 106044342 106048508 106042122 106031700 106009575 105993080 106004860 106021072 106019424
2255A06019424j739R247J7959L9978K6200l9337m3869J0322J9264K724j4641n5221
$$ 106019424 106017685 106026932 106044891 106084869 106111069 106071732 106027863 106038185 106057449 106060173 106045532 105990311
2267A05990311n4261j3015Q560L6857K6200l7148n2833l8407k4345J4191Q270n1331
$$ 105990311 105936050 105923035 105931595 105968452 105994652 105957504 105904671 105866264 105841919 105856110 105864380 105813049
2279A05813049n8723k1622j5236l2379k6894l601J0323K2842K9038L0067K6085J7380
$$ 105813049 105754326 105732704 105717468 105685089 105658195 105654594 105664917 105687759 105716797 105746864 105772949 105790329
2291A05790329K357l7384k6916M3678N9822L7285K7207J3473R224J9600J0773j1681
$$ 105790329 105792686 105755302 105728386 105772064 105831886 105869171 105896378 105909851 105919075 105938675 105949448 105937767
2303A05937767l6240q0993q5160l9459m1984q4046j02470j22116j06789m7829j6281
$$ 105937767 105901527 105820534 105735374 105695915 105653931 105569885 105467415 105345299 105238510 105190681 105174400
2314A05174400J595K1835L6652O1004J01853J16348J04408J08864J41999J11579J3924
$$ 105174400 105175995 105197830 105234482 105295486 105397339 105513687 105618095 105726959 105868958 105980537 105994461
2325A05994461m4372r8633j14197o8314q6898j93123j68557L502L7575l2356n6954
$$ 105994461 105950089 105851456 105737259 105668945 105582047 105388924 105220367 105223869 105261444 105229088 105172134
2336A05172134r1003o5041L6263Q1940J13441R5871K457k5086l1852K0675J79505K17910
$$ 105172134 105081131 105016090 105052353 105134293 105247734 105343605 105346062 105320976 105289124 105309799 105489304 105707214
2348A05707214J60744J35277J32110O1486j00205j68899j85776j70349q7166n8838
$$ 105707214 105867958 106003235 106135345 106196831 106096626 105927727 105741951 105571602 105484436 105425598
2358A05425598n8533p1052j22711j23642q8265m8782L3165L6217n3025n9936k480J6258
$$ 105425598 105367065 105296013 105173302 105049660 104961395 104912613 104945778 104981995 104928970 104869034 104866554 104882812
2370A04882812K8039Q865o7352p2266l098N50n5672n4932r277J2589L2783L1426L624
$$ 104882812 104910851 104919716 104852364 104780098 104777000 104777550 104721878 104666946 104657669 104670258 104703041 104734467 104738091
2383A04738091j1277l1181k4109K5345K3361k5963m5150n4078n1094k8968j8471j0521
$$ 104738091 104726814 104695633 104671524 104696869 104720230 104694267 104649117 104595039 104543945 104514977 104496506 104485985
2395A04485985j0750j9959k9754n1331m8584k3941l906L3279K7016l0640m7538m5372
$$ 104485985 104475235 104455276 104425522 104374191 104325607 104301666 104297760 104331039 104358055 104327415 104279877 104234505
2407A04234505k9663J7929K9350J3016K983k1218j2138L7743N0834L9124L2112J9409
$$ 104234505 104204842 104222771 104252121 104265137 104268120 104246902 104234764 104272507 104323341 104362465 104394577 104413986
2419A04413986J2757J3206M509k1912j5808K9084L7216K2270N012l4195l7857r941
$$ 104413986 104426743 104439949 104444458 104422546 104406738 104435822 104473038 104495308 104500320 104466125 104428268 104418327
2431A04418327P630K9464L8765L8102L3805K4109R774j6999k5940k7992r727N0117
$$ 104418327 104425957 104455421 104494186 104532288 104566093 104590202 104599976 104582977 104557037 104529045 104519318 104569435
2443A04569435N2956J304j6662k6390j4427L1158M9141N6984M5723l929o127L3638
$$ 104569435 104622391 104623695 104607033 104580643 104566216 104597374 104646515 104703499 104749222 104745293 104739166 104772804
2455A04772804N1331P1953N9295L296j9913k5672k9015k1179k2476l6271k9251J053
$$ 104772804 104824135 104896088 104955383 104958679 104938766 104913094 104884079 104862900 104840424 104804153 104774902 104775955
2467A04775955J1322Q682Q011L884K952Q560N27k2171l5408m9896m7043k2461j2512
$$ 104775955 104787277 104795959 104803970 104807854 104810806 104819366 104819893 104797722 104762314 104712418 104665375 104642914 104630402
2480A04630402m250j3443m7493o1279o7490o0562l3020k0508j2131j6120m4533m0894
$$ 104630402 104626152 104612709 104565216 104503937 104436447 104375885 104342865 104322357 104310226 104294106 104249573 104208679
2492A04208679K579j999n7175o5162l8842k4505m769l242k8206k2911J9119J4954l4744
$$ 104208679 104211258 104209259 104152084 104086922 104048080 104023575 104018806 104015564 103987358 103964447 103983566 103998520 103963776
2505A03963776m9752l9749m6684p3143o7040l2096n768M1008K9327o0631p0953k1889
$$ 103963776 103914024 103874275 103827591 103754448 103687408 103655312 103649544 103690552 103719879 103659248 103588295 103566406
2517A03566406R636O4705N5649l0136n4886m6898l1021J3161K8732K5246K1385R849
$$ 103566406 103576042 103640747 103696396 103666260 103611374 103564476 103533455 103546616 103575348 103600594 103621979 103631828
2529A03631828R08j1184j3848l151p751k4979l7033n0949n6625n6786n0690k9968k8923
$$ 103631828 103632736 103621552 103607704 103604553 103596802 103571823 103534790 103483841 103427216 103370430 103319740 103289772 103260849
2542A03260849n2002m7157j1040r224l7598m7088n6984l9246J9867L7071L4073P080
$$ 103260849 103208847 103161690 103150650 103141426 103103828 103056740 102999756 102960510 102980377 103017448 103051521 103058601
2554A03058601o7115r2194q8364p1357j6976o439l6209l9490k2934k6657m3747o2034
$$ 103058601 102991486 102899292 102810928 102739571 102722595 102716156 102679947 102640457 102617523 102590866 102547119 102485085
2566A02485085r3125j02836r6795q6807o4064n1971m8310l8719k1812j7525l0800k2224
$$ 102485085 102391960 102289124 102192329 102105522 102041458 101989487 101941177 101902458 101880646 101863121 101832321 101810097
2578A01810097J3183J6068j740k8274q4023r9273p7820p4600p2075q5808j33682j28670
$$ 101810097 101823280 101839348 101837608 101809334 101725311 101626038 101548218 101473618 101401543 101315735 101182053 101053383
2590A01053383o4690n3329q0422r1148j03088j00922q4732o9481m5105l6858m1015
$$ 101053383 100988693 100935364 100854942 100763794 100660706 100559784 100475052 100405571 100360466 100323608 100282593
2601A00282593m7249o0272p1816r5032q5594l7094j9790j5282k7084o8215q3328q0940
$$ 100282593 100235344 100175072 100103256 100008224 99922630 99885536 99865746 99850464 99823380 99755165 99671837 99590897
2613I9590897q2657q0826q4518r7779r5604p6149p2006p9964q0558p8942p4272o6872
$$ 99590897 99508240 99427414 99342896 99245117 99149513 99073364 99001358 98921394 98840836 98761894 98687622 98620750
2625I8620750n6297m2862k5848r2J2947J5328K0027K7534K2583L838q347k7824j9623
$$ 98620750 98564453 98521591 98495743 98495651 98508598 98523926 98543953 98571487 98594070 98597908 98589561 98561737 98542114
2638I8542114K5803L5187K0530O981k1240k6367n364q346l9147l2524J0086K8969M5395
$$ 98542114 98567917 98603104 98623634 98630615 98609375 98583008 98577644 98569298 98530151 98497627 98507713 98536682 98582077
2651I8582077L3691j6929l7819m7135m1198n982j457k4460k7748j3664k0409n0285
$$ 98582077 98615768 98598839 98561020 98513885 98472687 98466705 98465248 98440788 98413040 98399376 98378967 98328682
2663I8328682n5977m8927l0800J1421K7176K7519J8852o485k4246m3846n2139n2384
$$ 98328682 98272705 98223778 98192978 98204399 98231575 98259094 98277946 98271461 98247215 98203369 98151230 98098846
2675I8098846m4982j9005j7861l3905n4306j02478r7793l7842j3039K770m723n2315
$$ 98098846 98053864 98034859 98016998 97983093 97928787 97826309 97728516 97690674 97677635 97680405 97675682 97623367
2687I7623367n8601k6222k6444m9278o3324q6449p8560k2270k7466r7061j09794q3680
$$ 97623367 97564766 97538544 97512100 97462822 97399498 97313049 97234489 97212219 97184753 97087692 96977898 96894218
2699I6894218o7924l8986m1863p5203r9701j31439j45721j45966j43165j36879j18256
$$ 96894218 96826294 96787308 96745445 96670242 96570541 96439102 96293381 96147415 96004250 95867371 95749115
2710I5749115p3074o7307j00281j09024j04644j05759j20003r8511l5331l510R850
$$ 95749115 95676041 95608734 95508453 95399429 95294785 95189026 95069023 94970512 94935181 94931671 94941521
2721I4941521K6199M3922M7776L6911K9701J3809K0165O2301N5001k022k2553k7206
$$ 94941521 94967720 95011642 95059418 95096329 95126030 95139839 95160004 95222305 95277306 95275284 95252731 95225525
2733I5225525j9882J8638J5045l2539m3442k7130k6489l1807l9078n2521n9394n7648
$$ 95225525 95205643 95224281 95239326 95206787 95163345 95136215 95109726 95077919 95038841 94986320 94926926 94869278
2745I4869278o8184r9327r7153n5938n2811q6876q4808m6326m6158q1993q8356p0496
$$ 94869278 94801094 94701767 94604614 94548676 94495865 94408989 94324181 94277855 94231697 94149704 94061348 93990852
2757I3990852p2937q9050j00944j16417j22528j23284j15753q8570r0171j19736j32324
$$ 93990852 93917915 93828865 93727921 93611504 93488976 93365692 93249939 93161369 93071198 92951462 92819138
2768I2819138j37162j42334j44195j49414j57143j64436j78650j73332j35704j43601
$$ 92819138 92681976 92539642 92395447 92246033 92088890 91924454 91745804 91572472 91436768 91293167
2778I1293167j97052k18368k26571k23495k01912j89041j66992j80199k37846k58774
$$ 91293167 91096115 90877747 90651176 90427681 90225769 90036728 89869736 89689537 89451691 89192917
2788H9192917k59812k54890k31575k25975k33604k36512k33505k47307k80456l00408
$$ 89192917 88933105 88678215 88446640 88220665 87987061 87750549 87517044 87269737 86989281 86688873
2798H6688873l16711l23868l16742l21365l33573l44223l64853l58558l16216l11569
$$ 86688873 86372162 86048294 85731552 85410187 85076614 84732391 84367538 84008980 83692764 83381195
2808H3381195l31566l54767m04976m08409l64326l49648l46206l49755l60992l81569
$$ 83381195 83049629 82694862 82289886 81881477 81517151 81167503 80821297 80471542 80110550 79728981
2818G9728981m24690m36211m13208m21471m51187m76051n11551n22133n05760n06233
$$ 79728981 79304291 78868080 78454872 78033401 77582214 77106163 76594612 76072479 75566719 75060486
2828G5060486n04112n33486o07635o39580o39893o53480o65688o90605p30514p62154
$$ 75060486 74556374 74022888 73415253 72775673 72135780 71482300 70816612 70126007 69395493 68633339
2838F8633339p96074q13515q16917q15201q06282p89642p57027p42290p40242p37908
$$ 68633339 67837265 67023750 66206833 65391632 64585350 63795708 63038681 62296391 61556149 60818241
2848F0818241p46677p33948p16377o60088n54798m75788l95348l48995l52047l07777
$$ 60818241 60071564 59337616 58621239 57961151 57406353 56930565 56535217 56186222 55834175 55526398
2858E5526398k29740j60599q5163k1530K8087R0527J65607K27139K69317L41442M51111
$$ 55526398 55296658 55136059 55050896 55029366 55057453 55147980 55313587 55540726 55810043 56151485 56602596
2869E6602596N18276N56302N91705O16672O35910O45829O55983O78920O54580N79975
$$ 56602596 57120872 57677174 58268879 58885551 59521461 60167290 60823273 61502193 62156773 62736748
2879F2736748N26882M76288M32209M02046L52043K81288K27097J77284J43265J38328
$$ 62736748 63263630 63739918 64172127 64574173 64926216 65207504 65434601 65611885 65755150 65893478
2889F5893478R7779J5953k0073o706m5609j28670j86828k44713k72843k65457k75306
$$ 65893478 65991257 66007210 65987137 65980431 65934822 65806152 65619324 65374611 65101768 64836311 64561005
2900F4561005k98310k98065k72560k66602k79117k69581k43591k19296j91665j62793
$$ 64561005 64262695 63964630 63692070 63425468 63146351 62876770 62633179 62413883 62222218 62059425
2910F2059425j27411j04618q9382q2992r5440q5758p1003k4273P1434J21067J40903
$$ 62059425 61932014 61827396 61738014 61655022 61559582 61473824 61402821 61378548 61449982 61571049 61711952
2921F1711952J60889J67820J84177J99677K32769K99454L17287K91084K83814K71866
$$ 61711952 61872841 62040661 62224838 62424515 62657284 62956738 63274025 63565109 63848923 64120789
2931F4120789K86682L37120L56033L57216L52478L24989L30216L69163L82042L85216
$$ 64120789 64407471 64744591 65100624 65457840 65810318 66135307 66465523 66834686 67216728 67601944
2941F7601944L72955L42415L10707K68700K35489K14576J72761J08932O0463L3188
$$ 67601944 67974899 68317314 68628021 68896721 69132210 69346786 69519547 69628479 69688942 69722130
2951F9722130l3692j40480k25418l27110l53317l11180k64695k00798j07879J281J66108
$$ 69722130 69688438 69547958 69322540 68995430 68642113 68330933 68066238 67865440 67757561 67758842 67924950
2962F7924950M17450N92277P37099Q28598Q54729Q86917R19960R02893Q33366P71454
$$ 67924950 68342400 68934677 69671776 70500374 71355103 72242020 73161980 74064873 74898239 75669693
2972G5669693O93893O33431N83221N37705N14053M49135L32046K69387K54463K07138
$$ 75669693 76363586 76997017 77580238 78117943 78631996 79081131 79413177 79682564 79937027 80144165
2982H0144165J46561P6126k2225p9658r0950j45821k33169l07900l80897m53896n33676
$$ 80144165 80290726 80366852 80344627 80264969 80174019 80028198 79795029 79487129 79106232 78652336 78118660
2993G8118660n91682o42373o56753o46805n93636m90974l82881k27615j48369j14655
$$ 78118660 77526978 76884605 76227852 75581047 74987411 74496437 74113556 73885941 73737572 73622917
3003G3622917j25244j97380k63596l45161m24645m98176n99053p20718q56323j004273
$$ 73622917 73497673 73300293 73036697 72691536 72266891 71768715 71169662 70448944 69592621 68588348
3013F8588348j178146j369949j598168j877258k131153k474453k524971k371002k041745
$$ 68588348 67410202 66040253 64442085 62564827 60433674 57959221 55434250 53063248 51021503
3022E1021503j445030r20463l44921J28555N48195Q73924J119972J269486J295471
$$ 51021503 49576473 48656010 48311089 48439644 48987839 49861763 50981735 52251221 53546692
3031E3546692J322506J319908J285671J202347J141453J086712J031639R80255R22871
$$ 53546692 54869198 56189106 57474777 58677124 59818577 60905289 61936928 62917183 63840054
3040F3840054Q75354P83799O72271M98154K49023J6999k34932m51210o48308q15964
$$ 63840054 64715408 65499207 66171478 66669632 66918655 66935654 66700722 66249512 65601204 64785240
3050F4785240r86336j041030r90700r11381p82154o10710m07673j22856K78827O06728
$$ 64785240 63798904 62757874 61767174 60855793 60073639 59462929 59055256 58932400 59211227 59817955
3060E9817955R43352J149273J250957J281929J227234J112892R15482P02354M36737
$$ 59817955 60761307 61910580 63161537 64443466 65670700 66783592 67699074 68401428 68838165
3069F8838165J98197k7085k63641n09239p48345j022888j180816j323891j197102q21468
$$ 68838165 69036362 69009277 68745636 68236397 67488052 66465164 65284348 63960457 62763355 61941887
3079F1941887l68095L06438P99297J266983J485993J478790J378891J100472Q53157
$$ 61941887 61573792 61880230 62679527 63946510 65432503 66911293 68290184 69390656 70243813
3088G0243813N48599L30589J67679M1794k6985j00968j62460k20085k73941l15117
$$ 70243813 70792412 71123001 71290680 71332474 71305489 71204521 71042061 70821976 70548035 70232918
3098G0232918l61443l50624k90459k12005r1957P484J09413J83487K52320K55653J84418
$$ 70232918 69871475 69520851 69230392 69018387 68926430 68933914 69043327 69226814 69479134 69734787 69919205
3109F9919205J34964P6492L5545J7807k6199r9472j40900j58409j81816k07970k19757
$$ 69919205 70054169 70130661 70166206 70184013 70157814 70058342 69917442 69759033 69577217 69369247 69149490
3120F9149490k17338k17461k13127k15622k19276k35840k76474k84958k62207k61047
$$ 69149490 68932152 68714691 68501564 68285942 68066666 67830826 67554352 67269394 67007187 66746140
3130F6746140k74613k77779k76779k71988k55775k58446k78236k92114l08960l16483
$$ 66746140 66471527 66193748 65916969 65644981 65389206 65130760 64852524 64560410 64251450 63934967
3140F3934967l21339l09181k64000k64431l04912l29186l60130l62587l37887l16170
$$ 63934967 63613628 63304447 63040447 62776016 62471104 62141918 61781788 61419201 61081314 60765144
3150F0765144k79686k69271k92801k78092k16961k14599k61643k90417l27301l34503
$$ 60765144 60485458 60216187 59923386 59645294 59428333 59213734 58952091 58661674 58334373 57999870
3160E7999870l10062k99690k88227k90749l16742l13469k77306k75852l00071l18623
$$ 57999870 57689808 57390118 57101891 56811142 56494400 56180931 55903625 55627773 55327702 55009079
3170E5009079l52932l48854k96784k89295l15857l26301l38318l31352k99717k86984
$$ 55009079 54656147 54307293 54010509 53721214 53405357 53079056 52740738 52409386 52109669 51822685
3180E1822685k79522k88654l24654l35357l36838l17265k47764k55776l44967l73268
$$ 51822685 51543163 51254509 50929855 50594498 50257660 49940395 49692631 49436855 49091888 48718620
3190D8718620l80043l50212k47120k32792k96951l18695l31352l22678k77519k68910
$$ 48718620 48338577 47988365 47741245 47508453 47211502 46892807 46561455 46238777 45961258 45692348
3200D5692348k93327k91824k72228k62261k49672k56058k89371k96543k87651k75734
$$ 45692348 45399021 45107197 44834969 44572708 44323036 44066978 43777607 43481064 43193413 42917679
3210D2917679k52724k37846k16770k27810k83978k95116k74014k59685k32842k31670
$$ 42917679 42664955 42427109 42210339 41982529 41698551 41403435 41129421 40869736 40636894 40405224
3220D0405224k63619k60948k23759k19436k40017k50221k70031k54849j89972j78955
$$ 40405224 40141605 39880657 39656898 39437462 39197445 38947224 38677193 38422344 38232372 38053417
3230C8053417k10689k26239k50862k42664j90140j81457k09069k15080k17483k02347
$$ 38053417 37842728 37616489 37365627 37122963 36932823 36751366 36542297 36327217 36109734 35907387
3240C5907387j53015j50086j98246j98223j47556j55377k25662k33391j91852j72901
$$ 35907387 35754372 35604286 35406040 35207817 35060261 34904884 34679222 34445831 34253979 34081078
3250C4081078j53782j53706j85421j79050j29940j26622j66370j71757j53137j46625
$$ 34081078 33927296 33773590 33588169 33409119 33279179 33152557 32986187 32814430 32661293 32514668
3260C2514668j42098j44150j62029j54209j18351j05477j03473j09791j30535j44146
$$ 32514668 32372570 32228420 32066391 31912182 31793831 31688354 31584881 31475090 31344555 31200409
3270C1200409j65798j56473j05261r4940j14487j25313j44793j42049j13058j04784
$$ 31200409 31034611 30878138 30772877 30677937 30563450 30438137 30293344 30151295 30038237 29933453
3280B9933453j12297j08599r9230q9241p8247o2992l2616l4021o5565q6903j18757
$$ 29933453 29821156 29712557 29613327 29524086 29445839 29382847 29350231 29316210 29250645 29163742 29044985
3291B9044985j18923q3899p0215o1798o6687r8442r4891n4597m5634o3276n8676l6094
$$ 29044985 28926062 28842163 28771948 28710150 28643463 28545021 28450130 28395533 28349899 28286623 28227947 28191853
3303B8191853k7466l0136k3056L505j0681p1525r5393j11436q6953J026K7729J3257
$$ 28191853 28164387 28134251 28111195 28114700 28104019 28032494 27937101 27825665 27738712 27739738 27767467 27780724
3315B7780724J882k8204l4332j7834j6262l0540j9741J9622L2353K9587K1934r76q416
$$ 27780724 27782606 27754402 27720070 27702236 27685974 27655434 27635693 27655315 27687668 27717255 27739189 27738213 27729797
3328B7729797k193o058j9405k0981j9051j834L5881O1203R1743Q9907M9734L2472K2507
$$ 27729797 27727604 27721546 27702141 27681160 27662109 27660275 27696156 27757359 27849102 27939009 27988743 28021215 28043722
3341B8043722K0981L7861L1923j406k836J8166M0174Q8335Q3279Q011R609Q6855R7204
$$ 28043722 28064703 28102564 28134487 28133081 28130245 28148411 28188585 28276920 28360199 28368210 28377819 28464674 28561878
3354B8561878N6744M3533K9303M8780J23882J31989P5006O7782Q9695J08122J50108
$$ 28561878 28618622 28662155 28691458 28740238 28864120 28996109 29071115 29138897 29228592 29336714 29486822
3365B9486822J40047O4516N2763R2148J03712J05047J04475R8540R2647Q0611Q1539
$$ 29486822 29626869 29691385 29744148 29836296 29940008 30045055 30149530 30248070 30340717 30421328 30502867
3376C0502867R4032J04261J16896J26864J36636J41287J38903J41764J47581J53185
$$ 30502867 30596899 30701160 30818056 30944920 31081556 31222843 31361746 31503510 31651091 31804276
3386C1804276J65031J60408J30585J33083J73283J71970J26720J26149J62601J77834
$$ 31804276 31969307 32129715 32260300 32393383 32566666 32738636 32865356 32991505 33154106 33331940
3396C3331940J82510J91929K07806K07969J87996J87588K12669J99841J42624J30222
$$ 33331940 33514450 33706379 33914185 34122154 34310150 34497738 34710407 34910248 35052872 35183094
3406C5183094J42506J70635K38655K59018K41615K34295K18102K20729K49100K47765
$$ 35183094 35325600 35496235 35734890 35993908 36235523 36469818 36687920 36908649 37157749 37405514
3416C7405514K21325K06825J83559J97125K53105K83409L10921L12115K83954K61788
$$ 37405514 37626839 37833664 38017223 38214348 38467453 38750862 39061783 39373898 39657852 39919640
3426C9919640K21752K23564K70080K89917K98573L05126L03318L08895L27465L20725
$$ 39919640 40141392 40364956 40635036 40924953 41223526 41528652 41831970 42140865 42468330 42789055
3436D2789055K82478K75513K92850K99672K99999L12233L46519L43800K98759K91470
$$ 42789055 43071533 43347046 43639896 43939568 44239567 44551800 44898319 45242119 45540878 45832348
3446D5832348L06774L24821L61035L73245L72482L56747L05317L03055L43609L67210
$$ 45832348 46139122 46463943 46824978 47198223 47570705 47927452 48232769 48535824 48879433 49246643
3456D9246643L96469M00421L78540L63610L37768L39463L72287L83141L79703L84213
$$ 49246643 49643112 50043533 50422073 50785683 51123451 51462914 51835201 52218342 52598045 52982258
3466E2982258L91888L99257M17065M05598L52909L46492L85903L85429L46375L49044
$$ 52982258 53374146 53773403 54190468 54596066 54948975 55295467 55681370 56066799 56413174 56762218
3476E6762218L86975M05624M24027M20452L82805L81183M19472M11919L53332L49858
$$ 56762218 57149193 57554817 57978844 58399296 58782101 59163284 59582756 59994675 60348007 60697865
3486F0697865L87573M15920M67396M62295L91030L71456L89839L83186L54119L54866
$$ 60697865 61085438 61501358 61968754 62431049 62822079 63193535 63583374 63966560 64320679 64675545
3496F4675545L77418M01161M50036M48875L94676L74512L66066L71338M09027M02336
$$ 64675545 65052963 65454124 65904160 66353035 66747711 67122223 67488289 67859627 68268654 68670990
3506F8670990L56148L27659K86721K96592L76961L85475L33077L18359L19336L25394
$$ 68670990 69027138 69354797 69641518 69938110 70315071 70700546 71033623 71351982 71671318 71996712
3516G1996712L57269L42491K74323K52105K70005K51846J94191J86706K24305K37365
$$ 71996712 72353981 72696472 72970795 73222900 73492905 73744751 73938942 74125648 74349953 74587318
3526G4587318K44217K40921K24831K10403K05040J64414O8588M1557P2907Q0185R0454
$$ 74587318 74831535 75072456 75297287 75507690 75712730 75877144 75945732 75987289 76060196 76140381 76230835
3537G6230835P7728L9528J1513k5246l0662o95Q324L174J2703L7506M6326M6104M0031
$$ 76230835 76308563 76348091 76359604 76334358 76303696 76303001 76311325 76314499 76327202 76364708 76411034 76457138 76497169
3550G6497169J5740J9432M6059O9450J08604J13511P4791P9773J26388J35277J14319
$$ 76497169 76512909 76532341 76578400 76647850 76756454 76869965 76944756 77024529 77150917 77286194 77400513
3561G7400513J11061J12556J22734J36261J70281K32170K75040L16902L32260L15857
$$ 77400513 77511574 77624130 77746864 77883125 78053406 78285576 78560616 78877518 79209778 79525635
3571G9525635L14117L15766L19427L29712L29567L19458L14232K92991L24181M33373
$$ 79525635 79839752 80155518 80474945 80804657 81134224 81453682 81767914 82060905 82385086 82818459
3581H2818459M49752L96828L51120K46613K70797M28299N12833N96123N97381N03853
$$ 82818459 83268211 83665039 84016159 84262772 84533569 84961868 85474701 86070824 86668205 87172058
3591H7172058M47365L66333L75244N02754N19821M59534M18373L51357L42010L91983
$$ 87172058 87619423 87985756 88361000 88863754 89383575 89843109 90261482 90612839 90954849 91346832
3601I1346832M11034M35211M10507L32169K73224J81274J92734L39012L57819K68692
$$ 91346832 91757866 92193077 92603584 92935753 93208977 93390251 93582985 93921997 94279816 94548508
3611I4548508K55493L02215K88849K40113J76879K5200O0013L10517L84948L64807
$$ 94548508 94804001 95106216 95395065 95635178 95812057 95837257 95897270 96207787 96592735 96957542
3621I6957542L15522K05490R5604n6595j42288k51297j33301L16696M28246K81189
$$ 96957542 97273064 97478554 97574158 97517563 97375275 97123978 96990677 97307373 97735619 98016808
3631I8016808K26669J82075J26290M8042J3519P035K4963R8373J06568N2696M4792
$$ 98016808 98243477 98425552 98551842 98599884 98613403 98620438 98645401 98743774 98850342 98903038 98947830
3642I8947830R7206M4518j39382j84776j64436n7053J90521L44300N10711M97818K61071
$$ 98947830 99045036 99089554 98950172 98765396 98600960 98543907 98734428 99078728 99589439 100087257 100348328
3653A00348328J70326J35826J46561K56347K60826J69587J48445J61979J85776K59613
$$ 100348328 100518654 100654480 100801041 101057388 101318214 101487801 101636246 101798225 101984001 102243614
3663A02243614K48429J90788O7398k43141k36199J04332K09069K37297J21093l16902
$$ 102243614 102492043 102682831 102750229 102507088 102270889 102375221 102584290 102821587 102942680 102625778
3673A02625778k99576J55945L40874M34853M27886K52175J88805J84341J71356K23137
$$ 102625778 102326202 102482147 102823021 103257874 103685760 103937935 104126740 104311081 104482437 104705574
3683A04705574J13602k06162l14422l09922k19680M0130J61026K10236K27333J82602
$$ 104705574 104819176 104613014 104298592 103988670 103768990 103809120 103970146 104180382 104407715 104590317
3693A04590317J55021J38810P7888m2770j07048j70616j26885N2574J47148K27623
$$ 104590317 104745338 104884148 104962036 104919266 104812218 104641602 104514717 104567291 104714439 104942062
3703A04942062K31522J68137O2652j39686k45049l31833k80495n1261P7179J82342
$$ 104942062 105173584 105341721 105404373 105264687 105019638 104687805 104407310 104356049 104433228 104615570
3713A04615570K32811K34940J94572R0599J381j37711j46720j0201L0037k815M0321
$$ 104615570 104848381 105083321 105277893 105368492 105369873 105232162 105085442 105075241 105105278 105102463 105142784
3724A05142784J62171K02369K15439J43456n4818j56616k07397k48268l09349k28997
$$ 105142784 105304955 105507324 105722763 105866219 105811401 105654785 105447388 105199120 104889771 104660774
3734A04660774R918J76857L84263M12673K91184J22925k03820l45329m30603k87605
$$ 104660774 104670692 104847549 105231812 105644485 105935669 106058594 105854774 105509445 105078842 104791237
3744A04791237K73109L21579r1865k38869l31909k49527Q6044K42165L44421L23052
$$ 104791237 105064346 105385925 105294060 105055191 104723282 104473755 104559799 104801964 105146385 105469437
3754A05469437J32515K4467j10580q6670J43745K04300J84418J02661j28265j77865
$$ 105469437 105601952 105626419 105515839 105429169 105572914 105777214 105961632 106064293 105936028 105758163
3764A05758163o8092m1839p2197k3957J16539J59287J36421J09146N1331O103m2480
$$ 105758163 105690071 105648232 105576035 105552078 105668617 105827904 105964325 106073471 106124802 106130905 106088425
3775A06088425p4082j19018p6531R3102J29890N8197M0436M6349L4240o363P889R2438
$$ 106088425 106014343 105895325 105818794 105911896 106041786 106099983 106140419 106186768 106221008 106214645 106222534 106314972
3787A06314972J01921M8347K8992M2916l716j34109j61629j11122p0053L5263k457
$$ 106314972 106416893 106465240 106494232 106537148 106533432 106399323 106237694 106126572 106056519 106091782 106089325
3798A06089325k49886k33360M4991J19682Q6357K7947j66398j36329J29013K25517
$$ 106089325 105839439 105606079 105651070 105770752 105857109 105885056 105718658 105582329 105711342 105936859
3808A05936859K58186K10976M5418o8810k11334k33597j20742q1131m7043q1177k73346
$$ 105936859 106195045 106406021 106451439 106382629 106171295 105937698 105816956 105735825 105688782 105607605 105334259
3819A05334259k01729J64482K79908K54272J93954M815m3152L4881K9374l7980m4685
$$ 105334259 105132530 105297012 105576920 105831192 106025146 106029961 105986809 106021690 106051064 106013084 105968399
3830A05968399J4313l700p8965j47697k87270k52151j6953P0954O6162R7366J50658
$$ 105968399 105982712 105979012 105900047 105752350 105465080 105212929 105195976 105266930 105333092 105430458 105581116
3841A05581116J52969R3483Q8387J24473J38001K04795Q5099k25189m70376r05967
$$ 105581116 105734085 105827568 105915955 106040428 106178429 106383224 106468323 106243134 105772758 104866791
3851A04866791p65633N7099L69689M19526M09599K33963J13365l1753j04142j19140
$$ 104866791 104101158 104158257 104527946 104947472 105357071 105591034 105704399 105672646 105568504 105449364
3861A05449364j12770o3012k1987O5971L0281j70418k00157j08337l3524R9808J28006
$$ 105449364 105336594 105273582 105251595 105317566 105347847 105177429 104977272 104868935 104835411 104935219 105063225
3872A05063225M6303L7284R9060N6626j18202j37955k6276K4010R4299N1590j80458
$$ 105063225 105109528 105146812 105245872 105302498 105184296 105046341 105020065 105044075 105138374 105189964 105009506
3883A05009506j63719J03546J76216J61362P5768k09977j95312J30462K23732J95549
$$ 105009506 104845787 104949333 105125549 105286911 105362679 105152702 104957390 105087852 105311584 105507133
3893A05507133J45226L0319p9101k53754k80930j78642q7623P6583J16661J9120L5240
$$ 105507133 105652359 105682678 105603577 105349823 105068893 104890251 104802628 104879211 104995872 105014992 105050232
3904A05050232J49773J72088J35689R7008J8142n699K4369J7547j2039l0136n1788
$$ 105050232 105200005 105372093 105507782 105604790 105622932 105617233 105641602 105659149 105647110 105616974 105565186
3915A05565186n1186k6054j1712N318O416j1138j8166l3974j0895P9651P5631j4519
$$ 105565186 105514000 105487946 105476234 105481552 105487968 105476830 105458664 105424690 105413795 105493446 105569077 105554558
3927A05554558o2828j28098j03355L6285Q4023P9864P0244K7702J5496L8246J3870
$$ 105554558 105491730 105363632 105260277 105296562 105380585 105460449 105530693 105558395 105573891 105612137 105626007
3938A05626007p9986p2098M6608O8573J7975N386J5762j549o7810m7607P8583R7175
$$ 105626007 105546021 105473923 105520531 105589104 105607079 105612465 105628227 105626678 105558868 105511261 105589844 105687019
3950A05687019L5859k480o9351o1875K9831O3271P8987N7320l2112m8234o729J4115
$$ 105687019 105722878 105720398 105651047 105589172 105619003 105682274 105761261 105818581 105786469 105738235 105731506 105745621
3962A05745621M4944M1344n340j6068K045j854k3842k8992k9999j1032M6486N2170
$$ 105745621 105790565 105831909 105826569 105810501 105812546 105810692 105786850 105757858 105727859 105716827 105763313 105815483
3974A05815483Q339m242J2802j4877j02539j14990p9491k2438J15257J23642J2207
$$ 105815483 105823822 105819580 105832382 105817505 105714966 105599976 105520485 105498047 105613304 105736946 105749153
3985A05749153m7157j19759j16325k5437J7594N6839N1163k0600l2829J526Q438O943
$$ 105749153 105701996 105582237 105465912 105440475 105458069 105514908 105566071 105545471 105512642 105514168 105522606 105529549
3997A05529549n082l9337m6898
$$ 105529549 105524467 105485130 105438232
4000A05438232
$$ 105438232
##END=$$ End of the data block
