##TITLE=$$ Begin of the data block
##JCAMP-DX=5.00 $$ ACD/SpecManager v 10.08
##SPECTROMETER/DATA SYSTEM=16PC
##DATE=25 Jun 2013 10:35:36
##DATA TYPE=INFRARED SPECTRUM
##DATA CLASS=XYDATA
##ORIGIN=
##OWNER=
##NPOINTS=3601
##FIRSTX=400.00000000
##LASTX=4000.00000000
##MAXX=4000.00000000
##MINX=400.00000000
##MAXY=558.13952637
##MINY=19.69308853
##XFACTOR=1.0000000000
##YFACTOR=0.000001000000000
##FIRSTY=253.48834229
##DELTAX=1.00000000
##XUNITS=1/CM
##YUNITS=TRANSMITTANCE
##XYDATA=(X++(Y..Y))
$$ plain form
400 253488342 81466103 54374981 20927404 19693089 44089268 78285690 106702087 122005554
408 122005554 100608826 75694420 80751991 91272713 92384979 88666656 73579498 65599991
416 65599991 83008240 119854691 200274582 252293564 173733658 79340645 73453758 85114479
424 85114479 64019630 52542351 65433403 135256378 383096313 558139526 332079041
431 332079041 58479523 51747799 101049850 75222206 49659847 70213509 94352150 86047050
439 86047050 71641777 65759682 67532440 90411118 106060600 76931664 44117615 45358967
447 45358967 53164528 44602989 43735218 78625412 114332222 115930153 111435509 123652359 133291595
456 133291595 123528358 109773682 103028557 99698235 101343201 103498581 100846550 97506355 96346161
$$ packed form
400B53488342j72022239k7091122l3447577j234315K4396179L4196422K8416397J5303467
408A22005554k1396728k4914406N057571J0520722J112266l718323j5087158p979507
416F5599991J7408249L6846451Q0419891N2018982p8559906r4393013n886887J1660721
424H5114479k1094849j1477279J2891052O9822975K47839935J75043213k26060485
431C32079041k73599518o731724M9302051k5827644k5562359K0553662K4138641q305100
439H6047050j4405273n882095J772758K2878678J5649482k9128936l2814049J241352
447D5358967P805561q561539q67771L4890194L5706810J597931m494644J2216850R639236
456A33291595r763237j3754676o745125l330322J644966K155380k652031l340195j160194
$$ plain form
465 96346161 95800995 95166298 94728874 94340561 94601418 96595093 98722435 99565742 99663971 98721100
475 98721100 97824051 98259354 99131897 99959106 100789734 101652763 102124687 101477554 100653694 100596382
485 100596382 100574829 100088379 99389885 98532990 97614410 96616722 95936035 96239517 96696594 96536995
495 96536995 96246887 95980118 95963188 96576714 97512009 98793053 99802277 99613449 99176552 99312469
505 99312469 99482201 99313591 99126694 99186325 99286034 99339386 99250885 98818947 98275230 97778748 97345924
516 97345924 97123428 96879173 96381020 95775749 95074272 94451973 94210411 93981674 93401192 92760345
526 92760345 92219467 91806961 91628525 91612549 91730095 91958687 92307281 92652580 92820572 92972183
536 92972183 93197510 93535042 94111374 94751953 95332123 95828819 96155952 96377655 96549149 96610947
$$ packed form
465I6346161n45166o34697m37424l88313K60857J993675K127342Q43307R8229r42871
475I8721100q97049M35303Q72543Q27209Q30628Q63029M71924o47133q23860n7312
485A00596382k1553m86450o98494q56895r18580r97688o80687L03482M57077j59599
495I6536995k90108k66769j6930O13526R35295J281044J009224j88828m36897J35917
505I9312469J69732j68610j86897N9631R9709N3352q8501m31938n43717m96482m32824
516I7345924k22496k44255m98153o05271p01477o22299k41562k28737n80482o40847
526I2760345n40878m12506j78436j5976J17546K28592L48594L45299J67992J51611
536I2972183K25327L37532N76332O40579N80170M96696L27133K21703J71494O1798
$$ plain form
546 96610947 96434807 96282005 96438904 96701836 96969887 97221039 97444893 97505547 97113968 96718956
556 96718956 96791527 96975853 97088669 97083237 96762390 96394058 96218994 96121429 96060104 96052170 96139214 96206451
568 96206451 96146248 95978333 95660545 95270874 94915131 94467567 93774773 93025589 92348457 91771004
578 91771004 91373871 91126205 91005730 91067078 91444679 91876770 92076729 92253471 92549728 92877388
588 92877388 93189522 93505096 93844124 94156387 94404770 94569679 94582436 94553085 94571663 94629501 94763733
599 94763733 94927002 95079491 95235535 95424194 95561195 95544220 95456146 95310593 95212723 95325394 95488953
610 95488953 95615196 95652367 95399666 95215820 95530006 95929863 96085526 96178505 96254654 96391006 96772575
621 96772575 97121239 97179535 97070358 96804810 96460556 96119308 95780060 95479034 95185944 94845482
$$ packed form
546I6610947j76140j52802J56899K62932K68051K51152K23854O0654l91579l95012
556I6718956P2571J84326J12816n432l20847l68332j75064r7565o1325p934Q7044O7237
568I6206451o0203j67915l17788l89671l55743m47564o92794p49184o77132n77453
578I1771004l97133k47666j20475O1348L77601M32091J99959J76742K96257L27660
588I2877388L12134L15574L39028L12263K48383J64909J2757k9351J8578N7838J34232
599I4763733J63269J52489J56044J88659J37001j6975q8074j45553r7870J12671J63559
610I5488953J26243L7171k52701j83846L14186L99857J55663R2979P6149J36352L81569
621I6772575L48664N8296j09177k65548l44254l41248l39248l01026k93090l40462
$$ plain form
631 94845482 94568871 94490074 94485428 94485710 94461533 94310448 94182182 94221687 94340660 94499893 94696831 94921684
643 94921684 95156570 95399094 95592781 95675850 95661591 95468231 95318863 95494034 95739433 95894836 95958420
654 95958420 95830109 95644470 95521881 95404716 95247696 95134094 95178123 95241356 95179794 95124222 95154808
665 95154808 95279121 95627022 95911407 95788574 95557854 95443390 95326828 95136238 94956421 94881294
675 94881294 94811485 94685219 94483543 94172501 93735268 93164612 92397736 91454025 90079544 88074448
685 88074448 85295654 81352615 76787636 71750900 67027969 63355873 61030266 60885189 62042305
694 62042305 63959953 66461868 69335937 72147751 74225426 76068970 77941605 79881813 82099579
703 82099579 84343384 86451958 88364311 89916466 91255852 92521858 93574615 94261787 94760155
$$ packed form
631I4845482k76611p8797m646K82k4177j51085j28266L9505J18973J59233J96938K24853
643I4921684K34886K42524J93687Q3069j4259j93360j49368J75171K45399J55403O3584
654I5958420j28311j85639j22589j17165j57020j13602M4029O3233o1562n5572L0586
665I5154808J24313L47901K84385j22833k30720j14464j16562j90590j79817p5127
675I4881294o9809j26266k01676l11042m37233n70656p66876r43711j374481k005096
685H8074448k778794l943039m564979n036736m722931l672096k325607j45077J157116
694F2042305J917648K501915K874069K811814K077675J843544J872635J940208K217766
703H2099579K243805K108574J912353J552155J339386J266006J052757O87172M98368
$$ plain form
712 94760155 95220711 95568390 95745537 95850731 96006348 96083237 95956680 95735405 95508644 95209808
722 95209808 94837402 94285057 93462654 92319725 90761993 88830734 86412140 83876968 81479622
731 81479622 79455162 78176353 77484131 77441002 77754684 78202461 78638031 78836510 78810760 78444077
741 78444077 77900146 77263260 76654739 76192642 75970840 76145813 76647873 77459595 78580353 80034920
751 80034920 81729485 83619049 85581612 87509178 89314415 90898468 92187622 93025017 93561005
760 93561005 93873451 94022964 94071365 94092773 94172646 94338631 94649315 95097038 95714233 96439049 97251579
771 97251579 98058441 98756645 99354912 99809219 100174545 100493164 100759193 100965904 101157784 101398827
781 101398827 101623749 101786995 101893234 101901695 101903175 102002640 102116676 102202866 102242851 102184319 102086617 101997566
$$ packed form
712I4760155M60556L47679J77147J05194J55617P6889j26557k21275k26761k98836
722I5209808l72406n52345q22403j142929j557732j931259k418594k535172k397346
731H1479622k024460j278809o92222m3129L13682M47777M35570J98479k5750l66683
741G8444077n43931o36886o08521m62097k21802J74973N02060Q11722J120758J454567
751H0034920J694565J889564J962563J927566J805237J584053J289154Q37395N35988
760I3561005L12446J49513M8401K1408P9873J65985L10684M47723O17195P24816Q12530
771I7251579Q06862O98204N98267M54307L65326L18619K66029K06711J91880K41043
781A01398827K24922J63246J06239Q461J480R9465J14036Q6190L9985n8532r7702q9051
$$ plain form
793 101997566 101899193 101801369 101668121 101433655 101197144 101011040 100949524 101211952 101475235 101360298 101234245
804 101234245 101453323 101670837 101559753 101417061 101447983 101600456 101985641 102318909 102301834 102086639
814 102086639 101627037 101219818 101148888 101406502 102326630 103167892 103087112 102723267 102400108 102219894
824 102219894 102596184 102918579 102506111 101983620 101871536 101801773 101572464 101205254 100468872 99919937
834 99919937 100283646 100822853 100944969 100941254 100879501 100837204 100955818 101111198 101201553 101301117 101466179
845 101466179 101648399 101819061 101975586 102083542 102209450 102429100 102679947 102938271 103163101 103263947
855 103263947 103365631 103602814 103855469 104043434 104181793 104234619 104274345 104386063 104495522 104539154 104569748
866 104569748 104628799 104686424 104730392 104748940 104711411 104661987 104638977 104629349 104639198 104649376 104628586 104619072 104673454
$$ packed form
793A01997566r8373r7824j33248k34466k36511j86104o1516K62428K63283j14937j26053
804A01234245K19078K17514j11084j42692L0922J52473L85185L33268j7075k15195
814A02086639m59602m07219p0930K57614R20128Q41262q0780l63845l23159j80214
824A02219894L76290L22395m12468n22491j12084o9763k29309l67210p36382n48935
834I9919937L63709N39207J22116l715o1753m2297J18614J55380R0355R9564J65062
845A01466179J82220J70662J56525J07956J25908K19650K50847K58324K24830J00846
855A03263947J01684K37183K52655J87965J38359N2826L9726J11718J09459M3632L0594
866A04569748N9051N7625M3968J8548l7529m9424k3010r628R849J0178k0790r514N4382
$$ plain form
879 104673454 104729034 104734108 104708145 104639984 104569458 104561211 104529381 104391479 104201958 103960182 103748604 103675697
891 103675697 103662560 103680061 103687164 103609680 103517769 103471519 103426666 103360008 103268196 103127289 102975510 102865906
903 102865906 102729866 102521301 102225418 101775002 101281021 100828171 100428101 100145485 99905869 99653526
913 99653526 99396751 99112701 98838974 98606064 98412392 98242256 98168419 98287605 98512077 98765274
923 98765274 99110222 99644707 100187637 100556610 100853271 101135445 101352119 101467560 101493813 101409531 101278900
934 101278900 101158401 101049637 100994255 100928421 100799034 100615593 100362465 100061676 99723030 99367287
944 99367287 99043060 98676582 98212120 97643997 96928001 96123741 95292999 94384811 93384048 92245026
954 92245026 90937134 89399910 87560989 85425186 82938858 80204918 77213455 74249100 71557495
$$ packed form
879A04673454N5580N074k5963o8161p0526q247l1830j37902j89521k41776k11578p2907
891A03675697j3137J7501P103p7484r1911m6250m4853o6658r1812j40907j51779j09604
903A02865906j36040k08565k95883m50416m93981m52850m00070k82616k39616k52343
913I9653526k56775k84050k73727k32910j93672j70136p3837J19186K24472K53197
923I8765274L44948N34485N42930L68973K96661K82174K16674J15441K6253q4282j30631
934A01278900j20499j08764n5382o5834j29387j83441k53128l00789l38646l55743
944I9367287l24227l66478m64462n68123p15996q04260q30742r08188j000763j139022
954I2245026j307892j537224j838921k135803k486328k733940k991463k964355k691605
$$ plain form
963 71557495 69245674 67496895 66327812 65846130 65961578 66631218 67820480 69525764 71611092
972 71611092 73995331 76509949 79031296 81343582 83179810 84569763 85414001 85833145 85833572 85658356
982 85658356 85573318 85516617 85522629 85568329 85658241 85744019 85788177 85762383 85614563 85378433 85064789 84690048
994 84690048 84251091 83817169 83435150 83168983 83162071 83222862 83220001 83116127 82779785 82361603 81960419
1005 81960419 81599762 81334663 81169319 81134270 81205154 81374023 81622124 81920074 82291748 82758667
1015 82758667 83298416 83909866 84550568 85169624 85791275 86432693 87063858 87683151 88222572 88600563
1025 88600563 88856026 88944168 89034576 89221764 89686104 90755798 92081856 93478607 94783997 95724342
1035 95724342 96448685 97002625 97422478 97763229 98014282 98189949 98270439 98232361 98100685 97886299
$$ packed form
963G1557495k311821j748779j169083m81682J15448O69640J189262J705284K085328
972G1611092K384239K514618K521347K312286J836228J389953Q44238M19144M27j75216
982H5658356q5038n6701O012M5700Q9912Q5778M4158k5794j47820k36130l13644l74741
994H4690048m38957m33922l82019k66167o912O0791k861j03874l36342m18182m01184
1005H1960419l60657k65099j65344l5049P0884J68869K48101K97950L71674M66919
1015H2758667N39749O11450O40702O19056O21651O41418O31165O19293N39421L77991
1025H8600563K55463Q8142R0408J87188M64340J069694J326058J396751J305390R40345
1035I5724342P24343N53940M19853L40751K51053J75667Q0490l8078j31676k14386
$$ plain form
1045 97886299 97607849 97281387 96925522 96579552 96197388 95739670 95225548 94652390 94045784 93404198
1055 93404198 92806076 92331436 91973854 91804047 91670349 91476395 91126892 90486191 89578720 88326790
1065 88326790 86901161 85309006 83963417 83261391 83258270 84345078 85911682 87574532 89044662
1074 89044662 89833809 90156364 89986725 89556404 89102364 88582466 88049408 87455490 86767555 85994553
1084 85994553 85123726 84186768 83161758 82196518 81432343 80866814 80542633 80465652 80660675 81113243
1094 81113243 81838966 82772278 83887505 85080406 86232567 87360527 88448669 89474869 90394112
1103 90394112 91259476 92094566 92942596 93880608 94830727 95759346 96610565 97278114 97879219 98527809
1113 98527809 99127220 99616524 100002052 100239922 100419540 100628067 100828148 101024773 101178101 101230164
$$ packed form
1045I7886299k78450l26462l55865l45970l82164m57718n14122n73158o06606o41586
1055I3404198n98122m74640l57582j69807j33698j93954l49503o40701r07471j251930
1065H8326790j425629j592155j345589p02026l121J086808J566604J662850J470130
1074H9044662P89147L22555j69639m30321m54040n19898n33058n93918o87935p73002
1084H5994553q70827r36958j025010r65240p64175n65529l24181p6981J95023M52568
1094H1113243P25723R33312J115227J192901J152161J127960J088142J026200R19243
1103I0394112Q65364Q35090Q48030R38012R50119R28619Q51219O67549O01105O48590
1113I8527809N99411M89304L85528K37870J79618K08527K00081J96625J53328N2063
$$ plain form
1123 101230164 101240227 101254295 101254036 101231621 101201553 101183655 101153824 101092720 101005836 100895096 100751877 100561401
1135 100561401 100344063 100126717 99875160 99547958 99193573 98826668 98507187 98300812 98204781 98239326
1145 98239326 98401115 98718025 99116325 99556442 99963829 100259018 100416901 100343628 100165680 99937317
1155 99937317 99781013 99870155 100106194 100489876 100896378 101182198 101404068 101575111 101682617 101706978
1165 101706978 101681755 101637886 101563408 101455452 101317596 101148033 100959801 100772949 100564476 100292709
1175 100292709 100033379 99854752 99737312 99689125 99695564 99748993 99836227 99965668 100064827 100048706 99963066
1186 99963066 99816513 99635292 99454857 99255898 99030853 98779938 98486710 98193428 97942947 97716904
1196 97716904 97519829 97325897 97099045 96874542 96666763 96502350 96410538 96397614 96504333 96656464
$$ packed form
1123A01230164J0063J4068k59k2415l0068j7898k9831o1104q6884j10740j43219j90476
1135A00561401k17338k17346k51557l27202l54385l66905l19481k06375r6031L4545
1145I8239326J61789L16910L98300M40117M07387K95189J57883p3273j77948k28363
1155I9937317j56304Q9142K36039L83682M06502K85820K21870J71043J07506K4361
1165A01706978k5223m3869p4478j07956j37856j69563j88232j86852k08473k71767
1175A00292709k59330j78627j17440m8187O439N3429Q7234J29441R9159j6121q5640
1186I9963066j46553j81221j80435j98959k25045k50915k93228k93282k50481k26043
1196I7716904j97075j93932k26852k24503k07779j64413r1812j2924J06719J52131
$$ plain form
1206 96656464 96786903 96914932 97045441 97154404 97214745 97240211 97227119 97200439 97193810 97177315 97114487
1217 97114487 97058388 97061012 97089050 97119499 97173309 97277954 97390747 97474167 97540024 97579117 97616554 97683189
1229 97683189 97752144 97807358 97847054 97865700 97858353 97803642 97745132 97738144 97725891 97662926 97570251 97446777
1241 97446777 97313354 97201538 97078156 96893784 96728584 96677971 96646545 96552780 96450325 96367599 96298790
1252 96298790 96246193 96213867 96206238 96224113 96277496 96343277 96408417 96452354 96443771 96401878 96329926 96244408
1264 96244408 96150040 96085258 96113060 96164467 96182129 96194077 96211884 96227165 96234680 96236511 96222565 96223999 96277023
1277 96277023 96356155 96444603 96552299 96691940 96838188 96984337 97086975 97087547 97024727 96918579 96766327
1288 96766327 96554398 96334930 96163513 96016121 95872833 95776794 95784164 95835686 95888496 95949242 96003983
$$ packed form
1206I6656464J30439J28029J30509J08963O0341K5466j3092k6680o629j6495o2828
1217I7114487n6099K624K8038L0449N3810J04645J12793Q3420O5857L9093L7437O6635
1229I7683189O8955N5214L9696J8646p347n4711n8510o988j2253o2965r2675j23474
1241I7446777j33423j11816j23382j84372j65200n0613l1426r3765j02455q2726o8809
1252I6298790n2597l2326p629J7875N3383O5781O5140M3937q583m1893p1952q5518
1264I6244408r4368o4782K7802N1407J7662J1948J7807J5281P515J831j3946J434N3024
1277I6277023P9132Q8448J07696J39641J46248J46149J02638N72o2820j06148j52252
1288I6766327k11929k19468j71417j47392j43288r6039P370N1522N2810O0746N4741
$$ plain form
1299 96003983 96071671 96169327 96288727 96433617 96584793 96725700 96852203 96938797 97032997 97193932 97360970
1310 97360970 97493340 97590279 97619125 97634483 97688820 97755646 97830887 97899582 97951195 97968124 97917297 97834351
1322 97834351 97745201 97645714 97538376 97429131 97323181 97224899 97140594 97069450 97010490 96970436 96949310
1333 96949310 96965981 97049759 97169182 97323441 97449875 97470398 97430344 97332047 97226120 97175430 97145248
1344 97145248 97107437 97104736 97192337 97304680 97400284 97462006 97443436 97390770 97344063 97275330 97165749 97027588
1356 97027588 96864601 96683266 96497604 96288681 96044922 95758148 95398232 95019295 94661667 94336342
1366 94336342 94069572 93855690 93695732 93595505 93573570 93592407 93623756 93658234 93662430 93680023 93755409
1377 93755409 93852951 93946693 94051865 94180634 94315865 94431068 94566269 94780159 94990158 95120743
$$ packed form
1299I6003983O7688R7656J19400J44890J51176J40907J26503Q6594R4200J60935J67038
1310I7360970J32370R6939K8846J5358N4337O6826P5241O8695N1613J6929n0827q2946
1322I7834351q9150r9487j07338j09245j05950r8282q4305p1144n8960m0054k1126
1333I6949310J6671Q3778J19423J54259J26434K0523m0054r8297j05927n0690l0182
1344I7145248l7811k701Q7601J12343R5604O1722j8570n2666m6707o8733j09581j38161
1356I7027588j62987j81335j85662k08923k43759k86774l59916l78937l57628l25325
1366I4336342k66770k13882j59958j00227k1935J8837L1349L4478M196J7593P5386
1377I3755409R7542R3742J05172J28769J35231J15203J35201K13890K09999J30585
$$ plain form
1387 95120743 95209358 95248917 95297577 95426132 95589493 95789383 95955826 95982765 95980026 96063187 96108673
1398 96108673 95981880 95831253 95771576 95769096 95867371 95949127 95874237 95754715 95655655 95577713 95553711 95552277
1410 95552277 95554161 95555901 95534256 95528984 95562195 95663330 95941589 96179726 96125916 95992943 95910309 95876099
1422 95876099 95974274 96076584 96027542 95992683 96133446 96306419 96423981 96480156 96387077 96302414 96391602
1433 96391602 96543190 96762848 96864510 96582672 96161316 95797966 95366165 94855354 94115135 92999268
1443 92999268 91484543 89383026 87042709 84485771 82501602 82139870 82641983 83726501 85011459
1452 85011459 85845398 86755272 88117264 89731934 91679855 93497040 94613007 95427582 96130249
1461 96130249 96781303 97590942 98298569 98624702 98835777 99109650 99432419 99876427 100360558 100875900
$$ packed form
1387I5120743Q8615L9559M8660J28555J63361J99890J66443K6939k739Q3161M5486
1398I6108673j26793j50627n9677k480R8275Q1756p4890j19522r9060p7942k4002j434
1410I5552277J884J740k1645n272L3211J01135K78259K38137n3810j32973q2634l4210
1422I5876099R8175J02310m9042l4859J40763J72973J17562N6175r3079q4663Q9188
1433I6391602J51588K19658J01662k81838m21356l63350m31801n10811p40219j115867
1443I2999268j514725k101517k340317k556938j984169l61732N02113J084518J284958
1452H5011459Q33939R09874J361992J614670J947921J817185J115967Q14575P02667
1461I6130249O51054Q09639P07627L26133K11075K73873L22769M44008M84131N15342
$$ plain form
1471 100875900 101277946 101332710 101299644 101417374 101514221 101448273 101368614 101433136 101473305 101347855 101132629
1482 101132629 100863647 100518990 100119736 99572632 98938225 97776031 95543411 92607262 88676262
1491 88676262 85182449 83550621 83510872 85641289 88822456 92230034 95556976 98162224 100223251
1500 100223251 101597191 102604057 103513931 104333641 105298470 105992744 105896950 105557846 105388214 105270264
1510 105270264 105232094 105248901 105287384 105401039 105706879 105981087 105929611 105879875 106173492 106473686 106512352
1521 106512352 106425049 106213593 106010742 106014755 106030914 105878212 105713699 105634117 105639221 105822968 105999329
1532 105999329 105960175 105865547 105752205 105781601 106260918 106789520 107044884 107099556 106832909 106501602 106379219
1543 106379219 106294250 106124451 105995537 106037376 106114960 106106087 106101799 106164833 106257721 106355522 106483147 106609726
$$ packed form
1471A00875900M02046N4764l3066J17730R6847o5948p9659O4522M0169j25450k15226
1482A01132629k68982l44657l99254n47104o34407j162194k232620k936149l931000
1491H8676262l493813j631828l9749K130417L181167L407578L326942K605248K061027
1500A00223251J373940J006866R09874Q19710R64829O94274r5794l39104j69632j17950
1510A05270264l8170J6807L8483J13655L05840K74208n1476m9736K93617L00194L8666
1521A06512352q7303k11456k02851M013J6159j52702j64513p9582N104J83747J76361
1532A05999329l9154r4628j13342K9396M79317N28602K55364N4672k66647l31307j22383
1543A06379219q4969j69799j28914M1839P7584q873m288O3034R2888R7801J27625J26579
$$ plain form
1555 106609726 106877350 107665871 108230995 107668877 106837822 106345367 106039711 106059357 106140877 105987549
1565 105987549 105837463 105904915 105964424 105853127 105597328 105111618 104567909 104193016 103736664 102857086
1575 102857086 102055405 101740242 101847145 102634331 103542183 104027939 104298874 104343079 104275391 104192688
1585 104192688 104136635 104231285 104326202 104311226 104189445 103922127 103524490 102984138 102344818 101579811 100888084
1596 100888084 100450706 100294754 100570869 101089119 101736664 102432701 103057053 103614731 104068275 104424858
1606 104424858 104658958 104830833 105011108 105142899 105156303 105160927 105264946 105402634 105612373 105689980 105331017
1617 105331017 104874344 104575249 104379990 104391815 104395035 104110046 103831627 103801559 103899071 104113152 104356049
1628 104356049 104505585 104653831 104848572 105100319 105508781 105853912 105918289 105793571 105422951 105034111
$$ packed form
1555A06609726K67624P88521N65124n62118q31055m92455l05656J9646Q1520j53328
1565A05987549j50086O7452N9509j11297k55799m85710n43709l74893m56352q79578
1575A02857086q01681l15163J06903P87186R07852M85756K70935M4205o7688q2703
1585A04192688n6053R4650R4917j4976j21781k67318l97637n40352o39320p65007o91727
1596A00888084m37378j55952K76115N18250O47545O96037O24352N57678M53544L56583
1606A04424858K34100J71875J80275J31791J3404M624J04019J37688K09739P7607l58963
1617A05331017m56673k99095j95259J1825L220k84989k78419l0068R7512K14081K42897
1628A04356049J49536J48246J94741K51747M08462L45131O4377j24718l70620l88840
$$ plain form
1638 105034111 104891708 104827759 104739426 104695702 104748032 104846115 105038574 105079742 104601738 104019714 103637337
1649 103637337 103420830 103634140 103687691 102836754 101810478 101149872 100674629 100404831 100280144 100259491
1659 100259491 100304817 100382401 100438118 100346420 100287552 100422310 100683304 101114868 101542641 101778122 101908035
1670 101908035 101891609 101922752 102297638 102668427 102689285 102650215 102741905 102916046 103193207 103557037 104015800
1681 104015800 104515930 105100609 105487801 105227829 104866600 104898216 105028175 105111000 105193497 105238625 105352234
1692 105352234 105703735 106064987 106215790 106301476 106388016 106493065 106743904 106877495 106519127 106131027
1702 106131027 106165100 106277466 106246185 106157112 105996346 105841209 105775978 105765839 105797935 105890465 106074188
1713 106074188 106298470 106568649 106747337 106653641 106423164 106079674 105777428 105737091 105783081 105805779 105827736
$$ packed form
1638A05034111j42403o3949q8333m3724N2330R8083J92459M1168m78004n82024l82377
1649A03637337k16507K13310N3551q50937j026276o60606m75243k69798j24687k0653
1659A00259491M5326P7584N5717r1698n8868J34758K60994M31564M27773K35481J29913
1670A01908035j6426L1143L74886L70789K0858l9070R1690J74141K77161L63830M58763
1681A04015800N00130N84679L87192k59972l61229L1616J29959Q2825Q2497M5128J13609
1692A05352234L51501L61252J50803Q5686Q6540J05049K50839J33591l58368l88100
1702A06131027L4073J12366l1281q9073j60766j55137o5231j0139L2096R2530J83723
1713A06074188K24282K70179J78688r3696k30477l43490l02246m0337M5990K2698K1957
$$ plain form
1724 105827736 105820847 105827209 105889557 105977753 106058907 106183624 106433578 106682465 106858749 106879471 106501915
1735 106501915 106133675 106229401 106405022 106380630 106298111 106199501 106104401 106046318 106025269 106054878 106127426
1746 106127426 106267044 106391617 106414963 106373192 106243134 106116318 106095718 106123611 106188438 106254700 106255363
1757 106255363 106273247 106412292 106541916 106542511 106484863 106366684 106287239 106390930 106540039 106619263 106705597
1768 106705597 106867668 107014938 107084366 107061768 106864380 106634567 106503059 106421898 106384346 106397339 106496902
1779 106496902 106588722 106558014 106501862 106497452 106489563 106426239 106374573 106393524 106455376 106571342 106683304 106748917
1791 106748917 106732056 106531334 106300209 106176712 106105423 106093765 106091019 106041718 105967209 105854462 105751228
1802 105751228 105714012 105703331 105688477 105699417 105773209 105857750 105909325 105939651 105935905 105927727 105946373 105973839
$$ packed form
1724A05827736o889O362O2348Q8196Q1154J24717K49954K48887J76284K0722l77556
1735A06501915l68240R5726J75621k4392q2519r8610r5100n8083k1049K9609P2548
1746A06127426J39618J24573K3346m1771j30058j26816k0600K7893O4827O6262O63
1757A06255363J7884J39045J29624N95n7648j18179p9445J03691J49109P9224Q6334
1768A06705597J62071J47270O9428k2598j97388k29813j31508q1161l7552J2993R9563
1779A06496902R1820l0708n6152m410p889o3324n1666J8951O1852J15966J11962O5613
1791A06748917j6861k00722k31125j23497p1289j1658k746m9301p4509j12747j03234
1802A05751228l7216j0681j4854J0940P3792Q4541N1575L0326l746q178J8646K7466
$$ plain form
1814 105973839 105999443 106032272 106077911 106136032 106208778 106294106 106389664 106498238 106640457 106760384 106770493
1825 106770493 106785889 106932541 107090256 107186150 107204010 107042458 106883766 106929184 107020401 107051041 107066559
1836 107066559 107068253 107081940 107132790 107223701 107396576 107559540 107628250 107621742 107494736 107355499 107326767
1847 107326767 107319763 107271118 107227135 107217049 107228493 107271599 107307816 107288170 107253815 107231857 107215141 107212921
1859 107212921 107203003 107154106 107102654 107070633 107069969 107145615 107220436 107237526 107181068 106980392 106743073 106561325
1871 106561325 106410522 106305313 106220009 106121872 106046555 106028534 106038353 106061073 106087585 106092979 106109520 106178642
1883 106178642 106247925 106257698 106271072 106355240 106438110 106455017 106450958 106446815 106450226 106482384 106523323 106562187 106592606
1896 106592606 106595299 106597946 106624123 106666611 106732681 106802177 106856560 106898285 106907936 106932259 107037971 107145355
$$ packed form
1814A05973839K5604L2829M5639N8121P2746Q5328R5558J08574J42219J19927J0109
1825A06770493J5396J46652J57715R5894J7860j61552j58692M5418R1217L0640J5518
1836A07066559J694J3687N0850R0911J72875J62964O8710o508j27006j39237k8732
1847A07326767p004m8645m3983j0086J1444M3106L6217j9646l4355k1958j6716k220
1859A07212921r918m8897n1452l2021o64P5646P4821J7090n6458k00676k37319j81748
1871A06561325j50803j05209q5304r8137p5317j8021R819K2720K6512N394J6541O9122
1883A06178642O9283R773J3374Q4168Q2870J6907m059m143L411L2158M0939L8864L0419
1896A06592606K693K647K6177M2488O6070O9496N4383M1725R651K4323J05712J07384
$$ plain form
1908 107145355 107184242 107192635 107175896 107161804 107187485 107230064 107293442 107334259 107288124 107221840 107182671 107164528
1920 107164528 107198120 107220337 107151817 107072067 107046700 107037758 107032921 107020691 106977509 106927010 106888290 106851341
1932 106851341 106812950 106771561 106725525 106671593 106602737 106528473 106458969 106385063 106305458 106206322 106059097 105906487
1944 105906487 105782745 105684639 105627655 105589699 105546806 105520058 105526039 105554268 105598572 105662537 105763817 105853844
1956 105853844 105870987 105872086 105900856 105934952 105961586 105995461 106050491 106116028 106198593 106260468 106238914 106215309
1968 106215309 106268501 106343056 106407616 106468483 106516930 106566666 106638550 106702164 106722786 106733917 106762192 106793236
1980 106793236 106821205 106846855 106865097 106887627 106932472 106975578 106988762 107002090 107042999 107091064 107141037 107174446
1992 107174446 107153679 107130882 107157661 107198044 107233170 107263275 107282349 107290390 107278229 107267044 107282661 107301689
$$ packed form
1908A07145355L8887Q393j6739j4092K5681M2579O3378M0817m6135o6284l9169j8143
1920A07164528L3592K2217o8520p9750k5367q942m837j2230m3182n0499l8720l6949
1932A06851341l8391m1389m6036n3932o8856p4264o9504p3906p9605r9136j47225j52610
1944A05906487j23742r8106n6984l7956m2893k6748N981K8229M4304O3965J01280R0027
1956A05853844J7143J099K8770L4096K6634L3875N5030O5537Q2565O1875k1554k3605
1968A06215309N3192P4555O4560O0867M8447M9736P1884O3614K0622J1131K8275L1044
1980A06793236K7969K5650J8242K2530M4845M3106J3184J3328M0909M8065M9973L3409
1992A07174446k0767k2797K6779M0383L5126L0105J9074Q041j2161j1185J5617J9028
$$ plain form
2004 107301689 107306648 107305336 107298920 107289810 107285095 107271645 107220459 107186150 107233093 107302711 107360764 107398460 107387756
2017 107387756 107352043 107296112 107247688 107247231 107261017 107261154 107270195 107310989 107354424 107377243 107384537 107360527 107344292
2030 107344292 107387711 107436493 107445572 107439110 107418633 107406738 107441017 107477692 107479355 107464386 107439850 107401894
2042 107401894 107334900 107281036 107295753 107323288 107326195 107305046 107228806 107154610 107141090 107152626 107184769 107202576
2054 107202576 107152321 107085846 107043793 107005928 106964661 106922508 106880783 106835556 106783844 106724068 106647133 106572624
2066 106572624 106525490 106480553 106421471 106346581 106244537 106127907 106013893 105876968 105690910 105474876 105236481
2077 105236481 104983879 104742905 104467773 104117607 103703476 103208305 102675415 102166893 101609085 100953461
2087 100953461 100186440 99281120 98228981 97023392 95631554 94019745 92183922 90082047 87794281
$$ packed form
2004A07301689M959j312o416r110m715j3450n1186l4309M6943O9618N8053L7696j0704
2017A07387756l5713n5931m8424m57J3786J37R041M0794M3435K2819P294k4010j6235
2030A07344292M3419M8782R079o462k0477j1895L4279L6675J663j4969k4536l7956
2042A07401894o6994n3864J4717K7535K907k1149p6240p4196j3520J1536L2143J7807
2054A07202576n0255o6475m2053l7865m1267m2153m1725m5227n1712n9776p6935p4509
2066A06572624m7134m4937n9082p4890j02044j16630j14014j36925j86058k16034k38395
2077A05236481k52602k40974k75132l50166m14131m95171n32890n08522n57808o55624
2087A00953461p67021r05320j052139j205589j391838j611809j835823k101875k287766
$$ plain form
2096 87794281 85350922 82859467 80393524 78085014 76046135 74409531 73338409 72853088 73052521
2105 73052521 73863724 75290703 77201363 79524635 82081200 84690018 87284996 89758774 92053940
2114 92053940 94062851 95828438 97349289 98650719 99751427 100669739 101416275 102032730 102561569
2123 102561569 103010750 103403809 103736519 104008934 104231430 104409172 104557655 104689934 104818390 104970383
2133 104970383 105114029 105223465 105307861 105360100 105403137 105460693 105523201 105589958 105657982 105726524 105788086
2144 105788086 105835464 105866959 105871292 105869797 105887291 105901672 105892250 105879356 105876923 105883308 105909538 105931427 105917145
2157 105917145 105900620 105912163 105930801 105950119 105956772 105915924 105885696 105931976 105996223 106042358 106068680 106050034
2169 106050034 106020660 106013321 106007050 105986664 105967400 105962463 105962708 105962822 105964088 105964996 105968567 105976959 105991318 106016373
$$ packed form
2096H7794281k443359k491455k465943k308510k038879j636604j071122m85321J99433
2105G3052521Q11203J426979J910660K323272K556565K608818K594978K473778K295166
2114I2053940K008911J765587J520851J301430J100708R18312P46536O16455N28839
2123A02561569M49181L93059L32710K72415K22496J77742J48483J32279J28456J51993
2133A04970383J43646J09436Q4396N2239M3037N7556O2508O6757O8024O8542O1562
2144A05788086M7378L1495M333j495J7494J4381r422j2894k433O385K6230K1889j4282
2157A05917145j6525J1543J8638J9318O653m0848l0228M6280O4247M6135K6322j8646
2169A06050034k9374p339o271k0386j9264m937K45J14J266R08L571Q392J4359K5055
$$ plain form
2183 106016373 106043289 106064011 106080750 106086823 106100769 106151726 106200981 106204674 106207275 106248810 106298660 106340027
2195 106340027 106371452 106374954 106382965 106433151 106491562 106526970 106568527 106651833 106726288 106739929 106732178 106713104
2207 106713104 106718513 106815239 106920219 106959602 106972504 106964325 106962082 107008865 107061813 107088211 107100655 107095741
2219 107095741 107088730 107094788 107110718 107140686 107177521 107218048 107254173 107273842 107285568 107287521 107298637 107354279
2231 107354279 107403206 107391930 107362457 107335426 107321259 107351807 107383469 107369949 107351044 107352615 107369896 107420158
2243 107420158 107462952 107447647 107421753 107419487 107430031 107462433 107491158 107482811 107469917 107481071 107494545 107492752
2255 107492752 107491753 107503273 107522415 107557419 107580635 107549644 107516739 107534981 107559486 107554581 107545753 107549355 107557251
2268 107557251 107564827 107577850 107609535 107632515 107614227 107583519 107556679 107538528 107548447 107559158 107540535 107520103
$$ packed form
2183A06016373K6916K0722J6739O073J3946N0957M9255L693K601M1535M9850M1367
2195A06340027L1425L502Q011N0186N8411L5408M1557Q3306P4455J3641p751j9074
2207A06713104N409R6726J04980L9383J2902q179k243M6783N2948K6398J2444m914
2219A07095741p011O058J5930K9968L6835M0527L6125J9669J1726J953J1116N5642
2231A07354279M8927j1276k9473k7031j4167L0548L1662j3520j8905J571J7281N0262
2243A07420158M2794j5305k5894k266J0544L2402K8725q347j2894J1154J3474j793
2255A07492752r99J1520J9142L5004K3216l0991l2905J8242K4505m905q828L602P896
2268A07557251P576J3023L1685K2980j8288l0708k6840j8151R919J0711j8623k0432
$$ plain form
2280 107520103 107520149 107526039 107528732 107533600 107544327 107556602 107566574 107576439 107588478 107598709 107601997 107603958 107603195 107615303
2294 107615303 107669044 107723495 107734825 107740326 107767082 107801819 107847549 107882545 107880493 107858131 107816696 107776215
2306 107776215 107760048 107759239 107774277 107800034 107830688 107868599 107920311 107967377 107988190 107998680 107998131 108014656 108086418
2319 108086418 108182404 108291008 108391876 108457352 108497787 108508942 108506752 108507225 108505676 108511139 108498146 108423950
2331 108423950 108349419 108333466 108339142 108354279 108363197 108327484 108302994 108354950 108416702 108444046 108434769 108355927
2343 108355927 108255478 108161690 108100746 108117340 108184052 108281540 108430054 108681129 108921432 109033394 109081055
2354 109081055 109074326 109057785 109095573 109138702 109172890 109158066 109011864 108846565 108758850 108713005 108711670 108736420
2366 108736420 108788559 108811424 108725998 108600357 108484695 108353302 108182022 108016037 107901741 107811188 107736107
$$ packed form
2280A07520103M6N890K693M868J0727J2275R972R865J2039J0231L288J961p63J2108
2294A07615303N3741N4451J1330N501K6756L4737M5730L4996k052k2362m1435m0481
2306A07776215j6167q09J5038K5757L0654L7911N1712M7066K0813J0490n49J6525P1762
2319A08086418R5986J08604J00868O5476M0435J1155k190M73j549N463j2993p4196
2331A08423950p4531j5953N676J5137Q918l5713k4490N1956O1752K7344r277p8842
2343A08355927j00449r3788o0944J6594O6712R7488J48514K51075K40303J11962M7661
2354A09081055o729j6541L7788M3129L4188j4824j46202j65299q7715m5845j335K4750
2366A08736420N2139K2865q5426j25641j15662j31393j71280j65985j14296r0553p5081
$$ plain form
2377 107736107 107663605 107563400 107479355 107465576 107461067 107408829 107350945 107313942 107287140 107273766 107258392 107212875
2389 107212875 107178207 107199547 107236191 107262184 107278488 107276413 107258698 107220001 107175850 107131599 107112122 107164886
2401 107164886 107227180 107244324 107239655 107210899 107180115 107172897 107176109 107193253 107199783 107157898 107110687 107092209 107091568
2414 107091568 107113411 107145020 107179001 107203934 107198479 107185028 107181145 107179764 107180450 107180687 107172417 107171677 107204910 107232643
2428 107232643 107210228 107179283 107168098 107171700 107201599 107236572 107256218 107269623 107280754 107284546 107275368 107258675
2440 107258675 107234573 107213257 107210609 107209679 107198334 107177879 107137299 107101364 107097794 107106659 107119011 107129547 107120224
2453 107120224 107120056 107167580 107216026 107225822 107213852 107170578 107135483 107162476 107198456 107204315 107191704 107149956 107106705
2466 107106705 107092926 107087875 107077553 107072495 107081482 107095741 107111259 107122162 107120964 107108162 107073761 107041382 107036423
$$ packed form
2377A07736107p2502j00205q4045j3779m509n2238n7884l7003k6802j3374j5374m5517
2389A07212875l4668K1340L6644K5993J6304k075j7715l8697m4151m4251j9477N2764
2401A07164886O2294J7144m669k8756l0784p218L212J7144O530m1885m7211j8478o41
2414A07091568K1843L1609L3981K4933n455j3451l883j381O86K37q270p40L3233K7733
2428A07232643k2415l0945j1185L602K9899L4973J9646J3405J1131L792r178j6693
2440A07258675k4102k1316k648r30j1345k0455m0580l5935l570Q865J2352J0536r323
2453A07120224j68M7524M8446R796j1970m3274l5095K6993L5980N859j2611m1748m3251
2466A07106705j3779n051j0322n058Q987J4259J5518J0903j198j2802l4401l2379m959
$$ plain form
2479 107036423 107043549 107058212 107073380 107083031 107079483 107042023 107003304 106997276 106999130 106996078 106985809 106954453 106923599
2492 106923599 106917191 106914116 106895538 106878448 106878349 106880547 106873962 106863068 106844971 106830383 106831024 106840637 106862709 106879448
2506 106879448 106870819 106846642 106800911 106760788 106757805 106772591 106806564 106828545 106790115 106744217 106732536 106740280
2518 106740280 106775833 106811211 106814095 106805946 106794998 106788399 106801178 106817551 106822632 106828590 106841446 106864761 106918907
2531 106918907 106959297 106925964 106885216 106895851 106920143 106939293 106955048 106962776 106962799 106951164 106935974 106923576 106914948
2544 106914948 106921814 106917976 106865738 106810997 106794830 106793640 106793213 106806160 106854202 106895569 106884506 106854698 106821724
2557 106821724 106794044 106793449 106795166 106776497 106752991 106731056 106715248 106713821 106721855 106744888 106759766 106734772 106700897
2570 106700897 106682251 106667519 106655861 106639740 106608009 106570412 106520294 106495735 106557533 106630707 106651711 106647011
$$ packed form
2479A07036423P126J4663J5168R651l548l7460l8719o028J854l052j0269l1356l0854
2492A06923599o408l075j8578j7090r9K198o585j0894j8097j4588O41R613K2072J6739
2506A06879448q629k4177m5731m0123k983J4786L3973K1981l8430m5898j1681P744
2518A06740280L5553L5378K884q149j0948o599J2779J6373N081N958J2856K3315N4146
2531A06918907M0390l3333m0748J0635K4292J9150J5755P728K3j1635j5190j2398q628
2544A06914948O866l838n2238n4741j6167j190m27J2947M8042M1367j1063k9808l2974
2557A06821724k7680n95J717j8669k3506k1935j5808j427Q034K3033J4878k4994l3875
2570A06700897j8646j4732j1658j6121l1731l7597n0118k4559O1798P3174K1004m700
$$ plain form
2582 106647011 106612679 106576302 106577087 106576134 106542442 106491180 106415535 106350304 106338379 106348442 106367851 106383415 106372757
2595 106372757 106350876 106322884 106295822 106279800 106270409 106267357 106268288 106275818 106274483 106238029 106201149 106196045 106203842
2608 106203842 106221581 106233360 106217194 106188057 106152130 106113647 106077881 106047630 106027504 106016991 106020401 106027695
2620 106027695 106033417 106027962 105992317 105949112 105918076 105888771 105849815 105823563 105839516 105864761 105872749 105873703 105868622
2633 105868622 105858536 105842209 105827286 105820587 105823181 105843803 105865982 105873413 105874084 105871292 105862640 105842110 105823799
2646 105823799 105823471 105830048 105831909 105846497 105903412 105954239 105947304 105921745 105900833 105880356 105863853 105851006 105844116
2659 105844116 105838608 105829163 105820129 105815979 105810829 105796623 105784081 105781647 105787964 105808594 105831192 105848076 105850883
2672 105850883 105818481 105781265 105763863 105762436 105794022 105820343 105797050 105759331 105725929 105701752 105702805 105714462
$$ packed form
2582A06647011l4332l6377P85r53l3692n1262p5645o5231j1925J0063J9409J5564j0658
2595A06372757k1881k7992k7062j6022r391l052R31P530j335l6454l6880n104P797
2608A06203842J7739J1779j6166k9137l5927l8483l5766l0251k0126j0513L410P294
2620A06027695N722n455l5645m3205l1036k9305l8956k6252J5953K5245P988R54n081
2633A05868622j0086j6327j4923o699K594K0622K2179P431O71k792q652k0530j8311
2646A05823799l28O577J861J4588N6915N0827o935k5559k0912k0477j6503j2847o890
2659A05844116n508r445r034m150n150j4206j2542k434O317K0630K2598J6884K807
2672A05850883l2402l7216j7402j427L1586K6321k3293l7719l3402k4177J053J1657
$$ plain form
2684 105714462 105728676 105741547 105744095 105743431 105747627 105744675 105724503 105689240 105625031 105569763 105575630 105585548 105540344
2697 105540344 105498482 105514069 105540802 105544945 105542633 105542587 105533241 105507561 105460617 105367783 105280777 105261276 105254745
2710 105254745 105217575 105178429 105156685 105136414 105107330 105071617 105016853 104976364 104999039 105025574 104996559 104960892
2722 104960892 104954910 104956795 104949112 104955032 105002335 105059624 105111458 105137444 105094025 105035301 105005836 104990410 104996109
2735 104996109 105000610 104977631 104945969 104913834 104886551 104875397 104870461 104866501 104860588 104847839 104828522 104796005 104765938
2748 104765938 104758217 104753304 104733559 104712936 104703590 104693199 104668167 104644180 104634598 104632759 104648277 104645493 104567696
2761 104567696 104487274 104464722 104478958 104560326 104615044 104519150 104393410 104330704 104290649 104264114 104249931 104248596
2773 104248596 104245926 104223892 104194382 104166336 104130295 104079414 104014488 103922554 103837990 103803993 103780769 103742905
$$ packed form
2684A05714462J4214J2871K548o64M196k952k0172l5263o4209n5268N867R918m5204
2697A05540344m1862J5587K6733M143k312m6r346k5680m6944r2834q7006j9501o531
2710A05254745l7170l9146k1744k0271k9084l5713n4764m0489K2675K6535k9015l5667
2722A04960892n982J885p683N920M7303N7289N1834K5986m3419n8724k9465j5426N699
2735A04996109M501k2979l1662l2135k7283j1154m936l960n913j2749j9317l2517l0067
2748A04765938p721m913j9745k0623r346j0391k5032k3987r582j839J5518k784p7797
2761A04567696q0422k2552J4236Q1368N4718r5894j25740o2706m0055k6535j4183j335
2773A04248596k670k2034k9510k8046l6041n0881o4926r1934q4564l3997k3224l7864
$$ plain form
2785 103742905 103690430 103605507 103516075 103446671 103389549 103349640 103313423 103266289 103216095 103167198 103115250 103058983
2797 103058983 102993515 102909515 102818848 102734230 102643631 102533463 102421021 102318695 102227570 102164200 102094551
2808 102094551 101978111 101850769 101731827 101630402 101570389 101526642 101486351 101436378 101360176 101255058 101097511
2819 101097511 100933167 100810364 100697472 100576736 100454758 100331398 100208900 100091339 99972794 99853943
2829 99853943 99719116 99545738 99354958 99154785 98961830 98817299 98655220 98404312 98121521 97833702
2839 97833702 97559593 97342392 97135445 96899292 96655251 96415161 96167969 95903969 95630768 95352982
2849 95352982 95069572 94770386 94487167 94252228 94053551 93899460 93760918 93608139 93451569 93287750
2859 93287750 93128395 92974876 92854401 92808151 92795326 92790146 92788460 92761734 92756912 92822311 92925095 93049286
$$ packed form
2785A03742905n2475q4923q9432o9404n7122l9909l6217m7134n0194m8897n1948n6267
2797A03058983o5468q4000r0667q4618r0599j10168j12442j02326r1125o3370o9649
2808A02094551j16440j27342j18942j01425o0013m3747m0291m9973p6202j05118j57547
2819A01097511j64344j22803j12892j20736j21978j23360j22498j17561j18545j18851
2829I9853943j34827j73378j90780k00173j92955j44531j62079k50908k82791k87819
2839I7833702k74109k17201k06947k36153k44041k40090k47192k64000k73201k77786
2849I5352982k83410k99186k83219k34939j98677j54091j38542j52779j56570j63819
2859I3287750j59355j53519j20475m6250j2825n180j686k6726m822O5399J02784J24191
$$ plain form
2871 93049286 93192505 93341278 93512650 93726608 93960693 94193031 94441727 94735931 95020317 95225716
2881 95225716 95422623 95681908 95933243 96118233 96272064 96402954 96533180 96708534 96866676 96950272
2891 96950272 96989723 96986748 96969841 96975395 96981384 96985367 96964882 96886108 96780678 96661804 96550819 96490501
2903 96490501 96429588 96325493 96194763 96032188 95860123 95703316 95549179 95389511 95235680 95099350
2913 95099350 94971344 94847443 94724396 94589256 94466873 94380379 94321823 94303986 94287750 94223305 94155190
2924 94155190 94103386 94091438 94170570 94277664 94357872 94437408 94522835 94618248 94729614 94857712 95010681
2935 95010681 95172310 95321106 95480896 95673439 95883102 96104240 96328636 96545746 96756767 96952820
2945 96952820 97153351 97383095 97617172 97834869 98048233 98269890 98477028 98641945 98791595 98944046
$$ packed form
2871I3049286J43219J48773J71372K13958K34085K32338K48696K94204K84386K05399
2881I5225716J96907K59285K51335J84990J53831J30890J30226J75354J58142Q3596
2891I6950272L9451k975j6907N554N989L983k0485p8774j05430j18874j10985o0318
2903I6490501o0913j04095j30730j62575j72065j56807j54137j59668j53831j36330
2913I5099350j28006j23901j23047j35140j22383q6494n8556j7837j6236o4445o8115
2924I4155190n1804j1948P9132J07094Q0208P9536Q5427R5413J11366J28098J52969
2935I5010681J61629J48796J59790J92543K09663K21138K24396K17110K11021J96053
2945I6952820K00531K29744K34077K17697K13364K21657K07138J64917J49650J52451
$$ plain form
2955 98944046 99097992 99256393 99424530 99623154 99808456 99926590 100028374 100156525 100281120 100383781
2965 100383781 100472282 100534866 100611420 100763893 100914192 100990082 101035995 101067162 101099014 101161285 101226257
2976 101226257 101274773 101310471 101328133 101334831 101333382 101330994 101345467 101347878 101304146 101247261 101210571 101158501 101057053
2989 101057053 100934525 100810669 100676964 100530121 100374008 100211403 100042130 99865723 99685623 99498436
2999 99498436 99323868 99181030 99067924 99000427 98943733 98865196 98773911 98662712 98547363 98454834 98344131
3010 98344131 98196838 97972107 97601410 97149017 96675797 96123100 95443298 94663879 93772430 92841080
3020 92841080 91904068 91062355 90445038 90001633 89727043 89614006 89658882 89845703 90174461 90593719
3030 90593719 91049072 91549446 92095520 92657372 93204208 93739151 94259476 94751640 95206406 95608116
$$ packed form
2955I8944046J53946J58401J68137J98624J85302J18134J01784J28151J24595J02661
2965A00383781Q8501O2584P6554J52473J50299P5890M5913L1167L1852O2271O4972
2976A01226257M8516L5698J7662O698j449k388J4473K411m3732n6885l6690n2070j01448
2989A01057053j22528j23856j33705j46843j56113j62605j69273j76407j80100j87187
2999I9498436j74568j42838j13106o7497n6694p8537r1285j11199j15349r2529j10703
3010I8344131j47293k24731l70697m52393m73220n52697o79802p79419q91449r31350
3020I2841080r37012q41713o17317m43405k74590j13037M4876J86821L28758M19258
3030I0593719M55353N00374N46074N61852N46836N34943N20325M92164M54766M01710
$$ plain form
3040 95608116 95937225 96196198 96373009 96491333 96585556 96611496 96524071 96360374 96137856 95870300 95575478
3051 95575478 95258667 94924927 94592407 94273712 93990417 93753838 93607399 93613960 93726326 93918060
3061 93918060 94189598 94545128 94946716 95364235 95778488 96169235 96509239 96758415 96935104 97055222
3071 97055222 97085854 96991585 96795822 96498871 96134399 95698853 95303917 95057297 94967247 95103477 95389008
3082 95389008 95797348 96246552 96641685 96995018 97283218 97518082 97698112 97839882 97960426 98056534
3092 98056534 98138618 98182487 98159477 98093124 97989105 97872139 97769615 97678970 97605255 97552917 97530220
3103 97530220 97530838 97551628 97591087 97650070 97718330 97784592 97852753 97928925 97995117 98036499 98049614 98013969
3115 98013969 97965790 97954391 97919846 97791718 97650505 97558449 97499535 97502113 97495125 97397133 97267624 97137238
$$ packed form
3040I5608116L29109K58973J76811J18324R4223K5940q7425j63697k22518k67556k94822
3051I5575478l16811l33740l32520l18695k83295k36579j46439O561J12366J91734
3061I3918060K71538L55530M01588M17519M14253L90747L40004K49176J76689J20118
3071I7055222L0632r4269j95763k96951l64472m35546l94936k46620r0050J36230K85531
3082I5389008M08340M49204L95133L53333K88200K34864J80030J41770J20544R6108
3092I8056534Q2084M3869k3010o6353j04019j16966j02524r0645p3715n2338k2697
3103I7530220O18K0790L9459N8983O8260O6262O8161P6172O6192M1382J3115l5645
3115I8013969m8179j1399l4545j28128j41213r2056n8914K578o988r7992j29509j30386
$$ plain form
3127 97137238 97011017 96906113 96816612 96750664 96683212 96584343 96476532 96376823 96271301 96145317 96017960
3138 96017960 95906685 95801544 95696213 95596954 95512627 95428940 95337341 95229263 95082092 94929123 94801903
3149 94801903 94682907 94563820 94448280 94335648 94230339 94139931 94054031 93975159 93871811 93688080 93499519
3160 93499519 93382187 93278526 93153572 93015335 92844513 92687798 92603607 92537209 92451286 92351959 92227699
3171 92227699 92093895 91966011 91832352 91683365 91527771 91365768 91213226 91091988 90984032 90880890
3181 90880890 90775604 90656235 90529205 90391754 90259430 90164330 90053864 89865181 89660980 89488052
3191 89488052 89331177 89195755 89066574 88930771 88786766 88627052 88456390 88262817 88088730 87994049
3201 87994049 87914177 87791153 87664917 87566971 87464401 87325691 87178085 87045166 86906120 86737442
$$ packed form
3127I7137238j26221j04904q9501o5948o7452r8869j07811r9709j05522j25984j27357
3138I6017960j11275j05141j05331r9259q4327q3687r1599j08078j47171j52969j27220
3149I4801903j18996j19087j15540j12632j05309r0408q5900p8872j03348j83731j88561
3160I3499519j17332j03661j24954j38237j70822j56715q4191o6398q5923r9327j24260
3171I2227699j33804j27884j33659j48987j55594j62003j52542j21238j07956j03142
3181I0880890j05286j19369j27030j37451j32324r5100j10466j88683k04201j72928
3191H9488052j56875j35422j29181j35803j44005j59714j70662j93573j74087r4681
3201H7994049p9872j23024j26236r7946j02570j38710j47606j32919j39046j68678
$$ plain form
3211 86737442 86570694 86438438 86314079 86183235 86041618 85864258 85698792 85600182 85521194 85435028 85335304
3222 85335304 85201164 85048843 84877518 84717079 84606430 84517593 84444427 84360001 84223343 84070442 83923790
3233 83923790 83782623 83664848 83536957 83343979 83168076 83104988 83058853 82951736 82825493 82696220
3243 82696220 82563087 82434654 82298637 82129974 81975220 81893112 81821800 81706139 81584717 81486534 81384941
3254 81384941 81258583 81120422 80970383 80826088 80706596 80607201 80536125 80473351 80408310 80320763 80166336
3265 80166336 80006500 79902054 79810478 79707169 79599213 79482056 79365898 79263016 79162384 79053352
3275 79053352 78946709 78848503 78762123 78698967 78640961 78578209 78497383 78362679 78231430 78162384 78115173
3286 78115173 78070900 78023720 77962585 77884079 77774834 77653503 77526398 77417160 77364037 77329132 77283165
$$ packed form
3211H6737442j66748j32256j24359j30844j41617j77360j65466r8610p8988q6166r9724
3222H5335304j34140j52321j71325j60439j10649q8837p3166q4426j36658j52901j46652
3233H3923790j41167j17775j27891j92978j75903o3088m6135j07117j26243j29273
3243H2696220j33133j28433j36017j68663j54754q2108p1312j15661j21422r8183j01593
3254H1384941j26358j38161j50039j44295j19492r9395p1076o2774o5041q7547j54427
3265H0166336j59836j04446r1576j03309j07956j17157j16158j02882j00632j09032
3275G9053352j06643r8206q6380o3156n8006o2752q0826j34704j31249o9046m7211
3286G8115173m4273m7180o1135p8506j09245j21331j27105j09238n3123l4905m5967
$$ plain form
3297 77283165 77238441 77209778 77160217 77029564 76901962 76863403 76848076 76818771 76775574 76697083 76610184 76535919
3309 76535919 76470184 76420975 76373100 76301834 76243446 76246811 76249168 76186272 76111267 76061584 76020027 75979614
3321 75979614 75946899 75928947 75917221 75907730 75893684 75866768 75827332 75766205 75703476 75652435 75624207 75647278
3333 75647278 75682541 75699852 75700546 75664970 75625633 75614166 75613167 75622437 75621773 75574516 75529671 75528908 75557419 75629547
3347 75629547 75699516 75712395 75710060 75713112 75730278 75794388 75853706 75849701 75835510 75852867 75877502 75894234 75917145
3360 75917145 75957413 76008484 76071236 76134201 76188919 76227211 76226089 76221443 76246765 76286079 76331230 76391960
3372 76391960 76485207 76581093 76647255 76708099 76778839 76854446 76941200 77020264 77059982 77104874 77205681 77311874
3384 77311874 77384209 77439308 77469376 77508064 77598930 77704216 77799347 77888130 77955605 78033569 78164886 78301094
$$ packed form
3297G7283165m4724k8663m9561j30653j27602l8559j5327k9305m3197p8491q6899p4265
3309G6535919o5735m9209m7875p1266n8388L365K357o2896p5005m9683m1557m0413
3321G5979614l2715j7952j1726r491j4046k6916l9436o1127o2729n1041k8228K3071
3333G5647278L5263J7311O94l5576l9337j1467r99R270o64m7257m4845p63K8511P2128
3347G5629547O9969J2879k335L052J7166O4110N9318m005j4191J7357K4635J6732K2911
3360G5917145M0268N1071O2752O2965N4718L8292j122m646K5322L9314M5151O0730
3372G6391960R3247R5886O6162O0844P0740P5607Q6754P9064L9718M4892J00807J06193
3384G7311874P2335N5099L0068L8688R0866J05286R5131Q8783O7475P7964J31317J36208
$$ plain form
3396 78301094 78397057 78485367 78588913 78691483 78772095 78867767 79029106 79194382 79308868 79401901 79480362
3407 79480362 79556870 79641174 79748459 79922028 80086990 80153152 80209396 80330635 80468536 80593201 80723999
3418 80723999 80878090 81032013 81164337 81285835 81394287 81507156 81639526 81796028 81996964 82210281
3428 82210281 82416008 82598015 82713364 82822273 82983398 83158279 83329201 83492371 83630707 83766029
3438 83766029 83921432 84075974 84209801 84342720 84491608 84645416 84798050 84951141 85100151 85257240
3448 85257240 85435631 85627365 85832954 86039948 86232117 86421059 86611725 86807587 87022827 87230278
3458 87230278 87400627 87554428 87703796 87844467 87968727 88098717 88254593 88434502 88654587 88880730
3468 88880730 89082047 89264801 89414406 89562370 89753723 89933060 90031006 90134331 90322876 90547989
$$ packed form
3396G8301094R5963Q8310J03546J02570Q0612R5672J61339J65276J14486R3033P8461
3407G9480362P6508Q4304J07285J73569J64962O6162N6244J21239J37901J24665J30798
3418H0723999J54091J53923J32324J21498J08452J12869J32370J56502K00936K13317
3428H2210281K05727J82007J15349J08909J61125J74881J70922J63170J38336J35322
3438H3766029J55403J54542J33827J32919J48888J53808J52634J53091J49010J57089
3448H5257240J78391J91734K05589K06994J92169J88942J90666J95862K15240K07451
3458H7230278J70349J53801J49368J40671J24260J29990J55876J79909K20085K26143
3468H8880730K01317J82754J49605J47964J91353J79337R7946J03325J88545K25113
$$ plain form
3478 90547989 90804909 91041489 91176865 91292145 91455605 91624664 91776108 91919800 92043808 92190170
3488 92190170 92426323 92664078 92816879 92947075 93092346 93240120 93386818 93542816 93717667 93910172
3498 93910172 94135025 94354012 94531754 94674370 94755814 94837067 94990349 95155807 95293930 95415688
3508 95415688 95518799 95603539 95650192 95716240 95877762 96059158 96200035 96330688 96464058 96591614 96713943
3519 96713943 96816399 96868256 96917892 97019363 97124863 97194214 97258545 97343918 97425034 97477051 97524429
3530 97524429 97596214 97653389 97657059 97635696 97595619 97564056 97578857 97614166 97648979 97706413 97824165 97937317
3542 97937317 97989319 97992447 97913048 97832367 97839714 97877144 97923752 97957535 97930695 97899551 97913406 97945404
3554 97945404 97991821 98032593 98032616 98033096 98061630 98123550 98248741 98391029 98513100 98618103 98706482 98749016
$$ packed form
3478I0547989K56920K36580J35376J15280J63460J69059J51444J43692J24008J46362
3488I2190170K36153K37755J52801J30196J45271J47774J46698J55998J74851J92505
3498I3910172K24853K18987J77742J42616Q1444Q1253J53282J65458J38123J21758
3508I5415688J03111Q4740M6653O6048J61522J81396J40877J30653J33370J27556J22329
3519I6713943J02456N1857M9636J01471J05500O9351O4331Q5373Q1116N2017M7378
3530I7524429P1785N7175L670k1363m0077l1563J4801L5309L4813N7434J17752J13152
3542I7937317N2002L128p9399q0681P347L7430M6608L3783k6840l1144J3855L1998
3554I7945404M6417M0772K3M80K8534O1920J25191J42288J22071J05003Q8379M2534
$$ plain form
3566 98749016 98686005 98609039 98590424 98628159 98766113 98938820 99090881 99236008 99364998 99490929 99624374
3577 99624374 99763390 99906059 100062653 100241066 100446198 100699539 100959106 101192184 101392342 101528595
3587 101528595 101641487 101756187 101887772 102069641 102271606 102474380 102678490 102879478 103072693 103258820
3597 103258820 103417183 103507210 103589058 103704285 103868080 104139229 104428482 104660629 104852272 104982780
3607 104982780 105088379 105205322 105312775 105394600 105472870 105562660 105668854 105828545 105960037 105968498 105930283
3618 105930283 105871819 105847717 105950851 106092575 106197861 106318588 106509735 106686806 106779221 106799957 106717087
3629 106717087 106594826 106477310 106392715 106406738 106450775 106480789 106488609 106430580 106368874 106341026 106377365 106548615
3641 106548615 106770920 106985641 107187553 107360168 107478355 107505920 107459282 107311081 107156372 107087418
$$ packed form
3566I8749016o3011p6966j8615L7735J37954J72707J52061J45127J28990J25931J33445
3577I9624374J39016J42669J56594J78413K05132K53341K59567K33078K00158J36253
3587A01528595J12892J14700J31585J81869K01965K02774K04110K00988J93215J86127
3597A03258820J58363R0027Q1848J15227J63795K71149K89253K32147J91643J30508
3607A04982780J05599J16943J07453Q1825P8270Q9790J06194J59691J31492Q461l8215
3618A05930283n8464k4102J03134J41724J05286J20727J91147J77071R2415K0736q2870
3629A06717087j22261j17516q4595J4023M4037L0014P820n8029o1706k7848L6339J71250
3641A06548615K22305K14721K01912J72615J18187K7565m6638j48201j54709o8954
$$ plain form
3651 107087418 107085129 107192825 107315468 107366898 107363724 107257439 107157135 107184006 107253029 107308029 107383652
3662 107383652 107493828 107644363 107874725 108097885 108226654 108300827 108310532 108317467 108400848 108498169 108589745
3673 108589745 108626152 108513115 108365318 108268639 108214851 108245918 108297012 108290192 108306763 108429909 108575745
3684 108575745 108686996 108766914 108806183 108785034 108655548 108492516 108343483 108242157 108265205 108331223 108378502
3695 108378502 108424522 108467407 108503464 108531090 108541725 108507393 108484360 108523865 108612801 108776711 108950569
3706 108950569 109083961 109158470 109128212 109025002 108847023 108648941 108470131 108354660 108385323 108485123 108620834
3717 108620834 108743690 108772324 108771370 108793640 108792999 108698914 108637238 108760048 108918068 108988693 109043953 109114716
3729 109114716 109201767 109344910 109457657 109444901 109372070 109264824 109147095 109022400 108977386 109157654 109389709
$$ packed form
3651A07087418k289J07696J22643N1430l174j06285j00304K6871O9023N5000P5623
3662A07383652J10176J50535K30362K23160J28769P4173R705O935Q3381R7321R1576
3673A08589745L6407j13037j47797r6679n3788L1067N1094o820J6571J23146J45836
3684A08575745J11251P9918L9269k1149j29486j63032j49033j01326K3048O6018M7279
3695A08378502M6020M2885L6057K7626J0635l4332k3033L9505Q8936J63910J73858
3706A08950569J33392P4509l0258j03210j77979j98082j78810j15471L0663R9800J35711
3717A08620834J22856K8634r54K2270o41r4085o1676J22810J58020P0625N5260P0763
3729A09114716Q7051J43143J12747j2756p2831j07246j17729j24695m5014J80268K32055
$$ plain form
3740 109389709 109539864 109634186 109642914 109599472 109505249 109426620 109476013 109516335 109424065 109270546 109056854
3751 109056854 108869957 108820915 108838341 108901337 108969185 108983971 108976318 108957077 108927658 108893204 108853195 108795143
3763 108795143 108759781 108804413 108866837 108908913 108915474 108843781 108738068 108606865 108514450 108559753 108647156 108702179
3775 108702179 108760193 108845543 108916473 108938141 108914085 108809448 108704468 108696983 108699226 108624603 108567070 108616852
3787 108616852 108698395 108769203 108820053 108795120 108791710 108935829 109085510 109106995 109101532 109130951 109179520 109280731
3799 109280731 109348557 109274193 109159447 109075951 109005020 108961273 108916428 108826256 108752968 108754036 108799126 108879181
3811 108879181 108987473 109129906 109259438 109331108 109344505 109258339 109149979 109101128 109057236 108986115 108902237
3822 108902237 108789803 108707382 108736488 108792397 108801720 108811783 108849358 108902740 108975288 109048225 109100319 109142113
$$ packed form
3740A09389709J50155R4322Q728m3442r4223p8629M9393M0322r2270j53519k13692
3751A09056854j86897m9042J7426O2996O7848J4786p653j9241k9419l4454m0009n8052
3763A08795143l5362M4632O2424M2076O561p1693j05713j31203r2415M5303Q7403N5023
3775A08702179N8014Q5350P0930K1668k4056j04637j04980p485K243p4623n7533M9782
3787A08616852Q1543P0808N0850k4933l410J44119J49681K1485n463K9419M8569J01211
3799A09280731O7826p4364j14746q3496p0931m3747m4845r0172p3288J068M5090Q0055
3811A08879181J08292J42433J29532P1670J3397q6166j08360m8851m3892p1121q3878
3822A08902237j12434q2421K9106N5909R323J0063L7575N3382P2548P2937N2094M1794
$$ plain form
3834 109142113 109178688 109205124 109227272 109217979 109124252 109029053 109029312 109030052 108939621 108844826 108792450 108810875 108985497
3847 108985497 109191963 109335159 109412529 109372498 109266731 109125328 108961105 108776543 108632538 108611984
3857 108611984 108651062 108717323 108799171 108879684 108942413 108959412 108948227 108907532 108865807 108861084 108863281 108854462
3869 108854462 108836006 108794975 108756157 108754135 108746315 108682129 108619759 108598610 108624435 108750298 108873413 108890366
3881 108890366 108855942 108776070 108693527 108666779 108654449 108629677 108607315 108592728 108587410 108599686 108614250 108602448
3893 108602448 108612587 108699677 108814766 108943268 109036728 109001823 108958336 109061241 109111641 108885719 108613083
3904 108613083 108469177 108392616 108397484 108432579 108440277 108453651 108488770 108538795 108605835 108678841 108760521 108811615
3916 108811615 108777687 108706856 108620644 108544304 108521225 108518173 108520866 108515694 108462860 108426308 108477402 108554031
$$ packed form
3834A09142113L6575K6436K2148r293r3727r5199K59P40r0431r4795n2376J8425J74622
3847A08985497K06466J43196P7370m0031j05767j41403j64223j84562j44005k0554
3857A08611984L9078O6261Q1848Q0513O2729J6999j1185m0695m1725m723K197q819
3869A08854462j8456m1031l8818k022p820o4186o2370k1149K5825J25863J23115J6953
3881A08890366l4424p9872q2543k6748j2330k4772k2362j4587n318J2276J4564j1802
3893A08602448J0139Q7090J15089J28502R3460l4905m3487J02905N0400k25922k72636
3904A08613083j43906p6561M868L5095P698J3374L5119N0025O7040P3006Q1680N1094
3916A08811615l3928p0831q6212p6340k3079l052K693n172n2834l6552N1094P6629
$$ plain form
3928 108554031 108626839 108668854 108621307 108550163 108506248 108476021 108463501 108466507 108492538 108516312 108503723 108488464
3940 108488464 108491257 108516785 108589340 108670708 108734535 108769440 108749481 108691933 108598206 108489731 108372238 108293938
3952 108293938 108326408 108405113 108493759 108579086 108636398 108663483 108638191 108595322 108560226 108538841 108559319 108580322
3964 108580322 108555481 108528061 108535599 108548592 108546753 108540031 108516457 108521126 108632637 108738586 108733536 108674904
3976 108674904 108565781 108463715 108446098 108456345 108462646 108467842 108462570 108451363 108436752 108415100 108369324 108342285
3988 108342285 108392784 108455612 108484413 108481216 108398079 108338257 108428574 108550163 108634064 108657166 108533478 108382439
4000 108382439
$$ packed form
3928A08554031P2808M2015m7547p1144m3915l0227j2520L006K6031K3774j2589j5259
3940A08488464K793K5528P2555Q1368O3827L4905j9959n7548r3727j08475j17493p8300
3952A08293938L2470P8705Q8646Q5327N7312K7085k5292m2869l5096k1385K0478K1003
3964A08580322k4841k7420P538J2993j839o722k3574M669J11511J05949n050n8632
3976A08674904j09123j02066j7617J0247O301N196n272j1207j4611k1652m5776k7039
3988A08342285N0499O2828K8801l197q3137n9822R0317J21589Q3901K3102j23688j51039
4000A08382439
##END=$$ End of the data block
