##TITLE=$$ Begin of the data block
##JCAMP-DX=5.00 $$ ACD/SpecManager v 10.08
##SPECTROMETER/DATA SYSTEM=16PC
##DATE=18 Jun 2013 16:16:52
##DATA TYPE=INFRARED SPECTRUM
##DATA CLASS=XYDATA
##ORIGIN=
##OWNER=
##NPOINTS=3601
##FIRSTX=400.00000000
##LASTX=4000.00000000
##MAXX=4000.00000000
##MINX=400.00000000
##MAXY=291.67437744
##MINY=46.25394440
##XFACTOR=1.0000000000
##YFACTOR=0.000001000000000
##FIRSTY=46.25394440
##DELTAX=1.00000000
##XUNITS=1/CM
##YUNITS=TRANSMITTANCE
##XYDATA=(X++(Y..Y))
400D6253944J17472985P7820785M1529007Q597656k0973083m7183563m7547135m7547134
408A28423462o822762o822761J3889160K2545471K4721924K0773987J2575409K695938
416B11979828o417313j3073654j6673767j7665955j7129623j6142761j5225464j4153938
424I5497353j2245972q943115m331711P11883M827553O743988N817993K317101k616112
433H7778961p268013r856506r158112n105495R31980O492275R063420P448158K693977
442H3020645k126808l425491Q00789R502372J8761650K3715714K1202286J1580902
450A63032059j386063j2539322j8016220j7046120j1888542o138366k584458j930160
458I1502808k978730l889602l514595j959839j88309Q51837Q75672K94555k43759l61862
$$ y = [46253944, 163726929, 241547714, 283076721, 291674377, 270701294, 223517731, 175970596, 128423462, 121600700, 114777939, 128667099, 151212570, 175934494, 196708481, 209283890, 211979828, 205562515, 192488861, 175815094, 158149139, 141019516, 124876755, 109651291, 95497353, 83251381, 74308266, 69976555, 70688438, 75515991, 82259979, 88077972, 90395073, 87778961, 80510948, 70654442, 61496330, 56390835, 57322815, 63815090, 72878510, 80326668, 83020645, 80893837, 77468346, 78269135, 87771507, 106533157, 130248871, 151451157, 163032059, 161645996, 149106674, 131090454, 114044334, 102155792, 96017426, 93432968, 91502808, 88524078, 84634476, 81119881, 79160042, 78971733, 79823570, 80699242, 80993797, 80750038, 80388176]
468H0388176j30539J31767J91544P2914k9770L0060K14119L49464K94548O4308j87927
479H1388664k98889k16209j7838J66695K52701K35748J57585N3909o2278j76148k45941
490H1237999k17575p2693J34781K96821L19100J88461j4946j71783k02889j14464J9761
501H1402573J17836J41700J05713M7280q751o0677j14632j64886j92268j81160j37375
512H0955353q7410n9799o5201r2339j22917j48765j76049k12799k53860k78000k61917
523G9196297j98441j03844q049O3668J02089J12701J05164Q5746N8487L0838J5160
534G9459816K2758N4619R9076J38870J62155J68549J64627J55517J40427J17096Q9401
545H0772911O8794O6147Q0307R4925Q8471N1528l822n0789o7054n1209k2774o485j2962
$$ y = [80388176, 80257637, 80389404, 80580948, 80653862, 80624092, 80654152, 80868271, 81217735, 81512283, 81576591, 81388664, 81089775, 80873566, 80855728, 81022423, 81275124, 81510872, 81668457, 81722366, 81660088, 81483940, 81237999, 81020424, 80947731, 81082512, 81379333, 81698433, 81886894, 81871948, 81700165, 81497276, 81382812, 81402573, 81520409, 81662109, 81767822, 81815102, 81806351, 81745674, 81631042, 81466156, 81273888, 81092728, 80955353, 80867943, 80808144, 80742943, 80650604, 80527687, 80378922, 80202873, 79990074, 79736214, 79458214, 79196297, 78997856, 78894012, 78885963, 78949631, 79051720, 79164421, 79269585, 79355331, 79413818, 79444656, 79459816, 79482574, 79537193, 79636269, 79775139, 79937294, 80105843, 80270470, 80425987, 80566414, 80683510, 80772911, 80841705, 80907852, 80988159, 81083084, 81171555, 81223083, 81219261, 81168472, 81101418, 81050209, 81027435, 81020950, 81007988]
558H1007988l2166m3968l6361j6053k792j2901m6387q7044j15173j21453j10725r5238
570H0287727q3671p6508p0030o3339o1173o8985q5556j00097r7847o9817k0042L5804
582G9526466P9087R7946R2354P2525N2223M2313M6142N8563O8589O4575M0802K067
594H0243652l7147n9441n4756k6916Q071L1258L2768J7227m34n494O402K7290M2854
607H0225334M2015K3621l487k5924l2563j9470Q888M1352O4743O9252N3611K6703L609
620H0477684k922R712L1357M5189L8757J2261k1508m6051n2101m3098l1151k7672l5087
633H0355370m6349n1117m3220k4392j228J9669L5728M7310N5237N8128N4077M2382
645H0501595K5527P851p164j8700k7969l6110m2259m4487m1878l6484l3271l7575n1643
$$ y = [81007988, 80975822, 80931854, 80895493, 80879440, 80876648, 80863747, 80817360, 80730316, 80615143, 80493690, 80382965, 80287727, 80204056, 80127548, 80057518, 79994179, 79933006, 79864021, 79778465, 79678368, 79580521, 79510704, 79490662, 79526466, 79605553, 79703499, 79795853, 79868378, 79920601, 79962914, 80009056, 80067619, 80136208, 80200783, 80241585, 80243652, 80206505, 80147064, 80092308, 80065392, 80073463, 80104721, 80137489, 80154716, 80154282, 80148788, 80155190, 80182480, 80225334, 80267349, 80290970, 80287483, 80261559, 80228996, 80209526, 80218414, 80259766, 80324509, 80393761, 80447372, 80474075, 80477684, 80474762, 80484474, 80515831, 80561020, 80599777, 80612038, 80590530, 80544479, 80492378, 80449280, 80418129, 80390457, 80355370, 80309021, 80257904, 80214684, 80190292, 80189064, 80208733, 80244461, 80291771, 80347008, 80405136, 80459213, 80501595, 80527122, 80534973, 80527809, 80509109, 80481140, 80445030, 80402771, 80358284, 80316406, 80279922, 80246651, 80209076, 80157433]
658H0157433p2625r2209r9143q3756m2717J6480P6240J13876J11779O6925n677p9032
670H0067574j27465j39755j23840j01151r3193j10359j48941j97510k46506k94792
680G8484062l48190m13437m92157n78461o61209p26700p60528p48177o77192n42107
690G2535904l50395j25099R9372K87491M14635M74380M78287M48853M10385L81782
700G5055595L73223L86398M16069M52049M81484M92378M76723M33807L70606K99713
710G9238045K35061J86852J57669J41914J28067J04302O3949Q667n2780j10008j57234
721G9944504j96633k36747k86126l47358m14200m73862n12909n21827m97330m41429
731G6016083l59711k60979j57631o4857K396L4568L1243J739l8666p4424r4170r1781
$$ y = [80157433, 80084808, 79992599, 79893456, 79809700, 79766983, 79783463, 79859703, 79973579, 80085358, 80152283, 80146606, 80067574, 79940109, 79800354, 79676514, 79575363, 79482170, 79371811, 79222870, 79025360, 78778854, 78484062, 78135872, 77722435, 77230278, 76651817, 75990608, 75263908, 74503380, 73755203, 73078011, 72535904, 72185509, 72060410, 72159782, 72447273, 72861908, 73336288, 73814575, 74263428, 74673813, 75055595, 75428818, 75815216, 76231285, 76683334, 77164818, 77657196, 78133919, 78567726, 78938332, 79238045, 79473106, 79659958, 79817627, 79959541, 80087608, 80191910, 80255859, 80264526, 80211746, 80101738, 79944504, 79747871, 79511124, 79224998, 78877640, 78463440, 77989578, 77476669, 76954842, 76457512, 76016083, 75656372, 75395393, 75237762, 75172905, 75175301, 75209869, 75241112, 75242851, 75204185, 75129761, 75035591, 74943810]
743G4943810o5728j7418M9424J28402K11212K89185L56339M09942M49967M76318M86916
754G7718369M78202M47914L97820L34839K69188K10708J66344J39160J28968J33987
764H0425499J51390J77681K08687K40082K68043K89711L02788L05603K97226K78107
774H2944817K50686K18727J86127J55266J26488R9266P3478N0316L1975J9882J3771
785H4170799J1612J0582Q545M387k152j1085k2659l6965n3497p0854q6647r7664j00433
798H3723969r2522p3998m8767k3689n371M257J0277K2461M8591Q7052J24657J42234
810H3919151J25382P4539O180n5512r1530r7290q1787n8174l3592n669L0678P2670
822H3805046J04004J00067M3038o3813j92039k98645l46047l19610k33170j19728j4183
$$ y = [74943810, 74878082, 74860664, 74910088, 75038490, 75249702, 75538887, 75895226, 76305168, 76755135, 77231453, 77718369, 78196571, 78644485, 79042305, 79377144, 79646332, 79857040, 80023384, 80162544, 80291512, 80425499, 80576889, 80754570, 80963257, 81203339, 81471382, 81761093, 82063881, 82369484, 82666710, 82944817, 83195503, 83414230, 83600357, 83755623, 83882111, 83981377, 84054855, 84105171, 84137146, 84157028, 84170799, 84182411, 84192993, 84201538, 84205925, 84203773, 84192688, 84170029, 84133064, 84079567, 84008713, 83922066, 83824402, 83723969, 83631447, 83557449, 83508682, 83484993, 83479622, 83483879, 83494156, 83516617, 83565208, 83652260, 83776917, 83919151, 84044533, 84119072, 84125252, 84069740, 83978210, 83880920, 83799133, 83740959, 83707367, 83701698, 83732376, 83805046, 83909050, 84009117, 84052155, 83988342, 83796303, 83497658, 83151611, 82832001, 82598831, 82479103, 82464920]
833H2464920O1714J04271J22330J26633J22108J07651Q1238M5761J0643j2322j5457
844H3219490L97K6603N2338P0465Q0925Q8959J00059J15517J31157J39572J35056J16478
856H4277016Q8340N8014L2441J5693P805O157O798O065J801o089j5770k3941k7610
869H4426720k5673j9852j4198j3077j8753l0113m2923n1987n3520m6608l3646j8791
881H4057579o439J30k90o600j6281k5635l1593l2249k7779k0355j3214r995j3206k3629
895H3830444l9718n8121p4608q6044r1850r4719r9785j11794j32576j59454j85814
906H2695961k03995k08473j98242j76933j50666j25946j07017r5230q9066q4854p7911
917H1177628o3897l9703n196L6621P9751J16630J40556J47294J36795J13006Q2588
$$ y = [82464920, 82526634, 82630905, 82753235, 82879868, 83001976, 83109627, 83190865, 83236626, 83247269, 83234947, 83219490, 83219887, 83246490, 83298828, 83369293, 83450218, 83539177, 83639236, 83754753, 83885910, 84025482, 84160538, 84277016, 84365356, 84423370, 84455811, 84471504, 84479309, 84485466, 84492264, 84498329, 84500130, 84494041, 84478271, 84454330, 84426720, 84401047, 84381195, 84366997, 84353920, 84335167, 84305054, 84262131, 84210144, 84156624, 84110016, 84076370, 84057579, 84051140, 84051270, 84050980, 84044380, 84028099, 84002464, 83970871, 83938622, 83910843, 83890488, 83877274, 83867279, 83854073, 83830444, 83790726, 83732605, 83657997, 83571953, 83480103, 83385384, 83285599, 83173805, 83041229, 82881775, 82695961, 82491966, 82283493, 82085251, 81908318, 81757652, 81631706, 81524689, 81429459, 81340393, 81255539, 81177628, 81113731, 81074028, 81068832, 81105453, 81185204, 81301834, 81442390, 81589684, 81726479, 81839485, 81922073]
928H1922073N2681K8305J0582l013j6915l4736n6877q0437j01021j15539j24352j30913
940H1349838j39808j53977j73202j94794k15286k32476k46330k58499k71194k86545
950G9177727l06145l31017l61404l96385m33609m69650n00855n23781n35301n32226
960G4787354n11109m68925m04625l20038k20375j12602l663J01204J98571K85995L60832
971G3692619M19510M57924M71954M59008M18564L53569K70851J81022R6978L0593j0765
982G6841827k6710k3705j1818o33M105J541o264j6578k8222m1198n5535o9709q0613
995G6486488q4846q0589o9397n5504m4396m0352m4303n3711o3286o7497o2485m7516
1007G5772606k5047O63K5063M4929N9006O8054P4204Q0154Q8028R8961J12511J26533
$$ y = [81922073, 81974754, 82003059, 82013641, 82010628, 81993713, 81958977, 81902100, 81821663, 81720642, 81605103, 81480751, 81349838, 81210030, 81056053, 80882851, 80688057, 80472771, 80240295, 79993965, 79735466, 79464272, 79177727, 78871582, 78540565, 78179161, 77782776, 77349167, 76879517, 76378662, 75854881, 75319580, 74787354, 74276245, 73807320, 73402695, 73082657, 72862282, 72749680, 72746017, 72847221, 73045792, 73331787, 73692619, 74112129, 74570053, 75042007, 75501015, 75919579, 76273148, 76543999, 76725021, 76821999, 76852592, 76841827, 76815117, 76791412, 76779594, 76778961, 76783066, 76784607, 76778343, 76761765, 76733543, 76692345, 76636810, 76567101, 76486488, 76401642, 76321053, 76251656, 76196152, 76151756, 76111404, 76067101, 76013390, 75950104, 75882607, 75820122, 75772606, 75747559, 75748222, 75773285, 75818214, 75877220, 75945274, 76019478, 76099632, 76187660, 76286621, 76399132, 76525665]
1019G6525665J37711J42486J38543J25862J07727R0210Q1009Q6799J11000J51413K00302
1030G7898727K46239K77886K87735K74581K43180K01393J56814J14014P4623L8613
1040G9813805O492k0302m0092n2681n9990o5338p1686q0376r0858j01791j12175j21498
1052G9003510j29281j34185j34293j28326j17463j05728r9312j03889j22444j53855
1062G7774734j92443k29065k52083k49519k12082j36872l0845Q8699J97586K72080
1072G7030190K97149K71454K07352J24908M3709k4048p5539j14990j48208j78193k03323
1083G7230461k18834k20054k05010j75461j35826r1316m6089k594L8681P8049J16279
1094G6368286J53626J89384K21718K47978K65541K73155K71836K64824K56874K51991
$$ y = [76525665, 76663376, 76805862, 76944405, 77070267, 77177994, 77268204, 77349213, 77436012, 77547012, 77698425, 77898727, 78144966, 78422852, 78710587, 78985168, 79228348, 79429741, 79586555, 79700569, 79775192, 79813805, 79820297, 79799995, 79759903, 79707222, 79647232, 79581894, 79510208, 79429832, 79338974, 79237183, 79125008, 79003510, 78874229, 78740044, 78605751, 78477425, 78359962, 78254234, 78154922, 78051033, 77928589, 77774734, 77582291, 77353226, 77101143, 76851624, 76639542, 76502670, 76471825, 76560524, 76758110, 77030190, 77327339, 77598793, 77806145, 77931053, 77974762, 77950714, 77875175, 77760185, 77611977, 77433784, 77230461, 77011627, 76791573, 76586563, 76411102, 76275276, 76183960, 76137871, 76135277, 76173958, 76252007, 76368286, 76521912, 76711296, 76933014, 77180992, 77446533, 77719688, 77991524, 78256348, 78513222, 78765213]
1104G8765213K51900K55577K59575K60284K55020K43012K24930K01705J74057J42640
1114H1033913J08543P4112M2557J7120q4r102j1772j0902r156p827o699m318J045J0460
1128H1227890K3483L8330N2536O4270P2976P9635Q5625R1400R5825R6680R1965Q1596
1140H2102211O7932N4993M6791M5441N0514N9234O7536P1152O6627N2101K8046j747
1152H2710831l0892n1414n6954m4922j8264J5526M7180O8817P6629P1412N7197L9200
1164H2884346K1477N737q209k2011l7147n4062p1854q8455j01418j08879j09764j04042
1176H2205719r2270p5462n5184l3661j3977N80P340N157n073k1027l9680n8274p4730
1189H1749458q7883r6634j00494r9289r3788q5648p7156p0373o6284o4187o1828n5977
$$ y = [78765213, 79017113, 79272690, 79532265, 79792549, 80047569, 80290581, 80515511, 80717216, 80891273, 81033913, 81142456, 81216568, 81259125, 81276245, 81276161, 81267059, 81255287, 81244385, 81235229, 81227402, 81220703, 81216385, 81217430, 81227890, 81251373, 81289703, 81342239, 81406509, 81479485, 81559120, 81644745, 81736145, 81831970, 81928650, 82020615, 82102211, 82170143, 82225136, 82271927, 82317368, 82367882, 82427116, 82494652, 82565804, 82632431, 82684532, 82712578, 82710831, 82679939, 82628525, 82571571, 82526649, 82508385, 82523911, 82571091, 82639908, 82716537, 82787949, 82845146, 82884346, 82905823, 82911560, 82903351, 82881340, 82844193, 82790131, 82718277, 82629822, 82528404, 82419525, 82309761, 82205719, 82113449, 82037987, 81982803, 81949142, 81935165, 81935745, 81943085, 81948242, 81943169, 81922142, 81882462, 81824188, 81749458, 81661575, 81564941, 81464447, 81365158, 81271370, 81185722, 81108566, 81038193, 80971909, 80907722, 80845894, 80789917]
1201H0789917m3907k4620O8K5757M6654N7907N7549M7668L3363K0546J3260J1910J3756
1214H1049828J4854J2733P721K869J640N944J4694K4467L1502L3714L1594K7740K4849
1227H1284149K4292K5360K5849K3971J8906J1474L281m593j1535j7678k3193k7817
1239H1332466l1509l4455l7407m1099m5273m8637m9332m6288m0466l4294l0617l0319
1251H0862770l1853l1746k7236j8059p065J327L960O87n432j0109j0086m876L533J2077
1265H0737892J8311K1255K1362J9684J7311J5099J3535J3000J3702J5343J7471J9478
1277H0943443K1218K2934K5161K8077L1089L2601L0594K3429J0659o295k4726m0993
1289H1097191n1979n5763n2079m2038k7755j1368N043J9867L1807L9909M3739M3503
$$ y = [80789917, 80746010, 80721390, 80721458, 80747215, 80793869, 80851776, 80909325, 80956993, 80990356, 81010902, 81024162, 81036072, 81049828, 81064682, 81077415, 81085136, 81088005, 81089645, 81095589, 81110283, 81134750, 81166252, 81199966, 81231560, 81259300, 81284149, 81308441, 81333801, 81359650, 81383621, 81402527, 81414001, 81417282, 81412689, 81401154, 81383476, 81360283, 81332466, 81300957, 81266502, 81229095, 81187996, 81142723, 81094086, 81044754, 80998466, 80958000, 80923706, 80893089, 80862770, 80830917, 80799171, 80771935, 80753876, 80746811, 80748138, 80752098, 80752785, 80747353, 80737244, 80727158, 80722282, 80725815, 80737892, 80756203, 80777458, 80798820, 80818504, 80835815, 80850914, 80864449, 80877449, 80891151, 80906494, 80923965, 80943443, 80964661, 80987595, 81012756, 81040833, 81071922, 81104523, 81135117, 81158546, 81169205, 81162910, 81138184, 81097191, 81045212, 80989449, 80937370, 80895332, 80867577, 80856209, 80861252, 80881119, 80912926, 80952835, 80996574, 81040077]
1301H1040077M0177L5385L1021K8641K9228L2631L7628M2206M4136M2015L5919K7687
1313H1466751K0256J6350J6907K0965K5627K7695K4925J6884M990q599k1316l1151
1325H1580284l6697l7216l2952k5169j6434r735p492j0384j6731k2690k3933j7418
1337H1323433l105J5808L3783M5311M7355M0406K8228J5648O256P56k236m997q713
1350H1537933j3099j7487k2209k9266m1237n9136q0833j01685j15860j19896j13502
1361H0823723r9655q2863o7208n5656m9881n0301n5969o3751o8886o6391n3268l0594
1373H0079300l006K3262M3152N4359N7251N2986M2534K7039Q880o950j4648j0208N317
1386H0359268K4933L8513L7491J9653q995l7086n2467m7966k4437R887M3129O4774
$$ y = [81040077, 81080254, 81115639, 81146660, 81175301, 81204529, 81237160, 81274788, 81316994, 81361130, 81403145, 81439064, 81466751, 81487007, 81503357, 81520264, 81541229, 81566856, 81594551, 81619476, 81636360, 81641350, 81632751, 81611435, 81580284, 81543587, 81506371, 81473419, 81448250, 81431816, 81422081, 81414589, 81404205, 81387474, 81364784, 81340851, 81323433, 81320328, 81336136, 81369919, 81415230, 81462585, 81502991, 81531219, 81546867, 81553123, 81553879, 81551643, 81546646, 81537933, 81524834, 81507347, 81485138, 81455872, 81414635, 81355499, 81274666, 81172981, 81057121, 80937225, 80823723, 80724068, 80641205, 80573997, 80518341, 80468460, 80418159, 80362190, 80298439, 80229553, 80163162, 80109894, 80079300, 80076294, 80099556, 80142708, 80197067, 80254318, 80307304, 80349838, 80376877, 80385757, 80378807, 80364159, 80353951, 80359268, 80384201, 80422714, 80460205, 80479858, 80470863, 80433777, 80381310, 80333344, 80308907, 80318794, 80361923, 80426697]
1398H0426697P0061O1203M5562L1708K5040K5848L0060L2669L0624K4491J6403P782
1410H0828148k777j7952l8872o1912p8599p9154n7801j6472L4760Q1627J11503J17737
1422H0820236J02005P2029L8750J1856l570q225p965j0712k1705m0505o0013p0343
1434H0821838o4613m3983j9188o699k2240p4470j61743k71897l84948m76311n21538
1445G8774208n03128m17809k81875j28662K983Q5899J18935J28334J53686K24656L41537
1456G8498764M72099N67810N90363N33234M25254L14026K39998K15920K24037K30514
1466H2312019K07993J51871Q1367K7100J2550M1702R8076J54801J88263J88079J58081
1477H3621902J10566N7212L296n3238j17652j93497k79556l70285m58641n37499n99976
$$ y = [80426697, 80496758, 80557961, 80603523, 80635231, 80660271, 80686119, 80716179, 80748848, 80779472, 80803963, 80820366, 80828148, 80825371, 80807419, 80768547, 80706635, 80628036, 80548882, 80491081, 80474609, 80509369, 80590996, 80702499, 80820236, 80922241, 80994270, 81033020, 81044876, 81041306, 81033081, 81025116, 81014404, 80992699, 80952194, 80892181, 80821838, 80757225, 80713242, 80694054, 80687355, 80665115, 80590645, 80428902, 80157005, 79772057, 79295746, 78774208, 78271080, 77853271, 77571396, 77442734, 77445717, 77531616, 77650551, 77778885, 77932571, 78157227, 78498764, 78970863, 79538673, 80129036, 80662270, 81087524, 81401550, 81641548, 81857468, 82081505, 82312019, 82520012, 82671883, 82753250, 82780350, 82792900, 82834602, 82932678, 83087479, 83275742, 83463821, 83621902, 83732468, 83789680, 83792976, 83739738, 83622086, 83428589, 83149033, 82778748, 82320107, 81782608, 81182632]
1488H1182632o36970o35681n81078m60426k69859j9585K64862N45517P78686R24134
1498H1092232R54536Q64884O77520M40705K16964O4049J4298O2362J67946K74124L32108
1509H5161728L20267K49153J50139N7029q941m3961n5862n4894m7050l3478j3397J2619
1521H5693352M2312P2342R8809J16859J20438J04896P0694K6436j3649l7125m1778
1532H6253586l8704m5944p6325j26297j74629j92101j57600p0579M7050J60522K37618
1543H5816597K61467K34947J76537J10321N5923K1172K52k2271o2904j28204k07390
1554H6256447k72659k89628k34138j07658N8517K12891L05000L06931K25143R6252
1564H6557098l0593j15883j46149j36963j22215j35239j90430k74131l49335l72391
$$ y = [81182632, 80545662, 79909981, 79328903, 78868477, 78598618, 78579033, 78843895, 79389412, 80168098, 81092232, 82046768, 82911652, 83589172, 84029877, 84246841, 84310890, 84325188, 84387550, 84555496, 84829620, 85161728, 85481995, 85731148, 85881287, 85938316, 85929375, 85885414, 85829552, 85774658, 85727608, 85694130, 85680733, 85693352, 85735664, 85808006, 85906815, 86023674, 86144112, 86249008, 86319702, 86346138, 86332489, 86295364, 86253586, 86214882, 86168938, 86092613, 85966316, 85791687, 85599586, 85441986, 85371407, 85418457, 85578979, 85816597, 86078064, 86313011, 86489548, 86599869, 86655792, 86676964, 86677216, 86654945, 86592041, 86463837, 86256447, 85983788, 85694160, 85460022, 85352364, 85410881, 85623772, 85928772, 86235703, 86460846, 86557098, 86526505, 86410622, 86264473, 86127510, 86005295, 85870056, 85679626, 85405495, 85056160, 84683769]
1574H4683769l14575j77704L952J77468K93685L27996K87811K05040J17920N3177J7380
1585H5675919l21j7273m6921r3414j52359k14683k70112l08540l21052l00850k45850
1596H3704544j60500n5610N3940J52855K28752K74147K87399K73132K40845K02202
1606H5201706J66458J36238J06453O8161J5305m9477j14227j63780j88248j89430j79787
1617H4809372j74820j83807k03621k20154k15347j75820r9067N493J19095K18414K81517
1628H4161255K93068K49847J63887O0715k7435p3006o4476j2291N4230R8419R1858
1639H4996071K7054p8957j91772k75231l08395k95441k63145k45964k66510l20946
1649H2776764l79067m00116l56254k50557j18561j0971L2806N250o6628j38008j71593
$$ y = [84683769, 84369194, 84191490, 84195442, 84372910, 84666595, 84994591, 85282402, 85487442, 85605362, 85658539, 85675919, 85675598, 85658325, 85611404, 85517990, 85365631, 85150948, 84880836, 84572296, 84251244, 83950394, 83704544, 83544044, 83488434, 83542374, 83695229, 83923981, 84198128, 84485527, 84758659, 84999504, 85201706, 85368164, 85504402, 85610855, 85679016, 85694321, 85644844, 85530617, 85366837, 85178589, 84989159, 84809372, 84634552, 84450745, 84247124, 84026970, 83811623, 83635803, 83536736, 83542229, 83661324, 83879738, 84161255, 84454323, 84704170, 84868057, 84928772, 84901337, 84828331, 84763855, 84751564, 84805794, 84904213, 84996071, 85023125, 84944168, 84752396, 84477165, 84168770, 83873329, 83610184, 83364220, 83097710, 82776764, 82397697, 81997581, 81641327, 81390770, 81272209, 81261238, 81294044, 81299294, 81232666, 81094658, 80923065]
1660H0923065j56677j10489o3408l7918l6133m1610l3951l319M3434Q9554J21155J36444
1672H0830147J44874J57708J77215J93566J91360J61919J12609O5720M8294P7080J49017
1683H2309509K41501L22769L65311L56781L01880K17567J24276L8421l0502p9270j07505
1694H4060738j15151j02020o8695j8700M0932J00403J49978J83068J98669K00615J95084
1705H4824921J86416J73798J51375J11610N1018k5086j01532j57325j73592j41762
1715H4899841o8603K5299J12518J69235J84121J61903J19835P8590N2117M1603L6667
1726H5813126K3315n836m5243p7751q4053n3764P042P7774J33278J56349J45447J13861
1738H6203545Q0398N8724N0583M7416L8201J7639r659l1807l6774j9058J7166O0547
$$ y = [80923065, 80766388, 80655899, 80592491, 80554573, 80518440, 80476830, 80442879, 80439560, 80482994, 80572548, 80693703, 80830147, 80975021, 81132729, 81309944, 81503510, 81694870, 81856789, 81969398, 82035118, 82083412, 82160492, 82309509, 82551010, 82873779, 83239090, 83595871, 83897751, 84115318, 84239594, 84278015, 84247513, 84168243, 84060738, 83945587, 83843567, 83774872, 83756172, 83797104, 83897507, 84047485, 84230553, 84429222, 84629837, 84824921, 85011337, 85185135, 85336510, 85448120, 85499138, 85474052, 85372520, 85215195, 85041603, 84899841, 84831238, 84856537, 84969055, 85138290, 85322411, 85484314, 85604149, 85682739, 85734856, 85776459, 85813126, 85836441, 85830605, 85785362, 85707611, 85623558, 85569794, 85576836, 85654610, 85787888, 85944237, 86089684, 86203545, 86283943, 86342667, 86393250, 86440666, 86478867, 86496506, 86486847, 86455040, 86418266, 86399208, 86416374, 86476921]
1750H6476921R8000J19842J22910J09886Q6983O1317L8933K4116J9188K3980L5728
1761H7217804M8767N5885N0301K9129m753m1832o9077p4989n4466j2192L9276Q4221
1773H7268074J10436J13700R8229P3273M8568L0457K1019J9150K1949K5658K5528J6724
1785H7872765l609l3783o6269q9851r4551p7294m4311q995J4671J8646M761j7151l4561
1798H7440468l8292k6581m532J9036L5652M0817L4805K2011R102J961L822J4046K8923
1811H7581238M3594N4360O0058O1470N9777N4924M5913L2105J5014j480j2962j6647
1823H7977364j2993m631N951J8333L3875N3527P5241R3911J03569J00929Q7578O8214
1835H8600868M7699K7855P271j5343l7712n2956n2795l2867L143M4006P5852Q8958
$$ y = [86476921, 86574921, 86694763, 86817673, 86927559, 87014542, 87075859, 87114792, 87138908, 87158096, 87182076, 87217804, 87266571, 87322456, 87372757, 87401886, 87397133, 87355301, 87286224, 87211235, 87156769, 87144577, 87183853, 87268074, 87378510, 87492210, 87590439, 87663712, 87712280, 87742737, 87763756, 87782906, 87804855, 87830513, 87856041, 87872765, 87869156, 87835373, 87769104, 87679253, 87584702, 87507408, 87463097, 87454102, 87468773, 87487419, 87492180, 87475029, 87440468, 87402176, 87375595, 87371063, 87390099, 87425751, 87466568, 87501373, 87523384, 87532486, 87534447, 87538269, 87552315, 87581238, 87624832, 87679192, 87739250, 87800720, 87860497, 87915421, 87961334, 87993439, 88008453, 88006973, 87994011, 87977364, 87964371, 87959740, 87965691, 87984024, 88017899, 88071426, 88146667, 88240578, 88344147, 88445076, 88532654, 88600868, 88648567, 88676422, 88683693, 88668350, 88630638, 88577682, 88524887, 88492020, 88495163, 88539169, 88615021, 88703979]
1847H8703979Q2039O1768L8368J9852Q949L327j099o973j3855j9371k1393k0554k0218
1860H8814819k5345l9413o1890q7310j06842j11931r8831p0763l7232j0093K563m04
1872H8167328j2764k5070k9908k5398j5365n707o11m42k426l441k365r9J579K243L243
1887H8050797O530J3039K1675K9732L4912L6476L5599L4324L4005L4607L5217L4965
1899H8401878L3692L1814K9702K7458K4910K2369K0928K1728K4872K8740L0044K5879
1911H8724014J5496J358j1559j8433j7089r285M57P325R056O668L593K861N265Q506
1925H8728233R011M120o035j8547k9152l4798l5301l3402l3493l8933n0712o6185q0490
1938H8314316q8570q7402p7416o2622m8546l9917l8269m1427m4434m2160l2013j5060
$$ y = [88703979, 88786018, 88847786, 88886154, 88906006, 88914955, 88918282, 88917183, 88910210, 88896355, 88876984, 88855591, 88835037, 88814819, 88789474, 88750061, 88688171, 88600861, 88494019, 88382088, 88283257, 88212494, 88175262, 88165169, 88167732, 88167328, 88154564, 88129494, 88099586, 88074188, 88058823, 88053116, 88052505, 88052063, 88049637, 88046196, 88043831, 88043732, 88045311, 88047554, 88050797, 88057327, 88070366, 88092041, 88121773, 88156685, 88193161, 88228760, 88263084, 88297089, 88331696, 88366913, 88401878, 88435570, 88467384, 88497086, 88524544, 88549454, 88571823, 88592751, 88614479, 88639351, 88668091, 88698135, 88724014, 88739510, 88740868, 88729309, 88710876, 88693787, 88684502, 88684959, 88692284, 88701340, 88708008, 88711601, 88714462, 88719727, 88728233, 88737244, 88741364, 88735329, 88716782, 88687630, 88652832, 88617531, 88584129, 88550636, 88511703, 88460991, 88394806, 88314316, 88225746, 88138344, 88060928, 87998306, 87949760, 87909843, 87871574, 87830147, 87785713, 87743553, 87711540, 87696480]
1950H7696480M616K1896L3310L8292L8559L7124L5965L5416L4561L2173K7954K2873
1962H8059219J8441J6159J6578J9272K3483K8252L2997L7171M0123M1000L9314L5095
1974H8407104K9496K4261K1324K1668K5040K9930L4179L5973L4370K9808K3537J7548
1986H8734238J3443J2474J4618J9088K4277K8626L1105L1807L1456L1021L0777K9770
1998H9032700K6596K0065J0445l51r446j4297j3763q744j449N417R773J0650Q194L586
2012H9079376j365m700m906j648L823R170J1902J0994P332L380J716L433P294J0773
2026H9136574J1436Q461L212j930n066n829n516n775p614j0697j3611j4984j4190j1811
2040H9062660r079p095o615p736j0307j4038j8631k3560k7992l0899l1601k9938k6672
$$ y = [87696480, 87701096, 87722992, 87756302, 87794594, 87833153, 87870277, 87906242, 87941658, 87976219, 88008392, 88036346, 88059219, 88077660, 88093819, 88110397, 88129669, 88153152, 88181404, 88214401, 88251572, 88291695, 88332695, 88372009, 88407104, 88436600, 88460861, 88482185, 88503853, 88528893, 88558823, 88593002, 88628975, 88663345, 88693153, 88716690, 88734238, 88747681, 88760155, 88774773, 88793861, 88818138, 88846764, 88877869, 88909676, 88941132, 88972153, 89002930, 89032700, 89059296, 89079361, 89089806, 89089455, 89080009, 89065712, 89051949, 89043205, 89041756, 89047173, 89056946, 89067596, 89075790, 89079376, 89078011, 89073311, 89068405, 89066757, 89070580, 89079750, 89091652, 89102646, 89109978, 89113358, 89115074, 89118507, 89125801, 89136574, 89148010, 89156471, 89159683, 89157753, 89152687, 89146858, 89141342, 89135567, 89127953, 89117256, 89103645, 89088661, 89074471, 89062660, 89053581, 89046486, 89039871, 89032135, 89021828, 89007790, 88989159, 88965599, 88937607, 88906708, 88875107, 88845169, 88818497]
2053H8818497k3270k1355k2239k6398l3119m0932m7844n2223n3391n1780m9080m7096
2065H8349770m7265n0178n5580o2760p1441q1543r3399j06949j21475j35704j48491
2076H7374985j59386j69151j79154j90597k04125k19375k35848k53204k71767k92160
2086H5200218l14422l37822l60749l81591l99209m13253m23554m29321m28696m18869
2096H1292732l97316l62610l15231k57118j91086j20071m6517K7321R9548J68282K32185
2107H0130119K90230L41759L86085M22051M48326M63730M68048M62082M47853M27490
2117H4287773M02596L74115L42559L08838K74727K42722K15187J93397J76690J63032
2127H6981636J49933J35765J20735J06217R4177Q5617Q0009P5707P0778O4354N7052
$$ y = [88818497, 88795227, 88773872, 88751633, 88725235, 88692116, 88651184, 88603340, 88551117, 88497726, 88445946, 88396866, 88349770, 88302505, 88252327, 88196747, 88133987, 88062546, 87981003, 87887604, 87780655, 87659180, 87523476, 87374985, 87215599, 87046448, 86867294, 86676697, 86472572, 86253197, 86017349, 85764145, 85492378, 85200218, 84885796, 84547974, 84187225, 83805634, 83406425, 82993172, 82569618, 82140297, 81711601, 81292732, 80895416, 80532806, 80217575, 79960457, 79769371, 79649300, 79602783, 79630104, 79729652, 79897934, 80130119, 80420349, 80762108, 81148193, 81570244, 82018570, 82482300, 82950348, 83412430, 83860283, 84287773, 84690369, 85064484, 85407043, 85715881, 85990608, 86233330, 86448517, 86641914, 86818604, 86981636, 87131569, 87267334, 87388069, 87494286, 87588463, 87674080, 87754089, 87829796, 87900574, 87964928, 88021980]
2138H8021980N0560M6547M5685M6921M8393M8065M5014L9726L3897K9290K6901K6390
2150H8509369K6314K4955K1218J5388R278N149M555P546J2275J5992J6471J3283Q141
2163H8689934L883L098O508J2596J8554K1462J9844J4259O920N65k419j167L937J1009
2177H8808983J7761K1904K2408J9516J4824J0528Q270Q568J0574J2696J3450J2429
2189H8981911R994P645O599P965J1879J7685K4056K9526L2699L3035L0991K7733K4689
2202H9246407K2621K1553K0759J9623J8204J7197J7501J9333K2057K4338K5261K4536
2214H9499390K3056K1690K0836K0142J8722J6251J3267J0918J0307J1498J3488J4847
2226H9694412J4679J3115J1444J0857J1886J3878J5541J5702J3771J0215N898J770
$$ y = [88021980, 88072540, 88119087, 88164772, 88211693, 88260086, 88308151, 88353165, 88392891, 88426788, 88456078, 88482979, 88509369, 88535683, 88560638, 88581856, 88597244, 88606522, 88611671, 88616226, 88623772, 88636047, 88652039, 88668510, 88681793, 88689934, 88693817, 88696915, 88703423, 88716019, 88734573, 88756035, 88775879, 88790138, 88797058, 88797623, 88795204, 88794037, 88797974, 88808983, 88826744, 88848648, 88871056, 88890572, 88905396, 88915924, 88924194, 88932762, 88943336, 88956032, 88969482, 88981911, 88991905, 88999550, 89006149, 89014114, 89025993, 89043678, 89067734, 89097260, 89129959, 89162994, 89193985, 89221718, 89246407, 89269028, 89290581, 89311340, 89330963, 89349167, 89366364, 89383865, 89403198, 89425255, 89449593, 89474854, 89499390, 89522446, 89544136, 89564972, 89585114, 89603836, 89620087, 89633354, 89644272, 89654579, 89666077, 89679565, 89694412, 89709091, 89722206, 89733650, 89744507, 89756393, 89770271, 89785812, 89801514, 89815285, 89825500, 89831398, 89833168]
2238H9833168j465l410m006l105j129J587M334O599Q148R026R407R491R399R422J0048
2253H9897514J1673J4557J8173K1477K3186K2407J9265J4587R583N256K007k3p78j22
2267I0058762K029N264Q454J0231R498O165J175l853p469q782p919n363j885J793N264
2282I0073364Q415J1384J4587J8303K2270K5810K7756K7458K5437K3094K2125K3338
2294I0323341K5925K8061K8168K6367K4528K5223K9709L6827M3388M6166M3861L8224
2306I0719788L2508K9732L0480L2997L4919L5286L5912M0276N1055O7650Q5709R8488
2318I1294800J00853R1919P6233O1599N4703N7503O5811P1533O7795N2979L2310J4824
2330I2042862P889J2443K2301K7992K3316R422n684j2703q102K426P156m249l2585
$$ y = [89833168, 89831703, 89828293, 89824287, 89821182, 89820053, 89821640, 89825974, 89832573, 89840721, 89849747, 89859154, 89868645, 89878044, 89887466, 89897514, 89909187, 89923744, 89941917, 89963394, 89986580, 90008987, 90028252, 90042839, 90052422, 90057678, 90059685, 90059662, 90058884, 90058762, 90060791, 90066055, 90074509, 90084740, 90094238, 90100403, 90101578, 90097725, 90090256, 90081474, 90073555, 90068192, 90066307, 90068100, 90073364, 90081779, 90093163, 90107750, 90126053, 90148323, 90174133, 90201889, 90229347, 90254784, 90277878, 90300003, 90323341, 90349266, 90377327, 90405495, 90431862, 90456390, 90481613, 90511322, 90548149, 90591537, 90637703, 90681564, 90719788, 90752296, 90782028, 90812508, 90845505, 90880424, 90915710, 90951622, 90991898, 91042953, 91110603, 91196312, 91294800, 91395653, 91487572, 91563805, 91625404, 91680107, 91737610, 91803421, 91874954, 91942749, 91995728, 92028038, 92042862, 92050751, 92063194, 92085495, 92113487, 92136803, 92146225, 92140541, 92127838, 92119736, 92122162, 92129318, 92125069, 92092484]
2343I2092484o6544q7524p9407l7674K7801R7359J51115J77804J78115J61454J38916
2354I2753899J17172R6496P3090M3594Q522k7786n9883q4480j02280j17035j32561
2365I2568748j49955j66558j77299j77742j66634j47422j26282j09787j01746j01974
2375I1143349j06827j11603j12579j08475j00136q9378p7965o6658n6015m6341l8139
2386I0229233l1594k6115k0515j3665n378K769Q370R368N509j106p172r933q721n203
2400I0125847k274j938m295p317q377n989n87N653J0254J1795J0361P156L456m5l128
2415I0140572n860p667p813n775j961K403N615O585N058J800k029n524p972q896p813
2430I0100723m432J121P637J3298J6121J5350J1544O660K884J518K335M127N272M837
$$ y = [92092484, 92025940, 91938416, 91859009, 91821335, 91849136, 91946495, 92097610, 92275414, 92453529, 92614983, 92753899, 92871071, 92967567, 93040657, 93084251, 93092773, 93064987, 93005104, 92920624, 92818344, 92701309, 92568748, 92418793, 92252235, 92074936, 91897194, 91730560, 91583138, 91456856, 91347069, 91245323, 91143349, 91036522, 90924919, 90812340, 90703865, 90603729, 90514351, 90436386, 90369728, 90313713, 90267372, 90229233, 90197639, 90171524, 90151009, 90137344, 90131966, 90134735, 90143105, 90152473, 90157982, 90156876, 90149704, 90139771, 90131050, 90125847, 90123573, 90121635, 90117340, 90110023, 90101646, 90095657, 90095070, 90100723, 90110977, 90122772, 90133133, 90140289, 90143745, 90143700, 90140572, 90134712, 90127045, 90119232, 90113457, 90111496, 90113899, 90119514, 90126099, 90131157, 90132957, 90130928, 90125404, 90117432, 90108536, 90100723, 90096291, 90097412, 90105049, 90118347, 90134468, 90149818, 90161362, 90168022, 90170906, 90172424, 90174759, 90178886, 90184158, 90188995]
2444I0188995L083O63j274k380k709k761k808k945k716j907k75J549K899K838R16k419
2460I0178749o012q293p797m380J046O447R506Q735M166k907r987j4930j6411j4351
2474I0123581r796m410L81L388M158K739l59m471q605j1826j3245j2573j0086o836
2488I0052040m196l494n082q209j1482j3245j2733j0132o752l738j847l73J487M593
2502H9976837Q461J1612J2184R209L387l265q232j0239r308o805m143k022k28J785
2516H9979233M059N775N997M265J640qR46M906J0292J4526J5290J1848N280j869p027
2531I0055153q453n867n19N569J0147J1414R025M219m34k228J75N875J1818J4450J1658
2546I0122002M142m905j1376j2619q545j869L838N844L593j289o012p950n768M6P431
$$ y = [90188995, 90192078, 90192741, 90191467, 90189087, 90186378, 90183617, 90180809, 90177864, 90175148, 90173241, 90172966, 90174515, 90177414, 90180252, 90181168, 90178749, 90172737, 90164444, 90156647, 90152267, 90153313, 90159760, 90169266, 90178001, 90182167, 90179260, 90169273, 90154343, 90137932, 90123581, 90113785, 90109375, 90109756, 90113144, 90117302, 90120041, 90119682, 90115211, 90106606, 90094780, 90081535, 90068962, 90058876, 90052040, 90047844, 90044350, 90039268, 90031059, 90019577, 90006332, 89993599, 89983467, 89976715, 89972977, 89971130, 89970757, 89972244, 89976837, 89985298, 89996910, 90009094, 90018303, 90021690, 90018425, 90010193, 89999954, 89990646, 89983841, 89979698, 89977676, 89977448, 89979233, 89983292, 89989067, 89995064, 89999329, 90000969, 90000961, 90001907, 90006813, 90017105, 90031631, 90046921, 90058769, 90064049, 90062180, 90055153, 90046700, 90040833, 90040314, 90045883, 90056030, 90067444, 90076469, 90080688, 90080254, 90078026, 90078201, 90084076, 90095894, 90110344, 90122002, 90126144, 90121239, 90109863, 90097244, 90088699, 90086830, 90090668, 90096512, 90100105, 90098816, 90092804, 90084854, 90079086, 90079132, 90086563]
2561I0086563J3519J5473J1947L334p904j8432k5276k7176k4842k0301j5709j2200
2573H9978996r865q033o462n204m715n249o424p560q133q171q339r354j1307j3595
2587H9866585j5084j4793j2520q903m906j701J60M20o11k388m402o058p202p889q484
2602H9772224r315j0407j1192j0994r071n463j022K807M586L563m6n112r956j3237
2616H9697365j4084j2688r842o935n241n547p705j0613j2665j2321r293m333M80L235
2630H9589813K869J5l464n348m562j641J526K724J114k609o226p484n493j069L685
2645H9563850O775P592O950O798Q598J2367J6732J9271J8059J2772M463m684j2497
2658H9667046j7701k0027k0019j8212j5068j0605n119P25N760Q728Q652N661R08l823
$$ y = [90086563, 90100082, 90115555, 90127502, 90130836, 90122932, 90104500, 90079224, 90052048, 90027206, 90006905, 89991196, 89978996, 89969131, 89961098, 89954636, 89949432, 89944717, 89939468, 89933044, 89925484, 89917351, 89909180, 89900841, 89891487, 89880180, 89866585, 89851501, 89836708, 89824188, 89815285, 89810379, 89808678, 89808838, 89809258, 89808647, 89806259, 89801857, 89795799, 89788597, 89780708, 89772224, 89762909, 89752502, 89741310, 89730316, 89721245, 89715782, 89714760, 89717567, 89722153, 89725716, 89725670, 89720558, 89710602, 89697365, 89683281, 89670593, 89660751, 89653816, 89648575, 89643028, 89635323, 89624710, 89612045, 89599724, 89590431, 89586098, 89586578, 89589813, 89592682, 89592697, 89589233, 89583885, 89579323, 89577682, 89579208, 89581932, 89583046, 89580437, 89574211, 89566727, 89561234, 89560165, 89563850, 89570625, 89578217, 89585167, 89591965, 89600563, 89612930, 89629662, 89648933, 89666992, 89679764, 89684227, 89679543, 89667046, 89649345, 89629318, 89609299, 89591087, 89576019, 89565414, 89560295, 89561020, 89566780, 89575508, 89584160, 89589821, 89590729, 89586906]
2672H9586906o843p134n096k159k90q32l875q042j1108j1223p988k869J335K236j099
2687H9521919p095j3130j6281j5847j2901j0056r368j1055j3512j4298j2039p156j946
2700H9377235R85j38n043j2054j8769k3300k4765k3399j9959j5609j1467q568p378
2713H9207771p896r552j1536j3313j4900j6526j8379j9974k0332j8547j4305q537l128
2726H9030846J83M12k060n638q713j0254j0498j0567j1627j4137j7266j9294j8448
2739H8902939j4023o950K59M707M151j465j0132j8341k2667k1217j4504m883M212R941
2753H8812027J1177Q377L471j655n699q530j0818j3291j5991j8303j9089j7700j4503
2766H8709473j0605p607o378o782q118r384j0498j2009j4572j8395k2438k5146k5429
$$ y = [89586906, 89580063, 89572929, 89567833, 89565674, 89565384, 89564552, 89560677, 89552635, 89541527, 89530304, 89522316, 89519447, 89520782, 89523018, 89521919, 89514824, 89501694, 89485413, 89469566, 89456665, 89446609, 89437241, 89426186, 89412674, 89398376, 89386337, 89379181, 89377235, 89378220, 89378082, 89373039, 89360985, 89342216, 89318916, 89294151, 89270752, 89250793, 89235184, 89223717, 89215149, 89207771, 89199875, 89190323, 89178787, 89165474, 89150574, 89134048, 89115669, 89095695, 89075363, 89056816, 89042511, 89033974, 89030846, 89031029, 89031441, 89029381, 89023743, 89015030, 89004776, 88994278, 88983711, 88972084, 88957947, 88940681, 88921387, 88902939, 88888916, 88881966, 88882225, 88886932, 88891083, 88889618, 88879486, 88861145, 88838478, 88817261, 88802757, 88797874, 88802086, 88812027, 88823204, 88831581, 88835052, 88833397, 88827698, 88819168, 88808350, 88795059, 88779068, 88760765, 88741676, 88723976, 88709473, 88698868, 88691261, 88684883, 88678101, 88669983, 88660599, 88650101, 88638092, 88623520, 88605125, 88582687, 88557541, 88532112]
2779H8532112k3399k0699j9714k2232k8649l7422m6036n1986n3810n1651m7028m2107
2791H8087379l9032l9154m2526m7966n3474n7015n7327n4420m9561m4823m2068m2443
2803H7517570m5898n1338n7053o1279o2965o2043n9440n6877n5962n7419o0745o4156
2815H6822395o5620o3767n8609n1941m6165m3610m5326n0896n8715o6750p3227p6980
2827H6120789p7744p5943p2693o9526o8268p0282p6065q4954r5085j04347j11145j15250
2839H5099487j17912j21094j26190j33011j39580j42746j39915j30173j15082r7892
2849H3835892q2123p0313o3072n9410n7594n6046n3825n0324m5105l7780k8237j7189
2861H3214874o500J625N417M906K159M88L090J1253K3789L7590M9217N6686O0204O1813
$$ y = [88532112, 88508713, 88488014, 88468300, 88446068, 88417419, 88379997, 88333961, 88281975, 88228165, 88176514, 88129486, 88087379, 88048347, 88009193, 87966667, 87918701, 87865227, 87808212, 87750885, 87696465, 87646904, 87602081, 87560013, 87517570, 87471672, 87420334, 87363281, 87302002, 87239037, 87176994, 87117554, 87060677, 87004715, 86947296, 86886551, 86822395, 86756775, 86693008, 86634399, 86582458, 86536293, 86492683, 86447357, 86396461, 86337746, 86270996, 86197769, 86120789, 86043045, 85967102, 85894409, 85824883, 85756615, 85686333, 85610268, 85525314, 85430229, 85325882, 85214737, 85099487, 84981575, 84860481, 84734291, 84601280, 84461700, 84318954, 84179039, 84048866, 83933784, 83835892, 83753769, 83683456, 83620384, 83560974, 83503380, 83447334, 83393509, 83343185, 83298080, 83260300, 83232063, 83214874, 83208374, 83209999, 83215416, 83220322, 83222481, 83222969, 83226059, 83237312, 83261101, 83298691, 83347908, 83404594, 83464798, 83526611]
2875H3526611O3752O7031P0862P3220P2494O8543O3079N8419N6289N6610N7763N7594
2887H4292267N4764M9385M2801L6605L1723K8092K4650K0363J4237O012l998j4977
2899H4581924k5604l4408m0322m2999m3488m3594m5509n0781n9479p0587q2001r1271
2911H3951881r6283r5428q8020p4730n7564l9650k4269j3565p858n463l777n72M936
2924H3449638J1956J9073K5345L0647L5897M1992M9194N7053O4987P2571Q0116Q7944
2936H4026413R5787J02570J06475J06316J02097R5527Q9340Q5892Q5831Q8051Q9782
2947H5074081Q8700Q3870P6812P0771O9053P3471Q2894R3818J01624J02798R6528Q5296
2959H6099716P3288O4835O2187O4590O9199P2411P1708O6696N8754N0240M3220L8811
$$ y = [83526611, 83590363, 83657394, 83728256, 83801476, 83873970, 83942513, 84005592, 84064011, 84120300, 84176910, 84234673, 84292267, 84347031, 84396416, 84439217, 84475822, 84507545, 84535637, 84560287, 84580650, 84594887, 84600899, 84596901, 84581924, 84556320, 84521912, 84481590, 84438591, 84395103, 84351509, 84306000, 84255219, 84195740, 84125153, 84043152, 83951881, 83855598, 83760170, 83672150, 83597420, 83539856, 83500206, 83475937, 83462372, 83454514, 83449051, 83445274, 83444702, 83449638, 83461594, 83480667, 83506012, 83536659, 83572556, 83614548, 83663742, 83720795, 83785782, 83858353, 83938469, 84026413, 84122200, 84224770, 84331245, 84437561, 84539658, 84635185, 84724525, 84810417, 84896248, 84984299, 85074081, 85162781, 85246651, 85323463, 85394234, 85463287, 85536758, 85619652, 85713470, 85815094, 85917892, 86014420, 86099716, 86173004, 86237839, 86300026, 86364616, 86433815, 86506226, 86577934, 86644630, 86703384, 86753624, 86796844, 86835655]
2971H6835655L7216L7575L8513L8361L5301K8328J7777N638m586r712q377k037N303
2984H7054955Q857N432n172k0180l5568m8233n7137o3499o9123p4936q0169q2947q1512
2997H6450768p5676o6971n7915n0652m6112m3838m2847m2656m3617m6715n2620o1310
3009H5819839p2013q4420r8922j17226j40968j70616k04102k37213k64488k81212k84554
3020H3864105k73979k50732k16607j73851j24694p1984j9172L0235P3395J08635J35780
3031H3081131J55418J68496J75888J78329J76796J72104J64978J55556J43516J28273
3041H4700485J09764Q8219O4331L8750J1688j6541m4921p1633r3994j09512j16692
3052H4559944j15616j07429r3758p5607n3513k7557J602L2547O3164R1049J14143J30745
$$ y = [86835655, 86872871, 86910446, 86948959, 86987320, 87022621, 87050949, 87068726, 87074364, 87069778, 87060066, 87051689, 87049652, 87054955, 87063812, 87069244, 87064072, 87043892, 87008324, 86960091, 86902954, 86839455, 86770332, 86695396, 86615227, 86532280, 86450768, 86375092, 86308121, 86250206, 86199554, 86153442, 86109604, 86066757, 86024101, 85980484, 85933769, 85881149, 85819839, 85747826, 85663406, 85564484, 85447258, 85306290, 85135674, 84931572, 84694359, 84429871, 84148659, 83864105, 83590126, 83339394, 83122787, 82948936, 82824242, 82752258, 82733086, 82763321, 82836716, 82945351, 83081131, 83236549, 83405045, 83580933, 83759262, 83936058, 84108162, 84273140, 84428696, 84572212, 84700485, 84810249, 84898468, 84962799, 85001549, 85013237, 84996696, 84951775, 84880142, 84786148, 84676636, 84559944, 84444328, 84336899, 84243141, 84167534, 84114021, 84086464, 84088066, 84120613, 84183777, 84274826, 84388969, 84519714]
3064H4519714J39763J40709J33728J19797J00304P6973N1002K3079o416l6377o4423
3075H5197853q6372r7328r3094p2174l6683P500N2673R1279J18171J31882J34117J28510
3087H5476334J18583J06713R3635P9048O2653M4792K6367Q843o729j9631k9381l5492
3099H5925735l7185l3844k5269j2245L334J8875L1571L9230M0810L6667K8411J8334
3111H6034424Q514M96n379r422j2245j4183j5343j5701j5602j5724j6884j9554k3240
3124H5880157k6939k9533l0587l0715l1098l3005l6689m1398m5593m7691m6852m3358
3136H5436699l8262l3340l0441l0731l4508m0825m7623n2589n4001n1674m7150m3022
3148H4932533m1435m3190m6753m9621m9492m5716l9940l4957l3394l6187m2060m8661
$$ y = [84519714, 84659477, 84800186, 84933914, 85053711, 85154015, 85230988, 85281990, 85305069, 85298653, 85262276, 85197853, 85111481, 85014153, 84921059, 84848885, 84812202, 84819702, 84872375, 84963654, 85081825, 85213707, 85347824, 85476334, 85594917, 85701630, 85795265, 85874313, 85936966, 85981758, 86008125, 86016968, 86010239, 85990608, 85961227, 85925735, 85888550, 85854706, 85829437, 85817192, 85820526, 85839401, 85870972, 85910202, 85951012, 85987679, 86016090, 86034424, 86042938, 86043434, 86038055, 86028633, 86016388, 86002205, 85986862, 85971161, 85955559, 85939835, 85922951, 85903397, 85880157, 85853218, 85823685, 85793098, 85762383, 85731285, 85698280, 85661591, 85620193, 85574600, 85526909, 85480057, 85436699, 85398437, 85365097, 85334656, 85303925, 85269417, 85228592, 85180969, 85128380, 85074379, 85022705, 84975555, 84932533, 84891098, 84847908, 84801155, 84751534, 84702042, 84656326, 84616386, 84581429, 84548035, 84511848, 84469788, 84421127]
3160H4421127n3650n5732n4955n1872m7081m0901l3524k6069k0470j8883k2896l2325
3172H3962769m5083n7891o7398p1244o8794o0928m9721l7689k7535k1179j9714k2988
3184H3412605k9884l8635m7608n5595o1653o4926o4522n9929n1552m1199l1784k6123
3196H2839195k5779l0022l6469m1908m4289m3235m0299l7521l6499l7491l9520m1245
3208H2384918m1664m0543l8513l6339l4790l4317l4866l6484l8971m1999m5090m7325
3220H1914017m7737m5739m1519l6255l1746k9670l0846l4653l9474m3289m4792m3831
3232H1444466m1298l8735l7292l7316l8192l8918l8330l6110l2669k9007k6314k5222
3244H1025063k5628k6718k7336k6840k5139k2735k0455j8898j8524j9913k3651l0296
$$ y = [84421127, 84367477, 84311745, 84256790, 84204918, 84157837, 84116936, 84083412, 84057343, 84036873, 84017990, 83995094, 83962769, 83917686, 83859795, 83792397, 83721153, 83652359, 83591431, 83541710, 83504021, 83476486, 83455307, 83435593, 83412605, 83382721, 83344086, 83296478, 83240883, 83179230, 83114304, 83049782, 82989853, 82938301, 82897102, 82865318, 82839195, 82813416, 82783394, 82746925, 82705017, 82660728, 82617493, 82577194, 82539673, 82503174, 82465683, 82426163, 82384918, 82343254, 82302711, 82264198, 82227859, 82193069, 82158752, 82123886, 82087402, 82048431, 82006432, 81961342, 81914017, 81866280, 81820541, 81779022, 81742767, 81711021, 81681351, 81650505, 81615852, 81576378, 81533089, 81488297, 81444466, 81403168, 81364433, 81327141, 81289825, 81251633, 81212715, 81174385, 81138275, 81105606, 81076599, 81050285, 81025063, 80999435, 80972717, 80945381, 80918541, 80893402, 80870667, 80850212, 80831314, 80812790, 80792877, 80769226, 80738930]
3256H0738930l9307m8950n6198n8190n3802m4434l3630k5139k1217k1256k2964k3796
3268H0290047k2919k1408k1134k3246k7207l1105l3256l3097l1822l1158l1822l3257
3280G9948616l3569l1060k5657j8769j2954j0285j1192j4496j8043j9982j9806j8097
3292G9714706j6143j4779j3809j2489j0132p271n516o851j1940j9470k6131k8427k4788
3305G9516960j6586p660k205k609q072j5541k1500k3979k3216k0951j8898j7608j6281
3318G9321854j3497q507j678N432J0719J2108Q210q86j3580k6413l4981l5461k6443
3331G9196877j0079Q408K2567K7634K2431R872m570j5572j9973j7785j1604m593O79
3344G9204292L258L487K128k21l220o507r209j0063q126l288K991Q385J0612Q720L746
$$ y = [80738930, 80699623, 80650673, 80594475, 80536285, 80482483, 80438049, 80404419, 80379280, 80358063, 80336807, 80313843, 80290047, 80267128, 80245720, 80224586, 80201340, 80174133, 80143028, 80109772, 80076675, 80044853, 80013695, 79981873, 79948616, 79915047, 79883987, 79858330, 79839561, 79826607, 79816322, 79805130, 79790634, 79772591, 79752609, 79732803, 79714706, 79698563, 79683784, 79669975, 79657486, 79647354, 79640083, 79634567, 79627716, 79615776, 79596306, 79570175, 79541748, 79516960, 79500374, 79492714, 79490509, 79487900, 79479828, 79464287, 79442787, 79418808, 79395592, 79374641, 79355743, 79338135, 79321854, 79308357, 79299850, 79298172, 79303604, 79314323, 79326431, 79334641, 79333755, 79320175, 79293762, 79258781, 79223320, 79196877, 79186798, 79195206, 79217773, 79245407, 79267838, 79277710, 79273140, 79257568, 79237595, 79219810, 79208206, 79203613, 79204292, 79207550, 79211037, 79213165, 79212944, 79209724, 79203217, 79194008, 79183945, 79175819, 79172531, 79175522, 79183907, 79194519, 79203239, 79206985]
3359G9206985j617m410k640L464J1544J8325K0974J8569J2360N379J007J205N936J2886
3373G9309967J8738K0973J8837J3985R201P103Q682J2909J7647K0828K1454K0111J8211
3386G9518646J7372J8433K1301K4765K7062K6520K2232J4984O950J396Q85O005J4740
3399G9721291K3262K7893K7069K2140J6564J4145J6632K3559L1983L8635M1069L8391
3411H0042633L1532K2812J5229J1741J4160K2576L4492M5815N2383N1674M4426L4225
3423H0423698K5841K2942K6573L4691M3548M9508N0514M7043M1107L5515L2409L2593
3435H0865982L5408L9146M1939M2824M1718L9825L8673L9399M2205M6372N0468N3231
3447H1377190N3901N2506M9896M7318M6081M6990M9903N3574N6168N5839N2048M5647
$$ y = [79206985, 79205368, 79200958, 79198318, 79201782, 79213326, 79231651, 79252625, 79271194, 79283554, 79288933, 79289940, 79291145, 79297081, 79309967, 79328705, 79349678, 79368515, 79382500, 79391701, 79398804, 79407486, 79420395, 79438042, 79458870, 79480324, 79500435, 79518646, 79536018, 79554451, 79575752, 79600517, 79627579, 79654099, 79676331, 79691315, 79698265, 79699661, 79700546, 79706551, 79721291, 79744553, 79772446, 79799515, 79821655, 79838219, 79852364, 79868996, 79892555, 79924538, 79963173, 80004242, 80042633, 80074165, 80096977, 80112206, 80123947, 80138107, 80160683, 80195175, 80240990, 80293373, 80345047, 80389473, 80423698, 80449539, 80472481, 80499054, 80533745, 80577293, 80626801, 80677315, 80724358, 80765465, 80800980, 80833389, 80865982, 80901390, 80940536, 80982475, 81025299, 81067017, 81106842, 81145515, 81184914, 81227119, 81273491, 81323959, 81377190, 81431091, 81483597, 81533493, 81580811, 81626892, 81673882, 81723785, 81777359, 81833527, 81889366, 81941414, 81987061]
3459H1987061L9245L5553L6430M1710M9141N5718N8990N8220N4726N1056M9354N0766
3471H2567970N4451N8548O1074O0958N8587N5641N3947N4764N7823O1546O3775O2690
3483H3271774N8083N1132M4174L9604L9032M2733M9995N9158O8154P4806P6996P3639
3495H3949280O5063N3833M3938L9253M1542M9225N7892O2904O1997N6991N2567N3352
3507H4587837O0578P1052P9018P9681P2327O0715N0453M5486M5784M7859M7615M3297
3519H5291702L6492L0731K8938L1647L7308M3777N0156N6640O3881P1045P5974P6072
3531H5894363P0176N9387M6409L4233K4308J6578J0125M257p71m051m913l014J442
3544H6148529Q186J7060K7298L7559M5502M8889M6463L9032K9266K0737J6174J5969
$$ y = [81987061, 82026306, 82061859, 82098289, 82139999, 82189140, 82244858, 82303848, 82362068, 82416794, 82467850, 82517204, 82567970, 82622421, 82680969, 82742043, 82803001, 82861588, 82917229, 82971176, 83025940, 83083763, 83145309, 83209084, 83271774, 83329857, 83380989, 83425163, 83464767, 83503799, 83546532, 83596527, 83655685, 83723839, 83798645, 83875641, 83949280, 84014343, 84068176, 84112114, 84151367, 84192909, 84242134, 84300026, 84362930, 84424927, 84481918, 84534485, 84587837, 84648415, 84719467, 84798485, 84878166, 84950493, 85011208, 85061661, 85107147, 85152931, 85200790, 85248405, 85291702, 85328194, 85358925, 85387863, 85419510, 85456818, 85500595, 85550751, 85607391, 85671272, 85742317, 85818291, 85894363, 85964539, 86023926, 86070335, 86104568, 86128876, 86145454, 86155579, 86159836, 86159065, 86155014, 86150101, 86147087, 86148529, 86156715, 86173775, 86201073, 86238632, 86284134, 86333023, 86379486, 86418518, 86447784, 86468521, 86484695, 86500664]
3556H6500664J8097J8310J2734k67j8242l4592m0977l0640k213L9063Q2748J17745
3568H6662430J36497J37787J26122J08558R1408P8209P0107O6650O6864O8977O9939
3579H7683548O6116N5344L9604K5490K2125L6110O7070J06209J40091J56959J52878
3590H8551544J33736J11748R9006J01242J15464J32545J42532J39534J24161J01692
3600H9753204P8949O0868M9217M3182M1054M1656M4625M9606N5802O1637O5354O5857
3612I0411011O3408N9730N7602O0242O9603Q5121J02371J13503J09680Q5319M2588
3623I1260178p386m7218o0410l9299J0453P1602J22680J47606J41815J12816P4448
3634I1787285M0031J6922N677K258Q92m241j8120m3839p9796j17416j41632j35834
$$ y = [86500664, 86518761, 86537071, 86549805, 86549538, 86531296, 86496704, 86455727, 86425087, 86422874, 86461937, 86544685, 86662430, 86798927, 86936714, 87062836, 87171394, 87262802, 87341011, 87411118, 87477768, 87544632, 87613609, 87683548, 87749664, 87805008, 87844612, 87870102, 87892227, 87928337, 87995407, 88101616, 88241707, 88398666, 88551544, 88685280, 88797028, 88896034, 88997276, 89112740, 89245285, 89387817, 89527351, 89651512, 89753204, 89832153, 89893021, 89942238, 89985420, 90026474, 90068130, 90112755, 90162361, 90218163, 90279800, 90345154, 90411011, 90474419, 90534149, 90591751, 90651993, 90721596, 90806717, 90909088, 91022591, 91132271, 91217590, 91260178, 91252792, 91205574, 91145164, 91105865, 91116318, 91187920, 91310600, 91458206, 91600021, 91712837, 91787285, 91827316, 91844238, 91849915, 91852173, 91853065, 91848824, 91830704, 91786865, 91707069, 91589653, 91448021, 91312187]
3646I1312187r0652j1071Q2650J62430K04757K02179J65657J18378Q3076P1160P9162
3657I2379913R3567R9602Q9012O2309K5795j2504m6341p1861q6731r0424q4206p1678
3669I2286453n7106m2618k6321l021L1883P7576J26106J64886J82572J74614J44386
3680I3059410J00266N0781J755m2878p7903r5452q7257n0255Q926P3998J25267J47820
3692I3214478J37970J03424N8281J5876j5587l3523l8597l2677j8486j083J2046J3138
3704I3415260j663k8686n7221p3570o8161m0123J678M3160P0892P7843O4796L9025
3716I3443230R956j3969k7512k8954j9523k731J5899K9747L2341J9341q995m7623q7181
3729I3314026j16989j28227j16723q3862l7018J2505N1323O7505N4580J4893l9383
$$ y = [91312187, 91221535, 91210464, 91293114, 91455544, 91660301, 91862480, 92028137, 92146515, 92229591, 92300751, 92379913, 92473480, 92573082, 92662094, 92724403, 92750198, 92737694, 92691353, 92619492, 92532761, 92442337, 92358131, 92286453, 92229347, 92186729, 92160408, 92157387, 92189270, 92266846, 92392952, 92557838, 92740410, 92915024, 93059410, 93159676, 93210457, 93212212, 93169334, 93091431, 92995979, 92908722, 92858467, 92867393, 92941391, 93066658, 93214478, 93352448, 93455872, 93514153, 93530029, 93514442, 93480919, 93442322, 93409645, 93391159, 93390076, 93402122, 93415260, 93413597, 93384911, 93327690, 93254120, 93185959, 93145836, 93147514, 93190674, 93261566, 93339409, 93404205, 93443230, 93453186, 93439217, 93411705, 93382751, 93363228, 93360497, 93376396, 93406143, 93438484, 93457825, 93448830, 93401207, 93314026, 93197037, 93068810, 92952087, 92868225, 92831207, 92843712, 92895035, 92962540, 93017120, 93032013, 92992630]
3740I2992630q9699j18042j14815q3374l7918M143L1593M4533N2284O5255Q7181J11496
3752I2945267J25877J20735R5864O1363L1837J8158K1927L5729M8141N0072L8955J8593
3764I3612518l280j8883k2995j4732K502K2179L6972M1588L5308K2049Q332j76j709
3777I3719673J557N279O279M433K586M242J1215K1744L1319L4095K5757N516k3056
3790I3850639n2803p5828q6663q4640p3891o0447m8912m0085l1510k0599p042O874
3802I3275093J8318K7069L5736M7150O0562O9741O5650M2023N95m8240q9966j13213
3814I3390518j14464r8259p2982m5174j7204J1963M2976P3517R7709J08742J01784
3825I3479126P6462L7246q087n0529q2504r9648j01623r1370p3029n0155k4605K609
$$ y = [92992630, 92902931, 92784889, 92670074, 92586700, 92548782, 92552925, 92584518, 92629051, 92681335, 92746590, 92833771, 92945267, 93071144, 93191879, 93287743, 93349106, 93380943, 93399101, 93421028, 93456757, 93504898, 93554970, 93593925, 93612518, 93609238, 93590355, 93567360, 93552628, 93555130, 93577309, 93614281, 93655869, 93691177, 93713226, 93721558, 93721382, 93719673, 93721230, 93726509, 93732788, 93737221, 93739807, 93744049, 93755264, 93777008, 93808327, 93842422, 93868179, 93873695, 93850639, 93797836, 93722008, 93635345, 93550705, 93476814, 93416367, 93367455, 93327370, 93295860, 93275261, 93268219, 93275093, 93293411, 93320480, 93356216, 93403366, 93463928, 93533669, 93599319, 93641342, 93641937, 93593697, 93503731, 93390518, 93276054, 93177795, 93104813, 93059639, 93042435, 93054398, 93097374, 93170891, 93268600, 93377342, 93479126, 93555588, 93592834, 93584747, 93534218, 93451714, 93352066, 93250443, 93159073, 93086044, 93035889, 93011284, 93013893]
3837I3013893K9953N4421P2441Q1581Q1772P4402O0348L7895L662m3563r8801j49017
3849I3218987j76674j67336j17172l6812N1209J21040J52962J40937R4063L2067k2782
3860I3290489n4420n8129m0901j6655J221O050J76p851q957R69J9028L7368M7753M5822
3874I3261963L2761J4053l594j5518k0416k0142j7738j5106j2261p125K174J5358K9259
3887I3243668L9215M1992L7491K8648J8471O966r224l3539o4873r5093j11480j03463
3899I2998779o9023j6723L8391Q2000J06575J12214J03790Q6342O3591L8108J2970
3910I3557014q224k2644k9602l0197k5727j6754l944R682J8966J8791Q728n325j4175
3923I3456589j1574M73J2817J6251Q606k609o218L990K4094M2404M7867L6903J4564
$$ y = [93013893, 93043846, 93098267, 93170708, 93252289, 93334061, 93408463, 93468811, 93506706, 93510368, 93466805, 93368004, 93218987, 93042313, 92874977, 92757805, 92720993, 92772202, 92893242, 93046204, 93187141, 93281204, 93313271, 93290489, 93236069, 93177940, 93137039, 93120384, 93121605, 93127655, 93127831, 93119980, 93111023, 93111992, 93131020, 93168388, 93216141, 93261963, 93294724, 93308777, 93305183, 93289665, 93269249, 93249107, 93231369, 93216263, 93204002, 93196877, 93199051, 93214409, 93243668, 93282883, 93324875, 93362366, 93391014, 93409485, 93416451, 93407227, 93373688, 93308815, 93213722, 93102242, 92998779, 92929756, 92913033, 92951424, 93033424, 93139999, 93252213, 93356003, 93442345, 93505936, 93544044, 93557014, 93548790, 93526146, 93496544, 93466347, 93440620, 93423866, 93419922, 93429604, 93448570, 93467361, 93476089, 93470764, 93456589, 93445015, 93445488, 93458305, 93474556, 93483162, 93480553, 93474335, 93478325, 93502419, 93544823, 93592690, 93629593, 93644157]
3936I3644157j0345l1105m5128n1491m9011l6942j8188o64O882J930q156j0666J893
3949I3393166K4040L9932L5439J0284k0439l7544l2883j4793k60N04p904j2223m844
3962I3372475P324R155p255l2402m6555l8116j6976p530k6047o2118q4687o9061k3109
3975I2975098J4694P118m5677j01448j11229o7223j7730k7703j15013k20253k49832
3986I2040802j65932m4410l3188k22603n28626L60001L65677L45329K98905K26486
3996I2642441J27998L464j47080l23677
4000I2303146
$$ y = [93644157, 93633812, 93602707, 93557579, 93506088, 93457077, 93420135, 93401947, 93401283, 93408165, 93410095, 93401939, 93391273, 93393166, 93417206, 93457138, 93492577, 93502861, 93482422, 93444878, 93411995, 93397202, 93396942, 93397446, 93389542, 93377319, 93372475, 93379799, 93388954, 93381699, 93349297, 93302742, 93264626, 93247650, 93240120, 93214073, 93151955, 93067268, 92998207, 92975098, 92989792, 92996910, 92951233, 92849785, 92738556, 92671333, 92653603, 92625900, 92510887, 92290634, 92040802, 91874870, 91830460, 91797272, 91574669, 91046043, 91406044, 91771721, 92117050, 92415955, 92642441, 92770439, 92773903, 92626823, 92303146]
##END=$$ End of the data block
