##TITLE=$$ Begin of the data block
##JCAMP-DX=5.00 $$ ACD/SpecManager v 10.08
##SPECTROMETER/DATA SYSTEM=16PC
##DATE=04 Jun 2013 13:11:58
##DATA TYPE=INFRARED SPECTRUM
##DATA CLASS=XYDATA
##ORIGIN=
##OWNER=
##NPOINTS=3601
##FIRSTX=400.00000000
##LASTX=4000.00000000
##MAXX=4000.00000000
##MINX=400.00000000
##MAXY=78.47528839
##MINY=16.73696899
##XFACTOR=1.0000000000
##YFACTOR=0.000000100000000
##FIRSTY=43.02942276
##DELTAX=1.00000000
##XUNITS=1/CM
##YUNITS=TRANSMITTANCE
##XYDATA=(X++(Y..Y))
400 430294228 539094086 623354530 676722031 702781143 711603317 714122543 717489471 723529739
408 723529739 730350647 735364532 737589722 738046417 738558350 740230331 742784958 745059204 746070404
417 746070404 745760803 744934082 744578552 745174484 746482391 747856445 748747635 749001465 748803558 748426208
427 748426208 748031006 747655334 747314835 747059174 746913147 746770554 746378250 745465775 743927689 741904907
437 741904907 739679718 737453384 735175476 732558441 729264145 725123367 720227966 714839859 709202118
446 709202118 703391876 697320175 690861664 684023132 677046204 670401535 664694901 660535202 658401489
455 658401489 658535690 660878296 665080185 670600052 676866150 683430328 690036926 696577988 702976913
464 702976913 709090347 714702988 719616241 723761292 727251434 730332794 733261566 736189651 739118652
473 739118652 741935654 744492111 746673889 748431931 749776611 750754318 751422653 751827087 751980438
482 751980438 751855011 751393433 750537262 749254227 747541199 745398407 742800598 739693298 736032104
491 736032104 731841583 727248383 722469482 717766418 713413315 709709778 707010498 705713043 706148148
500 706148148 708398285 712147293 716674805 721031952 724303818 725785522 724957962 721302185 714158707
509 714158707 702855225 687173767 667961121 647497025 629271660 617102280 613883934 620529327
517 620529327 635601616 655831528 677283630 696637497 712042160 723255157 731151505 736958694
525 736958694 741623917 745557556 748752365 751087036 752581482 753470001 754095688 754735260 755478516
534 755478516 756222153 756770172 756967926 756796799 756389084 755964966 755727386 755766602 756017532 756288757
544 756288757 756352310 756051941 755379639 754477386 753560028 752798691 752223511 751704254 751014786 749946594
554 749946594 748398590 746389771 743981628 741167679 737805023 733657303 728546524 722550812 716140900
563 716140900 710165939 705660172 703535461 704274292 707754211 713279114 719802628 726252899 731827316
572 731827316 736150818 739256592 741430969 743013077 744244080 745216751 745919113 746320877 746443481
581 746443481 746377411 746249084 746162262 746150970 746166153 746101608 745844040 745326157 744554367 743591690 742496643
592 742496643 741243820 739671936 737511368 734502258 730559464 725898819 721030121 716591263 713083496
601 713083496 710648499 709021912 707714386 706337357 704893951 703857803 703969040 705839539 709574051
610 709574051 714616852 719920578 724357986 727175522 728264236 728135223 727632523 727545013 728303375
619 728303375 729871902 731839676 733617020 734630508 734455338 732882919 729961090 726024857 721699371
628 721699371 717824936 715280151 714735184 716427460 720068207 724934158 730110016 734775085 738405533
637 738405533 740824280 742112732 742467728 742092361 741162033 739841690 738299103 736672974 735007935
646 735007935 733205261 731041718 728259888 724683609 720281067 715131149 709308243 702763443 695297546
655 695297546 686677399 676862640 666231461 655672073 646451950 639880791 636895790 637743530 641909103
664 641909103 648323746 655751877 663175583 670003586 676041489 681287384 685710220 689149399 691381073
673 691381073 692280731 691956863 690758286 689155960 687574463 686272812 685314941 684610748 683970184
682 683970184 683138123 681822662 679740677 676676331 672490005 667026901 659941864 650567627 638005028
691 638005028 621513977 601096573 577955666 554499130 533744965 518331070 509598808 507245026
699 507245026 509750443 515364304 523097038 533164558 546644745 564561043 586937332 612361488
707 612361488 638292389 661921997 681126404 695043411 704062729 709346237 712202148 713626022
715 713626022 714156952 713996277 713217545 711920090 710268173 708450699 706627502 704901505 703311386
724 703311386 701825714 700335236 698662033 696609879 694046402 690976715 687552795 683999557 680488281
733 680488281 677031860 673472061 669566116 665119247 660068054 654455948 648315353 641551361 633934441
742 633934441 625246964 615514908 605171738 595004883 585851097 578161583 571673431 565402222
750 565402222 558019829 548471298 536539803 523072014 509746399 498487816 490807266 487360115
758 487360115 487879601 491443787 496886024 503130760 509339905 514883156 519251785 522023392 522922134
767 522922134 521922798 519311485 515639496 511574440 507711830 504428673 501832809 499811630 498141861
776 498141861 496609039 495097046 493628006 492355042 491519623 491389580 492197113 494091606 497118607
785 497118607 501227150 506299210 512185440 518736191 525815659 533296432 541039696 548872223 556573563
794 556573563 563890114 570579224 576477356 581564980 586000214 590094223 594233437 598770752 603930359
803 603930359 609758110 616134529 622832794 629593849 636187706 642446060 648268509 653606262 658433762
812 658433762 662710419 666341782 669150925 670886383 671276855 670127945 667435226 663465729 658772583
821 658772583 654127960 650392990 648365479 648648148 651562271 657110825 664982376 674586563 685119171
830 685119171 695666809 705345993 713461533 719642715 723904419 726606903 728311157 729578781 730789413
839 730789413 732044449 733196182 733982773 734208527 733887634 733284760 732840424 733012238 734107208 736177750
849 736177750 739018936 742264633 745531540 748543472 751187820 753486938 755514526 757306671 758818054
858 758818054 759941940 760580292 760716629 760447845 759951324 759401779 758883057 758340302 757601013 756453323
868 756453323 754735031 752392349 749477539 746099091 742367325 738375473 734237137 730158615 726496887
877 726496887 723751526 722471390 723099136 725812988 730433273 736439209 743092346 749624863 755423965
886 755423965 760150528 763759918 766434097 768459244 770102234 771527710 772775116 773793488 774507523
895 774507523 774884415 774971008 774888992 774791260 774801254 774959869 775208282 775410156 775407944 775086060 774415283
906 774415283 773459244 772344284 771207504 770146103 769190292 768303909 767414551 766453400 765394211
915 765394211 764278641 763216476 762362137 761869888 761843719 762299423 763157806 764272614 765482101 766657486
925 766657486 767723694 768645782 769391174 769901123 770094070 769904785 769336014 768485641 767523651 766623001
935 766623001 765876007 765245590 764580078 763686218 762425537 760781555 758864059 756848145 754882050
944 754882050 753011246 751155472 749151993 746839142 744140625 741115341 737950287 734909210 732262802
953 732262802 730232925 728967209 728541870 728975983 730233841 732213440 734729996 737516708 740263519
962 740263519 742687988 744613953 746022568 747046509 747908936 748829651 749939728 751240005 752610474
971 752610474 753862000 754804611 755304489 755318069 754896774 754161377 753254700 752280273 751250305 750068588
981 750068588 748567581 746597519 744132843 741341934 738574600 736256104 734730606 734121552 734280472
990 734280472 734844818 735377731 735513840 735047531 733932419 732218704 729982224 727293396 724237747
999 724237747 720958481 717677307 714661636 712148056 710259781 708960342 708068008 707320404 706457443
1008 706457443 705288010 703720169 701755371 699454803 696894455 694118881 691107025 687762070 683934326
1017 683934326 679470444 674272690 668337708 661764984 654735184 647494202 640365906 633796539 628394661
1026 628394661 624908714 624103508 626545296 632372932 641156616 651925507 663375931 674189301
1034 674189301 683343430 690304718 695051498 697946701 699534225 700343781 700761261 700985870 701055374
1043 701055374 700911942 700476685 699708710 698633652 697334900 695912476 694429474 692872162 691147766
1052 691147766 689121857 686680069 683781662 680475540 676872101 673082504 669159241 665065536 660685501
1061 660685501 655869751 650488739 644470215 637804108 630514565 622612457 614054375 604725151 594453812
1070 594453812 583054924 570376053 556327400 540882492 524054794 505873642 486383400 465675850
1078 465675850 443944397 421526299 398907776 376674652 355433311 335733795 318028088 302670021
1086 302670021 289936485 280035839 273080692 269033508 267660503 268538570 271138935 274978046 279785919
1095 279785919 285630589 292942429 302416286 314809761 330687485 350186920 372876434 397759399
1103 397759399 423437691 448401985 471369743 491572533 508898659 523840218 537258377 550041504
1111 550041504 562770996 575512276 587803154 598842850 607814560 614221649 618115730 620134010
1119 620134010 621336327 622906036 625826607 630644226 637387352 645644073 654747391 663985748 672766571
1128 672766571 680695724 687570648 693317032 697910614 701317978 703481598 704347076 703917313 702297897
1137 702297897 699708328 696445312 692816772 689082260 685437012 682048187 679111938 676884842 675644989
1146 675644989 675592041 676731873 678819733 681405716 683974838 686114883 687632370 688562622 689078751
1155 689078751 689358978 689480667 689391937 688958740 688050156 686611252 684687500 682396011 679867477
1164 679867477 677191162 674395905 671476898 668451920 665405121 662472382 659749451 657156982 654345856
1173 654345856 650738754 645749054 639116402 631202660 623065033 616208344 612076683 611497841 614341774
1182 614341774 619566536 625631790 631078033 634996490 637191658 638011322 637989006 637509079 636652832
1191 636652832 635246391 633027229 629798889 625495834 620157166 613861465 606678734 598656883 589822617
1200 589822617 580175056 569662971 558169746 545523987 531540070 516063271 498990593 480256882
1208 480256882 459806747 437586861 413588219 387931900 360964127 333317719 305904713 279838200
1216 279838200 256295967 236358490 220849857 210215683 204466400 203207531 205758514 211331387
1224 211331387 219216328 228916588 240193691 253023129 267493706 283699074 301658878 321285706
1232 321285706 342386475 364679337 387811584 411372414 434906540 457938805 480015259 500758896
1240 500758896 519930000 537468987 553497124 568268509 582076416 595152092 607596321 619372139
1248 619372139 630356064 640410004 649432373 657362366 664150620 669733200 674033737 676988983
1256 676988983 678558807 678686981 677222595 673857117 668157959 659730377 648457565 634702148
1264 634702148 619346428 603629494 588853111 576098709 566083755 559187355 555559921 555187454
1272 555187454 557831573 562879562 569236679 575390015 579678421 580673180 577494545 569922485 558282013
1281 558282013 543207703 525448380 505818748 485284805 465075226 446685181 431710625 421554604
1289 421554604 417121544 418618927 425528107 436733551 450748749 465977440 480960197 494576302
1297 494576302 506169739 515568504 522978210 528767815 533208847 536261864 537491646 536154327
1305 536154327 531440582 522807961 510309982 494822655 478085976 462516632 450796928 445322914
1313 445322914 447652893 458122101 475753937 498502502 523749809 548894196 571852341 591350861
1321 591350861 606970444 618989410 628117409 635206680 641012878 646041183 650493164 654299850
1329 654299850 657203064 658838120 658784485 656595383 651856232 644332733 634209671 622341728 610356560
1338 610356560 600473328 595006142 595690231 603093758 616377907 633530426 651983109 669356766
1346 669356766 684031677 695356598 703486176 709006119 712554550 714591980 715353546 714917603 713289413
1355 713289413 710430908 706230621 700463104 692794266 682874832 670518646 655915604 639799500
1363 639799500 623480721 608680420 597174911 590336456 588725624 591893234 598482132 606597176
1371 606597176 614307404 620093842 623097191 623125343 620482559 615738678 609543381 602529716 595284309
1380 595284309 588339691 582150345 577053146 573233147 570725517 569454765 569295959 570128365 571857643
1389 571857643 574404144 577669449 581503677 585690956 589960823 594018860 597584381 600420303 602349892
1398 602349892 603260765 603103218 601888657 599685631 596608505 592792587 588361702 583400078 577947044
1407 577947044 572016029 565629082 558843307 551751289 544457779 537051430 529601707 522194519 514992981
1416 514992981 508288994 502505836 498134003 495614777 495214348 496940422 500536575 505559311 511506882
1425 511506882 517947464 524593887 531297989 537975616 544508018 550680847 556199493 560777473 564245949
1434 564245949 566618767 568070831 568842010 569120064 568972282 568351936 567158203 565294380 562679634
1443 562679634 559220352 554787750 549251289 542572632 534908905 526646347 518320999 510454102 503390465
1452 503390465 497231979 491897049 487254028 483231277 479830666 477048187 474782639 472820663 470938301
1461 470938301 469063263 467386971 466335373 466394539 467877083 470763931 474712639 479224396 483871422
1470 483871422 488454590 493011284 497684288 502547417 507494354 512252274 516501274 520021439 522784081
1479 522784081 524947777 526781616 528569450 530543938 532864723 535620193 538828468 542432327 546309853
1488 546309853 550319977 554387856 558594055 563217010 568696747 575524597 584097557 594588432
1496 594588432 606862831 620451469 634575195 648234634 660375977 670127029 677049866 681308060
1504 681308060 683647766 685160751 686903992 689537125 693144150 697310944 701402283 704875259 707476501
1513 707476501 709248581 710395279 711118851 711531448 711672287 711578827 711349335 711148987 711169052 711571884
1523 711571884 712447968 713789444 715477676 717289047 718941116 720187607 720929489 721278152 721508560
1532 721508560 721898880 722533035 723192978 723425140 722771606 721044235 718488388 715728912 713521194
1541 713521194 712435837 712636337 713851166 715534592 717119598 718238602 718822327 719056320 719232864
1550 719232864 719565811 720044403 720388565 720132675 718829498 716296005 712793961 709034729 705968323
1559 705968323 704420242 704733505 706591797 709126587 711276169 712230377 711747055 710190964 708282242
1568 708282242 706696243 705726471 705180130 704544601 703311462 701264954 698572693 695640106 692838211
1577 692838211 690282516 687809830 685157242 682221527 679214172 676596909 674828720 674079361 674089279
1586 674089279 674265289 673940811 672635727 670159225 666522980 661767578 655867996 648813553 640822678
1595 640822678 632531204 624986420 619382095 616633339 616991997 619896317 624136200 628258476 631035919
1604 631035919 631807785 630575752 627849159 624332390 620596237 616864281 612989044 608608131 603391609
1613 603391609 597254562 590425758 583341904 576431961 569908218 563683548 557444611 550828209 543592567
1622 543592567 535693016 527243576 518411636 509319649 499994202 490355759 480221252 469306259
1630 469306259 457249947 443697014 428436127 411541595 393432579 374791908 356364746 338730431
1638 338730431 322167015 306669235 292098541 278368645 265573997 254014034 244145355 236518116
1646 236518116 231738510 230449848 233294048 240817184 253329411 270761032 292575512 317777195
1654 317777195 345019798 372791862 399643440 424402351 446329727 465163116 481024132 494225845
1662 494225845 505063591 513691978 520151367 524509544 527012749 528125343 528410721 528321342 528033638
1671 528033638 527447662 526355095 524660835 522494011 520119438 517696228 515051117 511633186 506708717
1680 506708717 499690399 490405121 479138489 466428947 452740021 438200073 422544136 405266342
1688 405266342 385873375 364105301 340050468 314162350 287237740 260385361 234961529 212412987
1696 212412987 194010258 180536327 172073212 168019009 167369690 169162788 172879772 178611889
1704 178611889 186910229 198394012 213300056 231174145 250815964 270473404 288181171 302116776
1712 302116776 310878811 313649311 310252762 301130867 287256298 269994144 250934067 231717720
1720 231717720 213896523 198831730 187632675 181108894 179723091 183553333 192293434 205321121
1728 205321121 221830959 240992908 262073784 284475765 307690239 331216125 354510155 377014084
1736 377014084 398252754 417947044 436072044 452819519 468477020 483282204 497322426 510523796
1744 510523796 522727890 533808136 543772507 552799492 561199532 569320755 577441826 585695076
1752 585695076 594049759 602354164 610414696 618076172 625269775 632016830 638400154 644522476 650477753
1761 650477753 656331711 662111511 667788391 673261108 678361664 682898636 686736755 689881287 692513428
1770 692513428 694949036 697526627 700477753 703843613 707478561 711130753 714548721 717561569 720106049
1779 720106049 722212448 723978806 725553513 727114792 728827744 730775070 732891769 734956207 736668091
1788 736668091 737794876 738314438 738463287 738650360 739268112 740498199 742219162 744067688 745618896
1797 745618896 746592026 746974182 747007599 747058716 747444382 748301315 749552765 750973740 752310791 753394165
1807 753394165 754195633 754814453 755409393 756118927 757005081 758046188 759169769 760298004 761380463
1816 761380463 762399063 763354034 764248123 765083237 765863647 766595840 767276077 767873688 768334579 768613510
1826 768613510 768725586 768778839 768952637 769419785 770251770 771370087 772583160 773694534 774611740 775384293
1836 775384293 776138535 776953201 777763901 778371124 778557358 778240509 777565231 776865158 776511993 776740189
1846 776740189 777543793 778699646 779892578 780864487 781505356 781855011 782033997 782162476 782309418 782493439
1856 782493439 782710876 782965927 783275528 783651962 784074402 784472275 784736099 784752884 784457703 783875198
1866 783875198 783129272 782408752 781898193 781705093 781817551 782115860 782431488 782616959 782596207 782370071
1876 782370071 781987000 781511078 781002426 780520325 780125046 779865570 779748535 779716873 779660110 779464111
1886 779464111 779076538 778547134 778011017 777623978 777483521 777587280 777845078 778135223 778364487 778497543
1896 778497543 778547592 778549042 778533630 778525543 778545074 778605881 778700943 778791885 778818283 778734741 778555679 778374023
1908 778374023 778330536 778542099 779028854 779687042 780329285 780773773 780931778 780846863 780661163 780536652
1918 780536652 780576096 780785217 781090088 781392136 781622849 781770020 781867447 781963043 782083893 782221680
1928 782221680 782337112 782383499 782331390 782186127 781987991 781796875 781663361 781602020 781578140 781518173 781340942
1939 781340942 780999680 780511017 779955139 779442902 779065094 778847122 778733368 778611374 778364563 777927856
1949 777927856 777320099 776639023 776021423 775589600 775408325 775469208 775708008 776039047 776392288 776733475
1959 776733475 777062912 777397461 777748184 778104019 778431473 778686447 778833389 778860474 778785858 778652496
1969 778652496 778512039 778409653 778370438 778396835 778475189 778588486 778726730 778894958 779109421 779388199
1979 779388199 779741440 780161362 780622101 781083603 781501999 781839523 782075500 782210464 782268219 782289429
1989 782289429 782321701 782405319 782561722 782787933 783060837 783347092 783617554 783855591 784058762 784231415
1999 784231415 784376526 784489822 784560547 784579391 784546356 784475098 784390030 784316788 784270248 784247284 784227142
2010 784227142 784178162 784073181 783900833 783673248 783422241 783189011 783008347 782895279 782840958 782818451
2020 782818451 782796936 782755051 782691345 782621307 782567673 782547073 782560196 782593079 782624130 782636948 782628403 782609863
2032 782609863 782600555 782614746 782654648 782705688 782744064 782747345 782706680 782631454 782547531 782485046 782464600 782487335
2044 782487335 782532883 782568741 782565079 782508850 782409210 782291718 782183990 782100830 782037125 781970749 781875916 781736298
2056 781736298 781552658 781340256 781119003 780902100 780689926 780473404 780241776 779993439 779737930 779494476
2066 779494476 779283447 779117432 778995972 778907089 778832016 778753967 778664703 778568497 778479919 778418503 778400879
2077 778400879 778432083 778504944 778601913 778703079 778794785 778874130 778947144 779022369 779103546 779185562 779256516 779304733
2089 779304733 779325409 779323349 779310760 779300461 779299622 779306717 779314804 779316177 779307709 779293518 779281921 779281845 779297180 779325714
2103 779325714 779357834 779382782 779391785 779382172 779358444 779330063 779306641 779293213 779288788 779286499 779279175 779262314 779237747
2116 779237747 779212112 779192657 779183350 779182739 779184647 779182892 779174194 779159775 779143448 779127884 779110489 779083557 779038162
2129 779038162 778968506 778877106 778775330 778679504 778604507 778558197 778539124 778538284 778546677 778558655 778576965 778608932
2141 778608932 778662262 778739090 778833694 778933258 779024200 779096375 779147568 779182587 779208755 779232483 779253922 779268646
2153 779268646 779269257 779251022 779215240 779169617 779126129 779094162 779076691 779067307 779052811 779018707 778955994 778865204
2165 778865204 778755646 778641434 778534317 778440475 778358154 778281631 778204269 778122330 778035736 777946167 777854919
2176 777854919 777763062 777670975 777579422 777491837 777411957 777343903 777289810 777249374 777220612 777201996 777192688 777194061
2188 777194061 777207108 777231293 777262955 777296371 777325134 777344818 777354050 777353516 777344513 777327118 777298584 777254333 777190628
2201 777190628 777106323 777004852 776892395 776777039 776665268 776559830 776460648 776364670 776269379 776174316 776082001
2212 776082001 775997009 775923386 775860748 775802841 775738220 775655365 775546341 775412521 775262680 775108948 774959259
2223 774959259 774813232 774662399 774495773 774308395 774105377 773901520 773714294 773555832 773426208 773315353
2233 773315353 773208694 773095093 772973251 772851181 772742996 772659760 772605057 772571869 772546997 772515640 772470703
2244 772470703 772414474 772358856 772318802 772304306 772314377 772337112 772354126 772349472 772316666 772260284 772190857 772118149
2256 772118149 772044601 771963196 771863632 771738358 771589737 771431122 771283112 771164780 771085129 771039734 771011353
2267 771011353 770979691 770930634 770863800 770792694 770736618 770708923 770709381 770722961 770729675 770718384 770695190 770682831
2279 770682831 770707550 770782623 770896530 771014252 771090775 771090775 771003113 770843964 770647964 770451736 770277634
2290 770277634 770126801 769982147 769819412 769621658 769390182 769144821 768917313 768736725 768616028 768547363
2300 768547363 768506546 768463058 768391724 768277512 768113251 767893372 767613220 767274017 766891403 766502304
2310 766502304 766160049 765917587 765804214 765805740 765858765 765863953 765715714 765340195 764726715 763942642 763114777
2321 763114777 762384262 761846085 761502075 761256180 760958786 760482483 759791946 758962021 758136978 757449341
2331 757449341 756951447 756600723 756299820 755960007 755531311 754978867 754231491 753164597 751664886 749765854
2341 749765854 747773437 746274643 745972748 747393723 750600739 755073318 759837646 763802795 766148605
2350 766148605 766580200 765347519 763044281 760314407 757618713 755151901 752907410 750809021 748818741
2359 748818741 746965103 745310745 743899612 742732620 741779938 741013947 740430832 740049210 739890594
2368 739890594 739960785 740244827 740715256 741346054 742120743 743033066 744085159 745282745 746630630 748123856
2378 748123856 749735489 751407928 753054581 754579010 755901413 756984634 757840500 758516464 759069290
2387 759069290 759540710 759945221 760276794 760524673 760688019 760782166 760834732 760874329 760920486 760978088 761037369
2398 761037369 761079712 761086731 761049118 760972137 760874405 760780029 760707626 760659790 760623398 760574951 760494537 760378189
2410 760378189 760240173 760106583 760003052 759940643 759910965 759891815 759857788 759794540 759704819 759607162 759525604
2421 759525604 759477386 759463272 759465103 759453278 759398651 759283371 759108887 758892517 758660049 758434525 758228836
2432 758228836 758043442 757869873 757697601 757520218 757338333 757161026 757002029 756875610 756791763 756751404
2442 756751404 756745453 756756744 756766281 756761322 756740570 756715698 756705551 756726761 756783752 756865311 756947327 757002335
2454 757002335 757011719 756972504 756899261 756816330 756747055 756702347 756676559 756648483 756593475 756494522 756351547 756183472
2466 756183472 756018753 755881805 755780182 755699844 755610962 755483398 755301514 755074005 754829865 754605713
2476 754605713 754427109 754297638 754196625 754090958 753951721 753768005 753553085 753335648 753145676 752998581
2486 752998581 752887650 752787628 752667465 752507706 752309952 752098083 751904907 751756973 751659241 751592178
2496 751592178 751519547 751405334 751230850 751003418 750752716 750517349 750326843 750188293 750084457 749982681
2506 749982681 749850922 749673920 749459915 749237289 749039917 748892593 748797531 748735428 748674164 748585205 748457565
2517 748457565 748302307 748147278 748022156 747943192 747905045 747882462 747843552 747765198 747645187 747504120 747376328
2528 747376328 747293854 747271805 747301178 747353363 747392807 747393417 747350464 747280502 747212677 747173080 747172699 747201309 747234116
2541 747234116 747243576 747213440 747145767 747061081 746986771 746946182 746947174 746978455 747014313 747025528 746990662 746906204
2553 746906204 746786804 746660233 746554642 746485291 746447067 746415558 746358032 746249466 746085052 745884705 745684128
2564 745684128 745517883 745402527 745328064 745262070 745165253 745010757 744797592 744550781 744309616 744109344
2574 744109344 743963089 743856583 743755417 743620834 743429031 743182373 742907791 742645264 742427521 742266083
2584 742266083 742145386 742031326 741887283 741692505 741450958 741188660 740940323 740731277 740563965 740416336
2594 740416336 740252304 740039291 739763870 739439850 739101791 738789749 738531647 738331299 738168411 738010254
2604 738010254 737828140 737612000 737374496 737144394 736951141 736810074 736714096 736636887 736544952 736414185
2614 736414185 736240997 736044464 735856705 735708084 735611038 735553818 735505295 735428162 735296707 735110016 734891739
2625 734891739 734680557 734512024 734402695 734341736 734296951 734229660 734112778 733942261 733737717 733533173 733359985
2636 733359985 733232956 733146057 733076553 732997360 732891541 732758942 732616425 732488785 732395706 732343445 732321701
2647 732321701 732309036 732282104 732227020 732145157 732052155 731970139 731918106 731902084 731912537 731927261 731922302 731881561
2659 731881561 731805801 731711578 731623764 731563797 731536789 731529846 731515427 731465683 731364746 731217270 731046066
2670 731046066 730882187 730750504 730659943 730600128 730547943 730478363 730375366 730238876 730082855 729927902 729790421
2681 729790421 729674072 729565964 729442368 729278793 729062805 728803101 728525467 728263626 728042679 727865982
2691 727865982 727714310 727553787 727354279 727103577 726813660 726513824 726235428 725995331 725788956 725592499
2701 725592499 725375824 725116501 724809494 724468918 724119949 723787384 723485031 723209000 722940903 722655106
2711 722655106 722330170 721958542 721549683 721125488 720711060 720322342 719959412 719605942 719237747 718834915
2721 718834915 718391342 717919388 717444534 716993790 716584702 716217041 715873032 715524750 715146408 714725418
2731 714725418 714267960 713795471 713336411 712912674 712530670 712179489 711836472 711480408 711102219 710712433
2741 710712433 710336075 710001450 709724121 709497833 709293137 709070282 708795624 708457642 708071823 707672729
2751 707672729 707296906 706963272 706663361 706364059 706024704 705615768 705134811 704608612 704080887 703592072
2761 703592072 703161392 702779617 702414932 702029190 701597137 701116486 700607300 700099869 699616623 699159851
2771 699159851 698709106 698230438 697692947 697084274 696417313 695725861 695050583 694422302 693852158 693330383
2781 693330383 692835388 692347565 691860046 691383133 690938034 690546799 690219040 689945526 689700012 689449005
2791 689449005 689164276 688834305 688466949 688084335 687709427 687353592 687009125 686652374 686256256 685804825
2801 685804825 685304337 684783478 684282684 683836136 683456879 683131790 682827911 682508926 682153244 681764755
2811 681764755 681371689 681013260 680720978 680503464 680341415 680196304 680026932 679807663 679539108 679244461
2821 679244461 678956375 678698730 678472748 678255310 678008041 677694626 677296829 676822357 676300812 675771027
2831 675771027 675264130 674791870 674341965 673886032 673392105 672838898 672224655 671565704 670886841 670208130
2841 670208130 669534073 668850708 668132095 667352295 666497345 665571594 664593430 663586655 662568817 661543961
2851 661543961 660502243 659426651 658303528 657130203 655917664 654685211 653451004 652220993 650983353
2860 650983353 649709244 648362503 646914520 645355988 643702850 641991806 640267487 638567390 636911583
2869 636911583 635300636 633723488 632168045 630631943 629123726 627655907 626233788 624844284 623453331
2878 623453331 622011414 620468407 618787460 616956520 614986496 612903366 610731583 608482933 606152649
2887 606152649 603724289 601182671 598524513 595762634 592922020 590027237 587093048 584119911 581099930
2896 581099930 578032074 574934349 571852150 568853226 566011543 563387985 561012802 558880653 556957283
2905 556957283 555197105 553560829 552028389 550599518 549284096 548087654 546997528 545979156 544979630
2914 544979630 543940849 542813644 541567650 540196228 538712730 537141418 535509644 533840370 532151299
2923 532151299 530457916 528779945 527146568 525596504 524173126 522915115 521844940 520963974 520254784
2932 520254784 519689789 519245377 518912086 518697777 518622627 518705711 518952332 519344902 519841270 520383034
2942 520383034 520908127 521363907 521715546 521948586 522062912 522065964 521964951 521765556 521474190 521103325
2952 521103325 520675659 520223351 519781990 519382401 519042854 518765717 518539276 518342247 518149948 517935715
2962 517935715 517669945 517318306 516840668 516193352 515335541 514237595 512888489 511299744 509506989
2971 509506989 507568512 505564499 503596725 501789627 500285263 499233131 498770065 498995895 499951973
2980 499951973 501610146 503877563 506617241 509675751 512909927 516204338 519476662 522674828 525771027
2989 525771027 528756409 531639252 534442902 537201271 539948387 542707787 545482750 548251991 550975113
2998 550975113 553601570 556081734 558377533 560467682 562349815 564039764 565568619 566976852 568305054
3007 568305054 569583740 570821877 572003250 573089905 574035187 574799080 575361137 575724411 575908737
3016 575908737 575938110 575830231 575590668 575216522 574705009 574060440 573298073 572442017 571521225 570564156
3026 570564156 569594574 568627663 567663803 566685867 565660286 564548225 563324394 561997681 560621834
3035 560621834 559289513 558105850 557152061 556453514 555966301 555588570 555192070 554659386 553912163 552920265
3045 552920265 551691818 550252724 548625908 546822853 544845123 542696190 540393181 537971954 535484390
3054 535484390 532987404 530529823 528142166 525830917 523579063 521351929 519104652 516792831 514381599
3063 514381599 511852951 509210968 506479645 503698654 500915260 498174438 495510826 492941818 490463715
3072 490463715 488050690 485659142 483237915 480741386 478142014 475437164 472646065 469798965 466925507
3081 466925507 464048843 461191254 458385277 455684013 453160210 450888519 448919716 447256088 445842552
3090 445842552 444578934 443346939 442040901 440589828 438961334 437154236 435184479 433077507 430867043
3099 430867043 428600883 426343193 424167824 422145233 420324783 418723717 417327538 416102295 415013237
3108 415013237 414041214 413189888 412482300 411948624 411612244 411479263 411534424 411744919 412067757 412462006
3118 412462006 412898750 413369370 413889275 414492493 415221939 416114235 417187195 418433685 419826393
3127 419826393 421328659 422911949 424564629 426294289 428118973 430052757 432092667 434212494 436368179
3136 436368179 438509293 440594902 442602959 444533577 446402779 448231621 450036011 451821632 453583717
3145 453583717 455311279 456990776 458607597 460144768 461582947 462901917 464085312 465126877 466030960
3154 466030960 466811104 467482834 468056984 468537483 468923187 469212112 469404068 469500504 469499588 469394264 469172096
3165 469172096 468821754 468339386 467732430 467018318 466217575 465346756 464415207 463427658 462389641 461312752
3175 461312752 460214844 459116440 458033638 456973648 455933723 454905434 453880119 452854118 451829529
3184 451829529 450812225 449807320 448814430 447826653 446830902 445811691 444755020 443651543 442497826
3193 442497826 441295357 440048294 438760910 437434425 436066132 434649582 433175354 431635361 430024605
3202 430024605 428343658 426598473 424796677 422946014 421049805 419107933 417118416 415080528 412995720
3211 412995720 410867081 408696632 406482773 404220238 401903763 399531822 397110100 394651566 392172852
3220 392172852 389689560 387213593 384752159 382312164 379904823 377547302 375262260 373071632 370989609
3229 370989609 369016953 367141457 365345154 363614311 361948967 360366936 358899269 357579308 356431961
3238 356431961 355468140 354686546 354081993 353655815 353418770 353390770 353592873 354041214 354743843 355702705
3248 355702705 356918869 358394928 360136681 362150040 364438705 367003326 369842644 372954063 376334953
3257 376334953 379980469 383881531 388024178 392389984 396959915 401715202 406638298 411710205 416906624
3266 416906624 422194786 427534332 432880478 438191299 443434792 448593407 453664207 458654900 463575630
3275 463575630 468432732 473224525 477942352 482575264 487115402 491561775 495918312 500190125 504377861
3284 504377861 508474350 512465782 516335793 520071754 523669510 527135277 530481834 533723907 536870918
3293 536870918 539921761 542864037 545676422 548336525 550827713 553145103 555296211 557296753 559162521
3302 559162521 560902176 562512665 563982201 565297890 566456985 567473679 568380203 569218483 570026703
3311 570026703 570826225 571617012 572381821 573100929 573766098 574387550 574990082 575598412 576222000 576847496
3321 576847496 577443275 577973862 578416176 578768730 579048920 579282379 579489441 579677505 579841118 579970589
3331 579970589 580061264 580119438 580163002 580214539 580293121 580405807 580544319 580686722 580805016 580874786 580883713
3342 580883713 580834694 580742607 580625610 580493431 580338974 580136528 579847450 579433060 578867989 578150787
3352 578150787 577306671 576381226 575426865 574489174 573597298 572763252 571991920 571293564 570693703 570232315
3362 570232315 569953041 569885483 570030899 570357361 570807495 571313820 571817436 572279663 572685242 573037415
3372 573037415 573346214 573619080 573852119 574028816 574125519 574119606 574000740 573776283 573471031 573118591
3382 573118591 572750816 572388344 572040443 571710587 571406250 571145554 570955620 570863190 570882111 571004829
3392 571004829 571201744 571431351 571653786 571844292 571997375 572123337 572237473 572348175 572450752 572529106
3402 572529106 572565155 572548790 572484360 572390747 572292786 572211990 572158775 572129364 572107964 572072716 572001152 571877174
3414 571877174 571695213 571463585 571202927 570941429 570704384 570506744 570349731 570225449 570125504 570049095
3424 570049095 570002899 569993820 570019569 570065117 570107613 570129128 570129166 570126076 570149879 570227928 570373154 570579796
3436 570579796 570828590 571093979 571350327 571576614 571758194 571891861 571990776 572086258 572220421 572432671
3446 572432671 572743073 573144531 573606949 574092827 574574471 575042610 575502281 575960274 576413918 576848831
3456 576848831 577248116 577605743 577934570 578264008 578625908 579040298 579506569 580005913 580511360 581000900
3466 581000900 581464615 581905365 582334595 582767372 583218498 583699532 584214897 584757233 585305023 585828171
3476 585828171 586300430 586714401 587088089 587458344 587861786 588315430 588808784 589313965 589809151 590295105
3486 590295105 590796089 591340866 591937904 592565155 593181419 593754272 594283524 594801445 595348587 595939903
3496 595939903 596547852 597115860 597593193 597970428 598288193 598615494 599010620 599491615 600035515 600601425
3506 600601425 601162834 601723518 602309990 602949142 603648300 604390373 605147743 605898285 606634026 607356224
3516 607356224 608062897 608740540 609364891 609911766 610367813 610738449 611047287 611332359 611639748 612018242
3526 612018242 612510071 613139534 613901634 614758110 615647011 616506157 617300262 618040085 618778954 619584656
3536 619584656 620496941 621492958 622481384 623335190 623951111 624306068 624477196 624610138 624850807 625277557
3546 625277557 625873528 626557045 627245598 627912712 628597336 629365082 630251732 631236725 632265854 633304672
3556 633304672 634371185 635510025 636717148 637866592 638712769 638989410 638568077 637579727 636416054
3565 636416054 635593529 635539932 636419716 638083382 640159607 642228699 643984680 645315170 646288910
3574 646288910 647089005 647932816 649008789 650418015 652125015 653929443 655496674 656465836 656611252
3583 656611252 655982513 654933472 654003830 653696747 654263229 655606461 657357864 659073105 660437851
3592 660437851 661374130 662012177 662571411 663238602 664111938 665215302 666539841 668057556 669696960
3601 669696960 671306915 672665024 673548126 673838120 673604355 673104858 672702103 672727814 673358536 674548569
3611 674548569 676038666 677433395 678332062 678488770 677954865 677139969 676720352 677382431 679476624
3620 679476624 682745438 686300659 688920212 689566345 687883377 684406738 680362549 677145691 675743637
3629 675743637 676394501 678618317 681554565 684387207 686636963 688227234 689371490 690406265 691657181
3638 691657181 693344498 695491028 697832489 699791336 700607834 699643021 696738052 692424316 687817383
3647 687817383 684196167 682463150 682775726 684544830 686792221 688649521 689723740 690163269 690447617
3656 690447617 691074982 692334747 694245300 696616592 699142685 701464157 703211975 704082184 703940964
3665 703940964 702903137 701302567 699529343 697816315 696117172 694176483 691767960 688955078 686194534
3674 686194534 684202499 683647766 684853287 687663803 691527939 695712509 699505157 702322006 703731308
3683 703731308 703474197 701538086 698256454 694334793 690717926 688309479 687658844 688777084 691173553
3692 691173553 694084625 696763535 698690720 699644394 699662018 698974228 697960358 697099762 696868134
3701 696868134 697555771 699078979 700906830 702203903 702171173 700435486 697281189 693586578 690478973
3710 690478973 688878937 689153671 691034012 693798141 696599045 698765640 699960480 700177383 699638367
3719 699638367 698672943 697627563 696815567 696481934 696770325 697682877 699046936 700503845 701547623
3728 701547623 701632233 700352173 697658997 694017410 690385742 687950516 687664948 689782715 693638000
3737 693638000 697839966 700844193 701636963 700173187 697318192 694323044 692130280 690913620 690115585
3746 690115585 688934326 686941452 684434128 682306824 681529999 682571259 685113373 688229599 690885773
3755 690885773 692461166 692984695 692992554 693134842 693788834 694890060 696032028 696728973 696669922 695841522
3765 695841522 694500351 693056412 691938782 691486969 691866837 693014145 694623566 696216202 697294159
3774 697294159 697532501 696919327 695758514 694524002 693633270 693268738 693340683 693604355 693844528 694009552
3784 694009552 694213257 694621353 695312042 696213074 697153244 697978058 698632965 699147797 699533310 699680786
3794 699680786 699361115 698346252 696583328 694293289 691908646 689872437 688426056 687528381 686968994
3803 686968994 686597824 686503601 686999054 688402863 690752640 693649673 696355667 698104782 698446426
3812 698446426 697417984 695452423 693102112 690767212 688597336 686598206 684832001 683536301 683060837
3821 683060837 683659973 685290680 687568436 689924011 691868286 693198242 694016876 694564514 694981918
3830 694981918 695161362 694788361 693543701 691340866 688449631 685427856 682901917 681321030 680830841
3839 680830841 681324387 682625198 684662323 687496185 691149292 695328140 699234619 701648941 701335907
3848 701335907 697629776 690908737 682669601 675094299 670255737 669318314 672112427 677283707 682928696
3857 682928696 687393036 689852295 690432816 689891739 689084473 688519211 688200989 687785797 686899948 685426941
3867 685426941 683613205 681964798 681013031 681078873 682144318 683878098 685784454 687394257 688411179
3876 688411179 688759995 688539658 687930145 687113342 686242065 685446625 684839172 684488297 684377747 684392090
3886 684392090 684369812 684214249 683994598 683956146 684404221 685511017 687156219 688906097 690159912 690390244
3896 690390244 689356232 687185898 684309464 681300125 678706894 676943207 676234360 676609955 677916336
3905 677916336 679855423 682051315 684139328 685842361 687003784 687572021 687563553 687044678 686139984
3914 686139984 685047531 684013596 683259735 682892532 682862015 683005829 683158112 683246841 683313217 683438492
3924 683438492 683638153 683811798 683789902 683450470 682820816 682090988 681527252 681342621 681600189 682196121
3934 682196121 682916412 683525467 683841629 683785706 683395386 682808304 682208481 681748581 681479568 681332321
3944 681332321 681172867 680902328 680533524 680185699 679999466 680031586 680214081 680406342 680496445 680465622
3954 680465622 680369873 680259399 680120926 679896698 679564743 679196472 678926773 678847198 678915939 678973541 678863220
3965 678863220 678559113 678183899 677893372 677723846 677549591 677197037 676626129 676002274 675573425 675439072
3975 675439072 675424652 675198135 674563370 673671417 672928696 672636108 672656860 672445755 671488190 669811783
3985 669811783 668079300 667063370 666851883 666492920 664568329 660448608 655229797 651275482 650118561
3994 650118561 649783401 643429108 620842171 572720375 495807724 396024361
4000 396024361
##END=$$ End of the data block
