##TITLE=$$ Begin of the data block
##JCAMP-DX=5.00 $$ ACD/SpecManager v 10.08
##SPECTROMETER/DATA SYSTEM=16PC
##DATE=04 Jun 2013 10:04:54
##DATA TYPE=INFRARED SPECTRUM
##DATA CLASS=XYDATA
##ORIGIN=
##OWNER=
##NPOINTS=3601
##FIRSTX=400.00000000
##LASTX=4000.00000000
##MAXX=4000.00000000
##MINX=400.00000000
##MAXY=78.76806641
##MINY=28.10577011
##XFACTOR=1.0000000000
##YFACTOR=0.000000100000000
##FIRSTY=45.21894073
##DELTAX=1.00000000
##XUNITS=1/CM
##YUNITS=TRANSMITTANCE
##XYDATA=(X++(Y..Y))
400 452189407 569728622 657924805 710185165 732129974 736600113 736335983 738634720 744386215
408 744386215 750829010 755298691 757346039 758394623 760013962 762564545 765194016 766860580 767307510
417 767307510 767186890 767393646 768310013 769591751 770569458 770817490 770408630 769733887 769154053 768810120
427 768810120 768691483 768783188 769093170 769533310 769824142 769589539 768609543 767024841 765296478 763921661
437 763921661 763110046 762657776 762093277 760965958 759061737 756432495 753273849 749785004 746101761
446 746101761 742302856 738431015 734503250 730531998 726582794 722850342 719677887 717467728 716514435
455 716514435 716865768 718314133 720523758 723200455 726185455 729424896 732871094 736413803 739897842
464 739897842 743200073 746285172 749190445 751958084 754577408 756987152 759127274 760992432 762640076
473 762640076 764153442 765591965 766965637 768238754 769351959 770241547 770858841 771190796 771281204
482 771281204 771230240 771156693 771130066 771109848 770929947 770348816 769141388 767194977 764565277 761475525
492 761475525 758259201 755261765 752738571 750792007 749384308 748426666 747895432 747888870 748571472 750025635
502 750025635 752111282 754438782 756474991 757698898 757671280 755969162 752077637 745426483 735688782
511 735688782 723252335 709573059 697087250 688571091 686166611 690535278 700576935 713868408
519 713868408 727595901 739520721 748549881 754738541 758859329 761840973 764359055 766695633
527 766695633 768820572 770562592 771762924 772362976 772434921 772175140 771858368 771760788 772062149 772770004
537 772770004 773705750 774571838 775074692 775047684 774517517 773683624 772829742 772209778 771960754 772072067
547 772072067 772407761 772761917 772919922 772710037 772045059 770946045 769542007 768029861 766595688
556 766595688 765318985 764105835 762695465 760756073 758042984 754550858 750590439 746746826 743725815
565 743725815 742142944 742331696 744242096 747460403 751342926 755209503 758526840 761018829 762677994
574 762677994 763690338 764321213 764810028 765308380 765862503 766432953 766931381 767266617 767387314 767310791
584 767310791 767118759 766918869 766787415 766729965 766682663 766557159 766290359 765859756 765249634 764396439
594 764396439 763171539 761432953 759131088 756396255 753538666 750936356 748865204 747370300 746260452
603 746260452 745243530 744127045 742972031 742106781 741983032 742939072 744997559 747800674 750728378
612 750728378 753145981 754663696 755277939 755329590 755305862 755598145 756342468 757413635 758543549 759471970
622 759471970 760027771 760114441 759648972 758541412 756761932 754458847 752034607 750089645 749231949
631 749231949 749836502 751880112 754942245 758368835 761510468 763919830 765432281 766122742 766193237
640 766193237 765857544 765274277 764534607 763685150 762752228 761748123 760655899 759412079 757910309
649 757910309 756033630 753702927 750904541 747666321 743991394 739798584 734936981 729305420 723028030
658 723028030 716572647 710702362 706242447 703759155 703334274 704572449 706844559 709622803 712696991
667 712696991 716143417 720079346 724388351 728614044 732109604 734349594 735203552 734992294 734300079
676 734300079 733666229 733351746 733303680 733302307 733154526 732795868 732251053 731523132 730520706 729082870
686 729082870 727051010 724280319 720534973 715333710 707923279 697520905 683800354 667382202
694 667382202 649992523 634082756 622003403 615123901 613379631 615516548 619908180 625477638
702 625477638 632192268 640860214 652384491 666949692 683632660 700646667 716038208 728416290
710 728416290 737327728 743151627 746676712 748661118 749604797 749775238 749356995 748569870 747672577
719 747672577 746884155 746309586 745927734 745639801 745333023 744918442 744336014 743548203 742540359 741325455
729 741325455 739943848 738444595 736858597 735179214 733363190 731352081 729099121 726585312 723812790
738 723812790 720774078 717408905 713576736 709078064 703747253 697588654 690883865 684173050 678062668
747 678062668 672915726 668580933 664339371 659160309 652173309 643138885 632660179 622017632
755 622017632 612707291 605915184 602178459 601355209 602848587 605912132 609866676 614159470 618310699
764 618310699 621853027 624340057 625434113 625013924 623231735 620480766 617280655 614128494 611371002
773 611371002 609141235 607371178 605871315 604439240 602957649 601442299 600037117 598960228 598437958
782 598437958 598651009 599708061 601644669 604433746 608001175 612239456 617022781 622217293 627683716
791 627683716 633272514 638816910 644137497 649067993 653494263 657392578 660841217 664000092 667062988
800 667062988 670203247 673538513 677120667 680951462 685004501 689242554 693619003 698066711 702486191
809 702486191 706742096 710677567 714141541 717021027 719254990 720827026 721734085 721954422 721439819
818 721439819 720148621 718113251 715513763 712717209 710251160 708712769 708635330 710357437 713938980
827 713938980 719142380 725483780 732332611 739034500 745028839 749938889 753618851 756148605 757778320
836 757778320 758838959 759638824 760383224 761135788 761836929 762364655 762615585 762572708 762333069 762090683
846 762090683 762078552 762498016 763458405 764946365 766834869 768922653 770990753 772854614 774400635
855 774400635 775595016 776469498 777093658 777543030 777877274 778126221 778290787 778349838 778272552 778028183
865 778028183 777596817 776971741 776156769 775155487 773960800 772544861 770864944 768882675 766598587
874 766598587 764089966 761537628 759222794 757486954 756657486 756960068 758448563 760979767 764247437
883 764247437 767863235 771454010 774740753 777570953 779905777 781777496 783244095 784362183 785181503
892 785181503 785752869 786136246 786399918 786609726 786815109 787038269 787270889 787481232 787628784 787680664
902 787680664 787624054 787470551 787248688 786987152 786699371 786376877 785995789 785534592 784988556 784376373
912 784376373 783731537 783087234 782467651 781890030 781379852 780984802 780773849 780816422 781147690 781740036
922 781740036 782499390 783292770 783997040 784542389 784928589 785204468 785424805 785610199 785731430 785727539
932 785727539 785543518 785163269 784619980 783981781 783321991 782692337 782106705 781541138 780942154 780239868
942 780239868 779365387 778270950 776946564 775427322 773785706 772105865 770455475 768866959 767338867
951 767338867 765857697 764430771 763112335 762013626 761287231 761088943 761524353 762598343 764186249
960 764186249 766046448 767879944 769421082 770522614 771200333 771611099 771974869 772477798 773200455
969 773200455 774100952 775052032 775904083 776539383 776898880 776976852 776804276 776432114 775919876 775326004
979 775326004 774689713 774011841 773246307 772317657 771165314 769795380 768311768 766901703 765775223
988 765775223 765083008 764854813 764986343 765279083 765507050 765478210 765063934 764198380 762869415 761119156
998 761119156 759056778 756863022 754766464 752982788 751640854 750733948 750127487 749620438 749031296
1007 749031296 748261108 747305145 746217651 745055313 743835068 742522430 741045151 739317017 737258072
1016 737258072 734807892 731933594 728634949 724939041 720886078 716515961 711878433 707080002 702357330
1025 702357330 698134079 695005951 693622284 694488373 697762833 703148804 709936981 717197495 724038773
1034 724038773 729828491 734296265 737497787 739686661 741168060 742193909 742925262 743445358 743791199
1043 743791199 743979568 744021149 743924408 743699799 743361359 742924805 742398682 741775818 741028748 740116806
1053 740116806 739001160 737659912 736096344 734335937 732414169 730360565 728183365 725859756 723333359
1062 723333359 720521927 717335663 713697968 709560089 704898682 699696732 693914795 687471695 680242310
1071 680242310 672076416 662823334 652350311 640545197 627313347 612583160 596331482 578624802
1079 578624802 559659653 539776382 519438286 499182777 479568558 461142006 444425392 429914589
1087 429914589 418054657 409178162 403415642 400619316 400349388 401964760 404804573 408413391 412721405
1096 412721405 418104744 425284805 435087318 448138466 464594917 484003029 505336494 527204704
1104 527204704 548172112 567088890 583335228 596902390 608295860 618294029 627651825 636847420
1112 636847420 645951157 654650803 662408905 668692551 673190918 675954514 677412567 678270645 679322739
1121 679322739 681241684 684415131 688876877 694348984 700365753 706426468 712120285 717189255 721525497
1130 721525497 725125961 728035278 730297470 731926727 732903366 733188248 732757034 731638718 729943542
1139 729943542 727860794 725628128 723482742 721625519 720207748 719339294 719094086 719496002 720489349
1148 720489349 721920700 723559723 725164719 726561890 727690201 728585739 729315033 729904175 730310516
1157 730310516 730451126 730262604 729745407 728964539 728009033 726941528 725773010 724471741 722996445
1166 722996445 721335144 719532928 717700577 715990906 714534836 713343582 712221375 710755615 708442841
1175 708442841 704935913 700308304 695182190 690604172 687683487 687146149 689029694 692677002 697032318
1184 697032318 701075821 704177551 706206131 707394257 708078232 708480606 708635178 708443680 707784805
1193 707784805 706585617 704823227 702486115 699541168 695937958 691637115 686631546 680936813 674553528
1202 674553528 667427750 659431686 650374908 640030594 628160286 614524612 598884277 581005630
1210 581005630 560689430 537832108 512516518 485110931 456344414 427318878 399430733 374195938
1218 374195938 353009605 336898918 326343193 321221313 320908699 324494057 331043930 339822960
1226 339822960 350404434 362648582 376583595 392259254 409635315 428538322 448674927 469667053
1234 469667053 491078949 512432213 533223801 552966537 571253052 587822609 602603111 615710182
1242 615710182 627403336 638014641 647870026 657219009 666188812 674772720 682857666 690282516
1250 690282516 696902618 702628479 707429199 711306305 714268875 716324158 717478256 717719498 716972809
1259 716972809 715048676 711644669 706444931 699301987 690412674 680379562 670096512 660505524
1267 660505524 652352905 646073456 641839523 639699554 639667969 641677475 645421295 650211868 654992142
1276 654992142 658541336 659782104 658035049 653092346 645105820 634397354 621334572 606352081
1284 606352081 590085640 573502502 557906990 544772644 535449715 530859375 531286354 536335106
1292 536335106 545042496 556101151 568121681 579873657 590461044 599402466 606609612 612272263
1300 612272263 616687393 620076790 622446251 623525505 622808685 619694481 613704491 604735413 593279686
1309 593279686 580532608 568312073 558759422 553870163 554983215 562403259 575302544 591948967
1317 591948967 610179138 627940025 643712006 656698914 666780167 674311295 679886169 684138565
1325 684138565 687610397 690677414 693516541 696112976 698301010 699824371 700386200 699679413 697412949
1334 697412949 693383408 687619934 680567932 673206940 666974335 663446579 663853683 668629074 677212906
1343 677212906 688218918 699902344 710713501 719693756 726571198 731578369 735142288 737626572
1351 737626572 739227600 740013428 740018005 739295883 737900848 735813217 732875900 728792419 723205032
1360 723205032 715837708 706668472 696074753 684891510 674330597 665741806 660265656 658487244
1368 658487244 660231705 664597321 670226212 675701599 679907913 682226257 682522125 680997543 678014984
1377 678014984 673982162 669315414 664437256 659760208 655634766 652289963 649807663 648152390 647241364
1386 647241364 647011261 647448120 648568726 650374146 652806015 655721664 658901596 662078934 664988708
1395 664988708 667415466 669229813 670391312 670918655 670840912 670163040 668864975 666934128 664403381
1404 664403381 661358337 657907791 654135132 650073624 645723419 641097717 636256981 631299553 626312637
1413 626312637 621329727 616337051 611342583 606467514 601996422 598341522 595929756 595063553 595825119
1422 595825119 598061028 601443558 605576820 610100975 614764519 619444542 624114456 628767471 633331337
1431 633331337 637618103 641344833 644228439 646104965 647007446 647148132 646815262 646244583 645540390
1440 645540390 644676590 643555374 642057114 640050125 637372551 633844910 629350052 623953094 617974052
1449 617974052 611934738 606370811 601607018 597627945 594135056 590756874 587279739 583754807 580422554
1458 580422554 577523956 575141602 573183136 571511154 570117416 569206772 569127808 570186958 572471695
1467 572471695 575786057 579734840 583893013 587958488 591808815 595454788 598939743 602255440 605319328
1476 605319328 608013725 610254478 612047920 613509941 614841423 616272697 617999725 620130882 622661133
1485 622661133 625478745 628403397 631248436 633895569 636362305 638838425 641665955 645255814 649961929
1494 649961929 655962143 663200989 671416550 680229645 689231110 698018036 706176987 713271637 718896713
1503 718896713 722813721 725095062 726171951 726710205 727359161 728501816 730154800 732069016 733949509
1512 733949509 735640717 737162094 738596115 739943695 741071701 741791763 742002106 741773224 741316910
1521 741316910 740871658 740601807 740576096 740814667 741328278 742100449 743034515 743942032 744627762 745033340
1531 745033340 745322189 745810013 746751251 748116608 749528122 750420303 750342407 749212341 747362976
1540 747362976 745367584 743760452 742828293 742562790 742759323 743161774 743568878 743885651 744134521 744450684
1550 744450684 745034637 746041718 747432022 748869629 749774704 749555206 747924347 745120316 741877594
1559 741877594 739136276 737628098 737559738 738554382 739870377 740765686 740819855 740066528 738898163 737813644
1569 737813644 737148895 736913071 736806335 736395874 735355682 733634949 731463165 729190521 727070389
1578 727070389 725128708 723212128 721176758 719079666 717216110 715959320 715504990 715699997 716081696
1587 716081696 716105652 715402527 713889618 711676712 708864517 705412674 701195526 696211777 690789413
1596 690789413 685616913 681548615 679280090 679067078 680628357 683258438 686072388 688268051 689319382
1605 689319382 689064713 687690659 685616989 683310776 681084900 678965302 676704102 673940811 670431519
1614 670431519 666208572 661572266 656920166 652524338 648394394 644304581 639943581 635080376 629643021
1623 629643021 623690109 617325058 610633316 603664551 596435738 588902664 580897751 572086525 562012939
1632 562012939 550254211 536626320 521318092 504868050 487979240 471272774 455110092 439567299
1640 439567299 424550514 409970741 395884438 382561035 370488548 360353394 353004417 349374733
1648 349374733 350336723 356499901 368017693 384484711 404977531 428217506 452785873 477313919
1656 477313919 500612984 521756897 540146179 555550423 568094215 578156281 586191826 592557259
1664 592557259 597430115 600867958 602956352 603926086 604143295 603966866 603578072 602918968 601802788
1673 601802788 600127296 598034706 595881729 594019279 592518578 591036072 588919907 585503693 580405998
1682 580405998 573651657 565553818 556447296 546443710 535337906 522682419 507941933 490637970
1690 490637970 470449600 447313957 421566162 394095497 366399269 340415192 318105297 300924625
1698 300924625 289415531 283148308 281057701 282027092 285424995 291332703 300363445 313184280
1706 313184280 329991837 350187302 372368889 394603157 414820976 431173363 442254257 447184296
1714 447184296 445612221 437689705 424047432 405762863 384298592 361400833 338964615 318878708
1722 318878708 302862682 292301712 288096714 290558796 299389534 313769016 332542381 354447250
1730 354447250 378308678 403144112 428166962 452731590 476280556 498340874 518570023 536815491
1738 536815491 553138771 567774239 581033401 593195801 604430618 614779663 624196167 632618446
1746 632618446 640040207 646553574 652349548 657678528 662788849 667863388 672980499 678113022 683162766
1755 683162766 688015213 692585297 696838760 700785370 704461136 707912750 711199188 714391479 717559814
1764 717559814 720735245 723867874 726812134 729368515 731372452 732791214 733763657 734555664 735444107
1773 735444107 736596680 738015060 739566650 741080475 742435913 743597260 744587555 745442734 746194153
1782 746194153 746885986 747601547 748445816 749480820 750652771 751775665 752610474 753001328 752986221 752797852
1792 752797852 752743225 753032761 753662720 754427414 755046616 755326157 755255127 754992523 754766922 754761200 755042343
1803 755042343 755558701 756186371 756790924 757276001 757610397 757831268 758021927 758269272 758620377 759060059
1813 759060059 759529190 759971390 760376663 760787201 761261749 761825485 762447586 763064117 763623505 764114304
1823 764114304 764549637 764923096 765185394 765270767 765162277 764938889 764757538 764767685 765020294 765439758
1833 765439758 765890732 766286392 766656799 767115707 767746964 768496170 769159317 769486008 769335480 768775787
1843 768775787 768058701 767487411 767261581 767397232 767758179 768160553 768476715 768677063 768802109 768904114
1853 768904114 769003601 769085083 769122238 769109573 769079742 769097443 769236679 769544983 770008316 770531540 770954285
1864 770954285 771104965 770880280 770306702 769545441 768827972 768350525 768185883 768260498 768406296 768453522
1874 768453522 768308258 767977600 767539749 767094193 766721497 766472931 766371536 766412354 766553726 766711197
1884 766711197 766775818 766658783 766339722 765890045 765445251 765141602 765048447 765138855 765311890 765452194
1894 765452194 765485535 765403595 765246201 765068054 764912033 764805832 764771652 764829865 764985046 765203323 765405045
1905 765405045 765493240 765406723 765170135 764901505 764763794 764882889 765277939 765845337 766408081 766800003
1915 766800003 766936569 766836624 766592789 766314774 766084061 765939636 765889359 765926743 766037598 766193085
1925 766193085 766345520 766435394 766413269 766264038 766017761 765740662 765511703 765394974 765419922 765571365
1935 765571365 765791397 765991669 766076660 765976715 765677109 765231628 764746857 764339371 764085007 763984299
1945 763984299 763964081 763912659 763732681 763383865 762897186 762358932 761874924 761532745 761379089 761410675
1955 761410675 761585999 761842194 762117233 762365265 762564316 762713928 762827148 762920685 763008347 763097687
1965 763097687 763188705 763272552 763331528 763341217 763279724 763139801 762939453 762722397 762547684 762469711 762518387
1976 762518387 762689362 762945862 763233490 763497009 763699341 763830872 763910599 763976364 764067612 764206161
1986 764206161 764385681 764573059 764723892 764804993 764810486 764764099 764707031 764677887 764697113 764763718 764860611
1997 764860611 764967270 765066605 765147858 765203629 765227509 765213623 765159531 765070190 764958878 764846573 764756851
2008 764756851 764708786 764708023 764741745 764778442 764778748 764710922 764565735 764363480 764146118 763960495 763837891 763783722
2020 763783722 763779373 763793945 763798676 763776627 763723145 763643570 763547440 763447342 763358765 763296890 763275375 763299637
2032 763299637 763363342 763448257 763528595 763577728 763576584 763519516 763415298 763286285 763160248 763062439 763007278
2043 763007278 762992935 763003311 763013000 762997818 762944031 762852707 762739639 762628250 762540817 762490082 762474365 762478638
2055 762478638 762480392 762456589 762391052 762276993 762118149 761927185 761723251 761529465 761366196 761245728 761166687
2066 761166687 761112289 761056366 760975037 760858002 760715179 760573196 760463943 760410080 760416260 760467911 760539017
2077 760539017 760602798 760641556 760650711 760637207 760615692 760602722 760611725 760649872 760715790 760798721 760882339 760947113
2089 760947113 760978470 760970078 760928345 760869446 760815201 760784225 760786057 760816956 760862427 760902786 760921097 760909042
2101 760909042 760869217 760812149 760753098 760706406 760681381 760681610 760703278 760736847 760768661 760784836 760775070 760735931
2113 760735931 760673294 760599976 760532608 760486145 760467758 760475159 760496597 760514755 760514374 760486984 760435257 760370407
2125 760370407 760307159 760256805 760223770 760204468 760192032 760179901 760164948 760148697 760134506 760125275 760121689 760122147 760122986
2138 760122986 760120010 760110397 760094757 760077820 760068359 760076294 760108109 760162964 760231705 760298462 760347366 760366745 760354614
2151 760354614 760318985 760275116 760241241 760231628 760251541 760294800 760344925 760381012 760384979 760348816 760276871 760184479
2163 760184479 760090942 760012970 759959183 759928207 759910812 759892349 759858093 759798050 759709015 759598846 759482956
2174 759482956 759381027 759309845 759276123 759273224 759283600 759284744 759259262 759201508 759119720 759033127 758964081 758929520
2186 758929520 758935394 758974609 759030914 759084320 759117661 759120636 759092407 759041519 758982773 758933868 758909760 758916702
2198 758916702 758948746 758987885 759009018 758989105 758916092 758794174 758644562 758497696 758383865 758322449 758314819
2209 758314819 758344040 758379669 758389359 758349075 758252716 758113251 757957764 757816391 757712097 757652664 757630310
2220 757630310 757625122 757613220 757573471 757492752 757370224 757216492 757051468 756898193 756775894 756693115 756644287
2231 756644287 756612015 756573486 756509018 756409836 756281357 756141281 756013184 755917435 755863571 755846481 755848541
2242 755848541 755846634 755822067 755767059 755687256 755596848 755511322 755441818 755391846 755358582 755335541 755314026 755284348
2254 755284348 755237350 755166245 755069733 754953995 754830856 754713821 754611435 754524918 754447479 754369202 754282150
2265 754282150 754183884 754078293 753974075 753881378 753808365 753758392 753729477 753713531 753700409 753682556 753660202
2276 753660202 753645401 753657532 753714676 753822098 753963318 754101181 754190140 754192581 754095306 753912659 753679428
2287 753679428 753432541 753196945 752976761 752759171 752524796 752257233 751949615 751605072 751236496 750864029
2297 750864029 750511475 750199432 749934464 749702835 749469604 749189224 748819351 748334961 747732162 747027588
2307 747027588 746254501 745461197 744708328 744057999 743552170 743184128 742882538 742519455 741950226 741069107
2317 741069107 739858170 738403625 736872101 735453644 734291534 733427124 732779236 732175903 731426620
2326 731426620 730414352 729160538 727826233 726636200 725763855 725235901 724921188 724608383 724123535
2335 724123535 723404999 722483902 721397629 720118408 718584747 716841431 715194397 714238281 714673233
2344 714673233 716962738 721011353 726062927 730913696 734355774 735628967 734655609 731959305 728347855
2353 728347855 724552307 721008148 717843018 715017929 712485275 710268936 708447113 707088547 706208267
2362 706208267 705772781 705735626 706064377 706739197 707730865 708984146 710427322 711998749 713672409
2371 713672409 715461197 717399979 719518280 721822052 724287872 726868515 729500122 732108917 734617538
2380 734617538 736956024 739071045 740932159 742529373 743863144 744937515 745758438 746340332 746714249
2389 746714249 746929016 747044144 747117386 747192078 747290802 747414932 747549438 747669144 747747803 747766647 747723236
2400 747723236 747632599 747524261 747430801 747375259 747363892 747385483 747418060 747437439 747425079 747372589 747282715 747168045
2412 747168045 747049179 746947708 746880112 746850739 746850586 746860504 746860809 746839294 746795883 746740189 746684494 746637115
2424 746637115 746598816 746563950 746524811 746475906 746415100 746343384 746262360 746172485 746073151 745963898 745846329
2435 745846329 745725555 745608292 745501633 745410538 745335236 745272064 745215683 745162964 745114899 745077286 745057144
2446 745057144 745057220 745073624 745095520 745109024 745105133 745082397 745048904 745015945 744991226 744973755 744953690 744919052 744862289
2459 744862289 744786377 744702682 744625854 744565277 744520187 744480133 744430923 744361038 744267426 744154434 744031296
2470 744031296 743907166 743787842 743674927 743568192 743466263 743368530 743273163 743176041 743072052 742956009
2480 742956009 742825851 742685852 742545547 742416992 742310410 742228165 742163773 742103653 742033005 741940460 741824493
2491 741824493 741692123 741557312 741435089 741337128 741266479 741216965 741173859 741118011 741031723 740904694 740739365
2502 740739365 740551376 740365524 740208664 740099411 740041885 740022583 740014343 739986725 739916763 739798965 739649048
2513 739649048 739496918 739376755 739310684 739299850 739322891 739344254 739328766 739256058 739126968 738963089 738797760
2524 738797760 738663559 738583069 738562775 738593063 738650131 738704605 738728485 738704758 738632126 738527374 738418579
2535 738418579 738335724 738298721 738311005 738357010 738408661 738436203 738417664 738348312 738240433 738120651 738019180
2546 738019180 737960205 737951813 737984543 738033600 738068695 738065948 738015976 737926865 737820129 737722473 737654648 737625885
2558 737625885 737629776 737648010 737656403 737633591 737568512 737463074 737331924 737195740 737074890 736982040 736918564
2569 736918564 736875916 736838379 736788635 736713028 736604919 736466827 736309814 736150513 736006317 735890350 735804520
2580 735804520 735738983 735674744 735590591 735471497 735315552 735134659 734950943 734788361 734662857 734577942 734523315
2591 734523315 734479904 734426041 734344177 734226303 734075165 733903656 733730850 733574905 733447647 733348694 733266449
2602 733266449 733181686 733076859 732943039 732783737 732613144 732450104 732310104 732200928 732119827 732055130
2612 732055130 731990433 731909637 731802444 731669769 731524124 731386795 731279068 731212616 731183777 731174698 731162262
2623 731162262 731128845 731068039 730985565 730891953 730797119 730705261 730617828 730535660 730459747 730390854 730325089 730254059
2635 730254059 730169220 730067825 729956818 729852371 729771042 729722290 729702606 729697571 729687881 729659042 729606476 729535217
2647 729535217 729456635 729383698 729326782 729291992 729280548 729287567 729302292 729309845 729296494 729253998 729184723 729101944
2659 729101944 729025345 728972778 728952942 728961792 728983994 728998947 728989716 728947296 728874588 728782425 728687363 728605881
2671 728605881 728548889 728518906 728507843 728500366 728477554 728426132 728343277 728238449 728129120 728032455 727957001 727899017
2683 727899017 727845459 727779465 727689743 727574234 727440796 727301865 727169952 727051163 726945343 726846390 726746674
2694 726746674 726640320 726524658 726399612 726265259 726120911 725965500 725799942 725629272 725462646 725308914
2704 725308914 725171814 725047607 724924698 724789810 724633789 724455566 724261017 724058380 723852539 723644028
2714 723644028 723429184 723206482 722977371 722747269 722522049 722304993 722093201 721880035 721657486 721421509
2724 721421509 721174393 720924530 720682907 720457687 720250092 720052948 719853363 719638824 719403305 719149170
2734 719149170 718886719 718628082 718382950 718154068 717939911 717736893 717542572 717356720 717179794 717010193
2744 717010193 716844330 716677399 716505661 716329498 716151581 715975952 715804062 715632706 715455093 715263290
2754 715263290 715051956 714821548 714577637 714329681 714087296 713856735 713639450 713431244 713224945 713012314
2764 713012314 712786331 712544708 712289124 712024689 711757584 711491241 711224976 710953827 710671234 710371475
2774 710371475 710051880 709712677 709355621 708982468 708596954 708206787 707825623 707470856 707158813 706896820
2784 706896820 706678543 706486206 706297150 706094437 705873032 705641251 705414581 705207214 705026093 704867172
2794 704867172 704717712 704560471 704378967 704160385 703900452 703603134 703282089 702956390 702645950 702365189
2804 702365189 702118378 701899338 701694489 701488495 701271439 701041489 700806122 700578308 700372314 700197830
2814 700197830 700057907 699947281 699854736 699767227 699673004 699565201 699441223 699302902 699153900 698998718
2824 698998718 698840561 698680649 698515015 698335266 698128433 697883148 697595520 697272873 696933746 696600494
2834 696600494 696288452 695997162 695709534 695400314 695048141 694646378 694203796 693736496 693255844 692761078
2844 692761078 692240295 691678162 691067657 690413971 689732285 689040222 688350677 687669678 686999435 686342087
2854 686342087 685701523 685079422 684471817 683866272 683244019 682585602 681877365 681113358 680296478 679433594
2864 679433594 678534012 677607040 676661301 675703812 674739532 673772812 672806473 671846313 670901566 669983597
2874 669983597 669102173 668258209 667439880 666622238 665772705 664859314 663859100 662763138 661575241
2883 661575241 660307159 658970947 657573700 656115494 654590149 652990265 651310120 649549332 647712097
2892 647712097 645804825 643833542 641801529 639712334 637573586 635402336 633228760 631093788 629042282
2901 629042282 627113113 625331039 623704491 622227859 620888176 619670143 618558197 617533302 616571732
2910 616571732 615646439 614732704 613813324 612882347 611940727 610987892 610013504 608996811 607911682 606739426
2920 606739426 605478821 604151077 602793846 601451492 600163155 598955574 597843246 596831665 595924606
2929 595924606 595125732 594439583 593868790 593412552 593068428 592835197 592715950 592717781 592844849 593090515
2939 593090515 593430595 593822937 594216881 594567223 594845581 595046272 595180664 595263786 595303802 595294571 595219498
2950 595219498 595060959 594810410 594476089 594081955 593661957 593251343 592878342 592560043 592300720 592092438
2960 592092438 591917267 591748276 591553116 591296234 590944366 590469780 589853821 589086227 588162918 587083702
2970 587083702 585853043 584485626 583015862 581508064 580060501 578799820 577863770 577376366 577420883
2979 577420883 578021622 579139175 580683594 582538071 584588509 586744652 588948517 591168289 593385162
2988 593385162 595580788 597733269 599822960 601840858 603795166 605707359 607601967 609492722 611374969
2997 611374969 613225174 615009003 616691742 618248100 619665680 620946083 622102013 623155212 624131966
3006 624131966 625058784 625955429 626828537 627668457 628451004 629144249 629719009 630157242 630455360 630621910
3016 630621910 630672073 630620880 630479851 630257416 629959602 629591293 629156570 628657951 628099785 627491188
3026 627491188 626849174 626196823 625554771 624930496 624310455 623663940 622957306 622175026 621336899 620499992
3036 620499992 619742393 619135704 618715935 618466492 618320122 618179512 617945747 617544479 616940536 616136513
3046 616136513 615159760 614044342 612817078 611492271 610074196 608565292 606973267 605314293 603613014
3055 603613014 601897202 600194168 598525276 596901321 595318184 593754845 592176285 590540695 588812561
3064 588812561 586974754 585035324 583027077 580998840 579002342 577077827 575244484 573493919 571791954
3073 571791954 570085754 568316841 566437340 564423103 562280388 560040932 557748070 555443001 553154449
3082 553154449 550900688 548699150 546576920 544574471 542737617 541100121 539668617 538414993 537282448
3091 537282448 536200066 535100136 533928375 532647514 531234169 529677811 527981377 526167679 524281502
3100 524281502 522386627 520553894 518844757 517296524 515915413 514681702 513562698 512529755 511571236
3109 511571236 510698166 509937897 509323273 508878593 508609581 508501320 508522873 508637352 508812294 509028206
3119 509028206 509282265 509588394 509973412 510468788 511100349 511878662 512793579 513816719 514912758 516054192
3129 516054192 517233849 518466034 519777985 521193428 522717743 524331894 525996590 527663994 529290581
3138 529290581 530846252 532318954 533713570 535049400 536354485 537655983 538972130 540301743 541622276
3147 541622276 542894363 544074364 545128860 546046028 546837578 547532196 548162575 548752556 549308548
3156 549308548 549819260 550261574 550609741 550845108 550961571 550966415 550875397 550706558 550473557 550183220
3166 550183220 549835892 549428902 548959694 548427773 547833862 547178650 546464310 545695992 544885025 544048691
3176 544048691 543206673 542374573 541557999 540751457 539944458 539128380 538304749 537484207 536681404 535904846
3186 535904846 535150681 534401398 533632812 532821922 531953926 531025543 530043106 529018707 527965508 526893501
3196 526893501 525805779 524697342 523556557 522369766 521127434 519827271 518474045 517075005 515634041
3205 515634041 514149094 512614212 511023674 509376640 507676926 505930595 504141426 502309761 500433197
3214 500433197 498510246 496541824 494533081 492491684 490426292 488345871 486258049 484168854 482082863
3223 482082863 480005035 477943802 475913200 473932304 472020569 470190163 468440475 466759109 465129204
3232 465129204 463540497 461997910 460522385 459144821 457895088 456793938 455849152 455059624 454421616
3241 454421616 453935471 453608971 453456268 453494339 453738289 454198799 454881172 455788193 456921768 458284378
3251 458284378 459877777 461700974 463749390 466015129 468489227 471164093 474032135 477084122 480305939
3260 480305939 483678894 487182503 490798416 494511185 498306999 502167168 506064796 509964714 513829269
3269 513829269 517626457 521335335 524947853 528465729 531894646 535241699 538512955 541714211 544850388
3278 544850388 547924385 550935745 553880310 556751442 559541779 562245483 564858170 567377090 569800072
3287 569800072 572126617 574358978 576502228 578563004 580546265 582451439 584271584 585996170 587616501
3296 587616501 589130974 590546951 591877365 593132668 594314804 595414200 596413803 597297440 598059807
3305 598059807 598709946 599270477 599768906 600229034 600663452 601072769 601449089 601783867 602075081 602330017
3315 602330017 602564049 602794609 603033180 603280907 603527870 603757629 603953667 604105034 604208336 604266243
3325 604266243 604283333 604263649 604209824 604124222 604010506 603874207 603722458 603562737 603402023 603246307 603099632
3336 603099632 602962570 602830467 602693329 602537384 602349854 602123909 601862717 601577034 601280746 600982056
3346 600982056 600676575 600344963 599957809 599485474 598908653 598225365 597451439 596614075 595743332 594865761
3356 594865761 594001961 593168716 592382927 591663284 591027794 590490074 590054207 589714012 589454460 589258308
3366 589258308 589110985 589003067 588929710 588885574 588859329 588832245 588780861 588683510 588528900 588318100 588062706
3377 588062706 587776299 587467690 587137032 586781235 586399956 586000137 585595779 585201759 584828453 584480782
3387 584480782 584161339 583875885 583635101 583450432 583326569 583255539 583216820 583184700 583136749 583062248 582963409
3398 582963409 582851143 582738953 582635880 582543564 582455406 582359009 582240982 582091293 581907616 581697960
3408 581697960 581478348 581268997 581086998 580939636 580819893 580706596 580570831 580386620 580142632 579848785
3418 579848785 579535217 579241943 579003220 578835983 578735390 578680496 578645134 578609047 578563194 578509216 578456116
3429 578456116 578416023 578400650 578418045 578470612 578554115 578660965 578784904 578925934 579089165 579278793 579489937
3440 579489937 579705048 579899940 580058289 580183334 580301437 580450783 580662689 580945549 581282387 581641273
3450 581641273 581994171 582329788 582655449 582986412 583332291 583689384 584043083 584378281 584689674 584985466
3460 584985466 585282059 585594940 585931320 586288643 586659546 587036552 587415161 587792778 588165855 588531456
3470 588531456 588889809 589247437 589616623 590007515 590419998 590839272 591243858 591618156 591964989 592306213
3480 592306213 592669678 593071480 593504372 593943558 594364319 594760590 595149651 595559540 596008568 596493073
3490 596493073 596991425 597483940 597970123 598469353 599002724 599568520 600131302 600637321 601046257 601361847
3500 601361847 601635895 601941757 602334290 602818909 603352165 603871994 604337044 604749565 605150528 605591850
3510 605591850 606106606 606695938 607337570 608003540 608674965 609341888 609995651 610620766 611197815 611710625
3520 611710625 612154045 612535172 612867470 613167419 613455315 613761063 614124184 614581528 615149002 615805588
3530 615805588 616497841 617164955 617773972 618343430 618937378 619629707 620457497 621388321 622324295 623142090
3540 623142090 623751755 624143219 624393120 624629097 624965591 625448799 626040115 626649742 627198372 627670555
3550 627670555 628123093 628646202 629303131 630095367 630977020 631905403 632884407 633954010 635126495 636311150
3560 636311150 637297287 637829895 637751045 637122993 636248817 635559921 635427895 636002922 637168999 638631134
3570 638631134 640073776 641293106 642245483 643008957 643712921 644487762 645443115 646654053 648124161
3579 648124161 649737778 651245499 652330856 652751617 652487106 651794052 651117249 650889893 651331024
3588 651331024 652359848 653669052 654908295 655858307 656501389 656968079 657421875 657972260 658664398
3597 658664398 659523010 660588379 661897583 663422699 665021515 666456451 667489319 668000565 668059845
3606 668059845 667906418 667851944 668159485 668949661 670165710 671587753 672887878 673723297 673864365 673329010
3616 673329010 672456131 671847610 672144699 673714676 676390762 679437943 681804352 682574234 681404648
3625 681404648 678710785 675493774 672895126 671708069 672097778 673647385 675662460 677536316 678977661
3634 678977661 680023117 680900116 681869965 683142319 684850082 687018433 689484253 691819077 693369827
3643 693369827 693483582 691852875 688780365 685161514 682131500 680543823 680578232 681713257 683075943
3652 683075943 683942490 684084625 683781586 683548279 683804626 684701996 686162186 688021088 690115891
3661 690115891 692260056 694178162 695528641 696053619 695749893 694906845 693935089 693084259 692260513
3670 692260513 691096573 689251633 686731491 684000626 681799698 680790710 681261902 683060303 685743713
3679 685743713 688797531 691756134 694193420 695678940 695825119 694453506 691776199 688433609 685311813
3688 685311813 683212204 682552567 683258057 684878387 686829071 688608627 689897690 690550690 690557098
3697 690557098 690035324 689253235 688611679 688536835 689294510 690814743 692640533 694062958 694405746 693336258
3707 693336258 691046600 688210449 685723114 684345169 684413757 685750580 687792892 689863052 691430740
3716 691430740 692253647 692362518 691949692 691252747 690496063 689888916 689633179 689895935 690742874 692071533
3726 692071533 693586655 694845810 695370941 694802017 693060379 690465088 687737732 685827484 685565948
3735 685565948 687269211 690489883 694112473 696811752 697677765 696656952 694536972 692451096 691193237
3744 691193237 690770645 690479507 689451523 687308044 684481506 681996613 680859909 681462250 683375244
3753 683375244 685639572 687331161 688033600 687949524 687646713 687656326 688183517 689068756 689949951 690475998
3763 690475998 690444870 689837036 688788528 687553864 686463699 685849686 685930786 686702881 687905121 689106369
3773 689106369 689882736 689998169 689492187 688631897 687765961 687159653 686897049 686887360 686958237 686977081 686934052
3784 686934052 686942062 687159042 687679825 688471680 689395370 690300217 691119003 691882782 692634354 693304291
3794 693304291 693661194 693405838 692368164 690668945 688709717 686970901 685744476 684995422 684462585
3803 684462585 683933029 683481598 683479767 684344254 686194229 688667908 691047516 692618942 693030396 692414246
3813 692414246 691211166 689845734 688488846 687065430 685465012 683772583 682331619 681586609 681821289
3822 681821289 682978516 684682465 686444244 687909164 688992462 689832611 690611725 691369705 691925125
3831 691925125 691950760 691154099 689461365 687104645 684559326 682361832 680902786 680307312 680473404
3840 680473404 681240845 682573242 684609222 687506332 691146927 694898224 697636337 698116913 695561981
3849 695561981 690163879 683195801 676612854 672291183 671275482 673400803 677469177 681858139 685231094
3858 685231094 687001419 687367477 686986465 686517334 686286850 686216125 685979309 685265503 683991547 682371597
3868 682371597 680833054 679833832 679669724 680356369 681635895 683099976 684363632 685200729 685572128
3877 685572128 685557251 685250244 684707794 683975220 683149872 682398071 681890030 681688385 681686401 681669312 681474838
3888 681474838 681143417 680938950 681203003 682132339 683619690 685264587 686539383 687010956 686489334
3897 686489334 685053940 682982254 680651398 678457260 676753464 675792084 675666885 676290436 677429428
3906 677429428 678796692 680144119 681310272 682204285 682762527 682929153 682683487 682084885 681287994
3915 681287994 680499344 679896317 679558487 679454498 679487000 679559708 679623947 679682922 679759521 679853821 679919128
3926 679919128 679867477 679614792 679139404 678524780 677951355 677623978 677667542 678050156 678590317 679050369
3936 679050369 679258652 679183884 678918762 678596420 678306427 678068542 677858810 677651062 677431793 677190399
3946 677190399 676915207 676614838 676343002 676187439 676209412 676379242 676570435 676635513 676510086 676254654
3956 676254654 675994568 675808029 675666351 675485229 675233307 674989319 674876251 674928284 675024414 674969559
3966 674969559 674665070 674207993 673809128 673593521 673469009 673207397 672674255 671991348 671449509 671229553
3976 671229553 671196671 670994415 670386505 669527588 668856354 668656845 668689651 668308334 667051315 665186310
3986 665186310 663601761 662975464 662900009 661897888 658620453 653380585 648476944 646356125 646322479
3995 646322479 642092972 622600708 576646423 499306602 396326637
4000 396326637
##END=$$ End of the data block
