##TITLE=$$ Begin of the data block
##JCAMP-DX=5.00 $$ ACD/SpecManager v 10.08
##SPECTROMETER/DATA SYSTEM=16PC
##DATE=04 Jun 2013 13:22:36
##DATA TYPE=INFRARED SPECTRUM
##DATA CLASS=XYDATA
##ORIGIN=
##OWNER=
##NPOINTS=3601
##FIRSTX=400.00000000
##LASTX=4000.00000000
##MAXX=4000.00000000
##MINX=400.00000000
##MAXY=74.93430328
##MINY=1.86183202
##XFACTOR=1.0000000000
##YFACTOR=0.000000100000000
##FIRSTY=33.70529175
##DELTAX=1.00000000
##XUNITS=1/CM
##YUNITS=TRANSMITTANCE
##XYDATA=(X++(Y..Y))
400C37052917Q3932381O7703095M6374244K6419869J2525596O045685N220757O783676
$$ 337052917 420985298 488688393 535062637 561482506 574008102 580053787 585274544 592058220
408E92058220P886047P300492N435295L457946K263833J952438J994018J794625J163635
$$ 592058220 599944267 607244759 612680054 616138000 618401833 620354271 622348289 624142914 625306549
417F25306549L72047j61628k49787p8125l2310l78914j060944j754608k123527k066498
$$ 625306549 625678596 625516968 625267181 625189056 625156746 624777832 623716888 621962280 619838753 617772255
427F17772255j777191j594773j765670k299118k998200l620033m037438m290046m517327
$$ 617772255 615995064 614400291 612634621 610335503 607337303 603717270 599679832 595389786 590872459
436E90872459m844970n316391n905838o574822p315368q139916r040184r964714j0838280
$$ 590872459 586027489 580711098 574805260 568230438 560915070 552775154 543734970 533770256 522931976
445E22931976j1606102j2257309j2792892j3155823j3182030j2618560j1223908q888168
$$ 522931976 511325874 499068565 486275673 473119850 459937820 447319260 436095352 427207184
453D27207184n713959k001266J843299N427895Q461952J0787239J2362862J3236198
$$ 427207184 421493225 419491959 421335258 426763153 435225105 446012344 458375206 471611404
461D71611404J3518067J3361244J2929459J2358360J1722984J1037026J0286445R473343
$$ 471611404 485129471 498490715 511420174 523778534 535501518 546538544 556824989 566298332
469E66298332Q637848P836228P092323O363411N555115M585151L453217K264824J185455
$$ 566298332 574936180 582772408 589864731 596228142 601783257 606368408 609821625 612086449 613271904
478F13271904L46565k32239o56356j093941j682625k465706l395118m387742n387497
$$ 613271904 613618469 613386230 612729874 611635933 609953308 607487602 604092484 599704742 594317245
487E94317245o384925p386399q365669r241486r896698j0224914j0152741r621048
$$ 594317245 587932320 580545921 572180252 562938766 553042068 542817154 532664413 523043365
495E23043365q545303o805534m311371j124268K433205N773087Q178863R038239Q047905
$$ 523043365 514498062 507692528 503381157 502256889 504690094 510463181 518642044 527680283 535728188
504E35728188N277137J058503m209900j0199662j6611251k2966424k8388710l1574516
$$ 535728188 541005325 542063828 537853928 527654266 511043015 488076591 459687881 428113365
512D28113365l1084709k5900612j6000900k652168J1793174K4567833L3369332L7071914
$$ 428113365 397028656 371128044 355127144 352474976 364268150 388835983 422205315 459277229
520D59277229L5971031L1488572K5510940J9681626J4950180J1508598R045143P116509
$$ 459277229 495248260 526736832 552247772 571929398 586879578 598388176 607433319 614549828
528F14549828N427436L916016K669563J779290J240806R49402P59392N57136K93465
$$ 614549828 619977264 623893280 626562843 628342133 629582939 630532341 631291733 631848869 632142334
537F32142334k2850l53661o55975q91609j035195j085586j079064j089057j198769
$$ 632142334 632119484 631765823 631109848 630218239 629183044 628097458 627018394 625929337 624730568
546F24730568j459465j854210k301178k695808k972718l149528l326798l643264m221802
$$ 624730568 623271103 621416893 619115715 616419907 613447189 610297661 606970863 603327599 599105797
555E99105797n131684o383705p937965r696045j1466026j2922402j3610687j3035049
$$ 599105797 593974113 587590408 579652443 569956398 558490372 545567970 531957283 518922234
563E18922234j0825234o926269j711655M044075R355202J3305854J5317307J5294228
$$ 518922234 508097000 501170731 499459076 503503151 512858353 526164207 541481514 556775742
571E56775742J3601417J0895920P897339N184212L082122J660042Q00171L00522l5324
$$ 556775742 570377159 581273079 589170418 594354630 597436752 599096794 599896965 600197487 600162163
580F00162163l43132o81648j047402j406250j727447k002602k247086k487411k748528
$$ 600162163 599819031 599137383 598089981 596683731 594956284 592953682 590706596 588219185 585470657
589E85470657l053589l444328l996277m806328n937728p336007q769493r855003j0189705
$$ 585470657 582417068 578972740 574976463 570170135 564232407 556896400 548126907 538271904 528082199
598E28082199r549103q043937o129837m420700l374787l018150k875939k190666l44925
$$ 528082199 518533096 510489159 504359322 499938622 496563835 493545685 490669746 488479080 488134155
607D88134155K729607O394997R520797J0988770J0236358P552834L965874P73773j031303
$$ 488134155 490863762 497258759 506779556 517768326 528004684 535557518 539523392 540297165 539265862
616E39265862j158333n0164J418839K387924K348633J244965o55518k967987n324936
$$ 539265862 538107529 538057365 539476204 541864128 544212761 545457726 544802208 541834221 536509285
625E36509285p381058q748474q983269p705459m813881o68335L902969P826233J0155525
$$ 536509285 529128227 520379753 511396484 503691025 498877144 498208809 502111778 509938011 520093536
634E20093536J0420838Q783493N926742K747269M311j910019l006668l563347l923073
$$ 520093536 530514374 539297867 545224609 547971878 547976189 546066170 543059502 539496155 535573082
643E35573082m337807m910698n630188o440353p295265q178139r091682j0050545j1079483
$$ 535573082 531235275 526324577 520694389 514254036 506958771 498780632 489688950 479638405 468558922
652D68558922j2212067j3463936j4780578j5975151j6703911j6518059j4997444j1923676
$$ 468558922 456346855 442882919 428102341 412127190 395423279 378905220 363907776 351984100
660C51984100p421302j991044L592835Q488808J2021904J3846550J3989944J2768364
$$ 351984100 344562798 342571754 346164589 354653397 366675301 380521851 394511795 407280159
668D07280159J0638123Q050918N366821K836190O26564j146469k409172l137932l373452
$$ 407280159 417918282 425969200 431336021 434172211 434798775 433652306 431243134 428105202 424731750
677D24731750l223075k846985k436447k186127k263870k775536l735962n068130o646653
$$ 424731750 421508675 418661690 416225243 414039116 411775246 408999710 405263748 400195618 393548965
686C93548965q383789j0305404j2559357j5307503j8530655k1853389k4519673k5596256
$$ 393548965 385165176 374859772 362300415 346992912 328462257 306608868 282089195 256492939
694B56492939k4353943k0649280j5081654q794422k974911J708069N420532R037228
$$ 256492939 232138996 211489716 196408062 187613640 184638729 186346798 191767330 200804558
702B00804558J3606758J9674568K6830292L3730907L8613682M0040474L7509651L1642456
$$ 200804558 214411316 234085884 260916176 294647083 333260765 373301239 410810890 442453346
710D42453346K3886414J5914192R032707L858071L46336j923370l416100m429169n067939
$$ 442453346 466339760 482253952 491286659 495144730 495491066 493567696 490151596 485722427 480654488
719D80654488n344849n297699n040131m734535m523849m487458m632835m923859n307083
$$ 480654488 475309639 470011940 464971809 460237274 455713425 451225967 446593132 441669273 436362190
728D36362190n726967o127700o460877o703644o874504p027511p226754p511825p887039
$$ 436362190 430635223 424507523 418046646 411343002 404468498 397440987 390214233 382702408 374815369
737C74815369q343354q897438r603233j0510445j1579971j2614517j3273907j3204841
$$ 374815369 366472015 357574577 347971344 337460899 325880928 313266411 299992504 286787663
745B86787663j2238312j0549641q666325p288227o977005p868328r560833j1247482
$$ 286787663 274549351 263999710 255333385 248045158 241068153 233199825 223638992 212391510
753B12391510j2045746j1359405r109478n729027j948109J508084M155559N828533
$$ 212391510 200345764 188986359 179876881 174147854 172199745 173707829 177863388 183691921
761A83691921O599713O628456O040783M906063L298740J380329n70945k213269l256912
$$ 183691921 190291634 196920090 202960873 207866936 211165676 212546005 211975060 209761791 206504879
770B06504879l574677l250236k537384j754170j160964q79765q79784j020584j126022
$$ 206504879 202930202 199679966 197142582 195388412 194227448 193347683 192467899 191447315 190321293
779A90321293j051235p20501j33152O56490J567287K518235L448105M324722N142250
$$ 190321293 189270058 188549557 188416405 189072895 190640182 193158417 196606522 200931244 206073494
788B06073494N909023O626644P269345P775745Q059063Q040772P691555P065181O301594
$$ 206073494 211982517 218609161 225878506 233654251 241713314 249754086 257445641 264510822 270812416
797B70812416N597076N143757N068856N396690O049232O883450P743206Q501530R077224
$$ 270812416 276409492 281553249 286622105 292018795 298068027 304951477 312694683 321196213 330273437
806C30273437R426919R527130R363746Q936692Q266372P395172O365738N191040L836480
$$ 330273437 339700356 349227486 358591232 367527924 375794296 383189468 389555206 394746246 398582726
815C98582726K232589L28217j836891m076348o054802p349929p562104o434364l935738
$$ 398582726 400815315 401143532 399306641 395230293 389175491 381825562 374263458 367829094 363893356
824C63893356k87170M076118Q585282J2637481J5697632J7389565J7565956J6341400
$$ 363893356 363606186 367682304 376267586 388905067 404602699 421992264 439558220 455899620
832D55899620J4074135J1281776Q511925O194267M536553L495979K846375K306785
$$ 455899620 469973755 481255531 489767456 495961723 500498276 503994255 506840630 509147415
840E09147415J677551R25866J90391k94189l07350K60314J360283K803727M324836
$$ 509147415 510824966 511750832 511941223 511647034 511339684 511599998 512960281 515764008 520088844
849E20088844N657006O598243P041474O978416O476250N650024M631424L546639K500648
$$ 520088844 525745850 532344093 539385567 546363983 552840233 558490257 563121681 566668320 569168968
858E69168968J568337P89451J67847l25584p48368j169052j651001k230606k907524
$$ 569168968 570737305 571526756 571694603 571369019 570620651 569451599 567800598 565569992 562662468
867E62662468l650093m414940n174408n925789o676674p399330p981186q199882p754402
$$ 562662468 559012375 554597435 549423027 543497238 536820564 529421234 521440048 513240166 505485764
876E05485764o359139l868217l82615L716507P835274J1318283J3633423J4517250
$$ 505485764 499126625 495258408 494875793 498592300 506427574 517745857 531379280 545896530
884E45896530J4028626J2496605J0390625Q169441O164360M533081L281364K328530
$$ 545896530 559925156 572421761 582812386 590981827 597146187 601679268 604960632 607289162
892F07289162J577797R63897M64020Q3618j70555l09639l67355l90625m27094n14908
$$ 607289162 608866959 609830856 610294876 610378494 610207939 609898300 609530945 609140320 608713226 608198318
902F08198318o80122r38034j294517j737442k228432k697716l055344l222007l164940
$$ 608198318 607518196 606580162 605285645 603548203 601319771 598622055 595566711 592344704 589179764
911E89179764k924767k607422k341308k211304k203369k194519j999397j460648n37834
$$ 589179764 586254997 583647575 581306267 579094963 576891594 574697075 572697678 571237030 570699196
920E70699196O47812J844520K761078L180580L040238K444038J603508P42569J4038
$$ 570699196 571347008 573191528 575952606 579133186 582173424 584617462 586220970 586963539 586977577
929E86977577n35660r45739j287003j607590j911735k172356k367477k507324k638131
$$ 586977577 586441917 585496178 584209175 582601585 580689850 578517494 576150017 573642693 571004562
938E71004562k820320l092003l447990l839226m198723m475898m660416m785233m903335
$$ 571004562 568184242 565092239 561644249 557805023 553606300 549130402 544469986 539684753 534781418
947E34781418n056534n245438n414733n459328n245781m646797l579521k043152j46752
$$ 534781418 529724884 524479446 519064713 513605385 508359604 503712807 500133286 498090134 497943382
956D97943382J888047L759040N153733N841522N756836N032387L965530K914505K173347
$$ 497943382 499831429 503590469 508744202 514585724 520342560 525374947 529340477 532254982 534428329
965E34428329J871300J946907K199593K395553K366639K063942J543502R08890K51541
$$ 534428329 536299629 538246536 540446129 542841682 545208321 547272263 548815765 549724655 549976196
974E49976196l83148r88731j572991k142296k699928l257332l831634m421044m970207
$$ 549976196 549593048 548604317 547031326 544889030 542189102 538931770 535100136 530679092 525708885
983E25708885n352707n401230m979095m063835k792854j438485l17497L18832L59345
$$ 525708885 520356178 514954948 509975853 505912018 503119164 501680679 501363182 501682014 502041359
992E02041359j57852j098633k300453l614540m902459o010360o759987o982842o592140
$$ 502041359 501883507 500784874 498484421 494869881 489967422 483957062 477197075 470214233 463622093
1001D63622093n648308m372902l086433k098465j597633j598091j965332k499047l029976
$$ 463622093 457973785 453600883 450514450 448415985 446818352 445220261 443254929 440755882 437725906
1010D37725906l480186l870468m279366m788055n436745o208763p041817p855110q578491
$$ 437725906 434245720 430375252 426095886 421307831 415871086 409662323 402620506 394765396 386186905
1019C86186905r171105r617462r899215r947701r602737q609467o683616l633004M97151
$$ 386186905 377015800 367398338 357499123 347551422 337948685 329339218 322655602 319022598 319519749
1028C19519749N334987J0203171J4275131J6818390J7427521J6153030J3464852J0072899
$$ 319519749 324854736 335057907 349333038 366151428 383578949 399731979 413196831 423269730
1036D23269730O685295L807831J655578J91803p58285j384392j818466k125473k336808
$$ 423269730 429955025 433762856 435418434 435610237 434851952 433467560 431649094 429523621 427186813
1045D27186813k485122k620774k795753l044396l368530l745193m143792m544601m944229
$$ 427186813 424701691 422080917 419285164 416240768 412872238 409127045 404983253 400438652 395494423
1054C95494423n348511n763435o186829o612129p033501p452430p876702q317222q782730
$$ 395494423 390145912 384382477 378195648 371583519 364550018 357097588 349220886 340903664 332120934
1063C32120934r278412r808197j0374680j0980129j1620464j2281914j2939968j3563118
$$ 332120934 322842522 313034325 302659645 291679516 280059052 267777138 254837170 241274052
1071B41274052j4121094j4588471j4947547j5181332j5268936j5180655j4880466j4336996
$$ 241274052 227152958 212564487 197616940 182435608 167166672 151986017 137105551 122768555
1079A22768555j3534499j2484846j1230631r840273q394933o970873n624948m387216
$$ 122768555 109234056 96749210 85518579 75678306 67283373 60312500 54687552 50300336
1087E0300336l263688k246528j328454n09648K02865Q09498J336723J853351K474942
$$ 50300336 47036648 44790120 43461666 42952018 43154883 43964381 45301104 47154455 49629397
1096D9629397L349748M624500O398230Q670211J1303887J4023094J6453581J8215456
$$ 49629397 52979145 57603645 64001875 72672086 83975973 97999067 114452648 132668104
1104A32668104J9044104J8897247J8002873J6808948J5833149J5463791J5785561J6517810
$$ 132668104 151712208 170609455 188612328 205421276 221254425 236718216 252503777 269021587
1112B69021587J7102223J6919250J5551510J2980175R634705O269302L716545K618752
$$ 269021587 286123810 303043060 318594570 331574745 341209450 347478752 351195297 353814049
1120C53814049L233108N374260Q499146J1880836J4812432J6766891J7484551J6974029
$$ 353814049 357047157 362421417 370920563 382801399 397613831 414380722 431865273 448839302
1128D48839302J5447273J3217087J0591354P802544M983559K195549n17655l079986
$$ 448839302 464286575 477503662 488095016 495897560 500881119 503076668 502559013 499479027
1136D99479027n367470p233047q552018r260482r360695q896218p917785o471634m623680
$$ 499479027 494111557 486878510 478326492 469066010 459705315 450809097 442891312 436419678 431795998
1145D31795998k502747l29704J601410K998275L668290L592376K932053J962433R59587
$$ 431795998 429293251 428963547 430564957 433563232 437231522 440823898 443755951 445718384 446677971
1154D46677971J01585n77163j155053j748046k429963l191604l957558m640274n195274
$$ 446677971 446779556 446202393 445047340 443299294 440869331 437677727 433720169 429079895 423884621
1163D23884621n638771o019402o357078o601601o638985o366005n798759n144425m777488
$$ 423884621 418245850 412226448 405869370 399267769 392628784 386262779 380464020 375319595 370542107
1172C70542107n095177o297340q200074j0195999j1421165j1088810q848515m998684
$$ 370542107 365446930 359149590 350949516 340753517 329332352 318243542 309395027 304396343
1180C04396343m32224L681183O337414P065982O056366L999482J738319r1362j261902
$$ 304396343 303964119 307645302 313982716 321048698 327105064 331104546 332842865 332751503 331489601
1189C31489601j934891k465973l171920m178028n407772o680909p836780q811569r632149
$$ 331489601 329554710 327088737 323916817 319738789 314331017 307650108 299813328 291001759 281369610
1198B81369610j0364857j1057167j1716633j2329159j2886142j3400860j3895798j4376430
$$ 281369610 271004753 259947586 248230953 235901794 223015652 209614792 195718994 181342564
1206A81342564j4813214j5143537j5292769j5198736j4823761j4154663j3194213j1958051
$$ 181342564 166529350 151385813 136093044 120894308 106070547 91915884 78721671 66763620
1214F6763620j0480909q824735p080359n354967l748443k330935j128896j28638P11097
$$ 66763620 56282711 47457976 40377617 35022650 31274207 28943272 27814376 27685738 28396835
1223B8396835J443622K126039K814338L564141M425430N435834O611047P939972R387942
$$ 28396835 29840457 31966496 34780834 38344975 42770405 48206239 54817286 62757258 72145200
1232G2145200J0901646J2415677J3854389J5134201J6169214J6887569J7255803J7298851
$$ 72145200 83046846 95462523 109316912 124451113 140620327 157507896 174763699 192062550
1240A92062550J7104511J6800613J6514473J6326714J6247196J6220531J6157208J5969601
$$ 192062550 209167061 225967674 242482147 258808861 275056057 291276588 307433796 323403397
1248C23403397J5591812J4978256J4088860J2885055J1348457R505196P435875N241280
$$ 323403397 338995209 353973465 368062325 380947380 392295837 401801033 409236908 414478188
1256D14478188K974968N76591k130203n351258r168510j3394890j7534256k0890083
$$ 414478188 417453156 418029747 415899544 410548286 401379776 387984886 370450630 349560547
1264C49560547k2792053k2840577k1040210j7767296j3591824r064674m587746m20971
$$ 349560547 326768494 303927917 282887707 265120411 251528587 242463913 237876167 237455196
1272B37455196L208199N994949P548657P507457N717125K364464k025738o734237j1059551
$$ 237455196 240663395 246658344 254207001 261714458 267431583 269796047 267770309 261036072 249976521
1281B49976521j4496270j6797352j7921733j7924424j6868648j4806519j1818285q070640
$$ 249976521 235480251 218682899 200761166 182836742 165968094 151161575 139343290 131272650
1289A31272650l842097M99630M555741P961826J0441933J1846046J2175865J1592179
$$ 131272650 127430553 127930183 132485924 140447750 150889683 162735729 174911594 186503773
1297A86503773J0388374Q917255P477284O198196M983483L546467J547794j225472
$$ 186503773 196892147 205809402 213286686 219484882 224468365 228014832 229562626 228337154
1305B28337154m708442q508587j1976147j4368839j5045681j3625107j0066624m671316
$$ 228337154 223628712 215120125 203143978 188775139 173729458 160104351 150037727 145366411
1313A45366411J979466R120760J5917854K1586971K5513859K7359200K7121620K5138931
$$ 145366411 147345877 156466637 172384491 193971462 219485321 246844521 273966141 299105072
1321B99105072K2009277J8444138J5093002J2387963J0462303R162788Q143730O998558
$$ 299105072 321114349 339558487 354651489 367039452 377501755 386664543 394808273 401806831
1329D01806831N374604L044204p5302l911056q212014j2510032j6103096j8122139
$$ 401806831 407181435 410225639 410150337 406239281 398027267 385517235 369414139 351292000
1337C51292000j7718430j4342689q019543N13687R905491J8520546K4899330K8165856
$$ 351292000 333573570 319230881 311211338 311725025 321630516 340151062 365050392 393216248
1345C93216248K8224906K5680008K1529007J6786499J2192307Q100128M544067J393967
$$ 393216248 421441154 447121162 468650169 485436668 497628975 505729103 510273170 511667137
1353E11667137j503410m264946o987801r789810j2806015j6116333j9631538k3001404
$$ 511667137 510163727 505898781 498910980 489121170 476315155 460198822 440567284 417565880
1361D17565880k5618897k6742782k5721512k2240810j6499749r243965j626167N069465
$$ 417565880 391946983 365204201 339482689 317241879 300742130 291498165 289871998 294941463
1369B94941463R751091J1790047J1145802Q318786M157257m01001m556770p783012
$$ 294941463 304692554 316482601 327628403 335947189 340104446 339703445 335146675 327363663
1377C27363663r845753j0741997j0610294r657784q123607o261292m321441k514573
$$ 327363663 317517910 306775913 296165619 286507835 278384228 272122936 267801495 265286922
1385B65286922r68780K96478J360226K344341L340626M352302N278092N949535O195736
$$ 265286922 264318142 264614620 265974846 268319187 271659813 276012115 281290207 287239742 293435478
1394B93435478N912400N097312L846226K315560O74648r35440k416973l718224m820213
$$ 293435478 299347878 304445190 308291416 310606976 311281624 310346184 307929211 304210987 299390774
1403B99390774n727387o458664p042045p508888p884999q182220q396359q509102q498783
$$ 299390774 293663387 287204723 280162678 272653790 264768791 256586571 248190212 239681110 231182327
1412B31182327q346233q038044p560806o893158o004372m864254l463783j837273p3700
$$ 231182327 222836094 214798050 207237244 200344086 194339714 189475460 186011677 184174404 184100704
1421A84100704J694946L323842M696388N752888O494941O965390P213497P265319P117978
$$ 184100704 185795650 189119492 193815880 199568768 206063709 213029099 220242596 227507915 234625893
1430B34625893O752643O162434N370655M430694L408089K358093J312828K87667p04708
$$ 234625893 241378536 247540970 252911625 257342319 260750408 263108501 264421329 264708996 264004288
1439B64004288j644459k511234l305188m064312m859581n757045o767159p803669q687916
$$ 264004288 262359829 259848595 256543407 252479095 247619514 241862469 235095310 227291641 218603725
1448B18603725r203109r178124q564663p463722o094913m718457l551616k715016k222042
$$ 218603725 209400616 200222492 191657829 184194107 178099194 173380737 169829121 167114105 164892063
1457A64892063k007885j963844j969519j907291j673451j195917m56610M95034J548567
$$ 164892063 162884178 160920334 158950815 157043524 155370073 154174156 153717546 154212580 155761147
1466A55761147K570629L451538M141865M652748N026588N291367N436687N419254N199185
$$ 155761147 158331776 161783314 165925179 170577927 175604515 180895882 186332569 191751823 196951008
1475A96951008M775200M201774L571873K985992K525597K248783K200470K418556K916394
$$ 196951008 201726208 205927982 209499855 212485847 215011444 217260227 219460697 221879253 224795647
1484B24795647L647880M482136N220394N670147N750542N578537N478134N888386P196006
$$ 224795647 228443527 232925663 238146057 243816204 249566746 255145283 260623417 266511803 273707809
1493B73707809R559899J2803478J6427898J9742852K2068710K2934456K2206268K0109101
$$ 273707809 283267708 296071186 312499084 332241936 354310646 377245102 399451370 419560471
1501D19560471J7144203J3936653J1061325Q902550P580795O965790O762314O637611
$$ 419560471 436704674 450641327 461702652 470605202 478185997 485151787 491914101 498551712
1509D98551712O337700N756493M937362M014626L134422K389641J800270J334953R55162
$$ 498551712 504889412 510645905 515583267 519597893 522732315 525121956 526922226 528257179 529212341
1518E29212341O53916M64134M38156O08368R54514J392021J791801K023735K005234
$$ 529212341 529866257 530330391 530768547 531376915 532331429 533723450 535515251 537538986 539544220
1527E39544220J739349J318131Q88595N87349M73366M88777M77677K59323k72713j073685
$$ 539544220 541283569 542601700 543490295 544077644 544551010 545039787 545517464 545776787 545504074 544430389
1537E44430389j943283k597656k795830k453766j690979p81478l2921L45649L23906
$$ 544430389 542487106 539889450 537093620 534639854 532948875 532167397 532134476 532480125 532804031
1546E32804031M2572k73780m36058l83225k08969j11618k97394q72536j775322k774772
$$ 532804031 532846603 532572823 532136765 531753540 531544571 531432953 531135559 530263023 528487701 525712929
1556E25712929l543778l784828l363914k390099j200104k35214J43433j85547j046829
$$ 525712929 522169151 518384323 515020409 512630310 511430206 511194992 511338425 511152878 510106049
1565E10106049k056733k815322l102761k974167k700157k591820k817154l321266l897552
$$ 510106049 508049316 505233994 502131233 499157066 496456909 493865089 491047935 487726669 483829117
1574D83829117m351044m645424m920501n365448o033288o723747p040596o603126n295983
$$ 483829117 479478073 474832649 469912148 464546700 458513412 451789665 444749069 438145943 432849960
1583D32849960l401451j517792l02467j75819j157608k915535m980622o986732q778763
$$ 432849960 429448509 427930717 427628250 427452431 426294823 423379288 418398666 411411934 402633171
1592D02633171j0339470j1601600j2301293j1996727j0277367p049446k727775J802101
$$ 402633171 392293701 380692101 368390808 356394081 346116714 339067268 336339493 338141594
1600C38141594N463791P385940P229653N289268K331581p37152l214416m803391n613098
$$ 338141594 343605385 350991325 358220978 363510246 365841827 365104675 361890259 357086868 351473770
1609C51473770n993042o309852o779671p416039q085174q619557q914985q973141q885784
$$ 351473770 345480728 339170876 332391205 324975166 316889992 308270435 299355450 290382309 281496525
1618B81496525q780213q762760q886413r144783r488888r852429j0174427j0417652
$$ 281496525 272716312 263953552 255067139 245922356 236433468 226581039 216406612 205988960
1626B05988960j0576782j0679531j0775509j0914802j1121865j1373548j1595660j1679992
$$ 205988960 195412178 184732647 173957138 163042336 151920471 140546923 128951263 117271271
1634A17271271j1521664j1058769j0295763r303880q193054p074418o027565n085240
$$ 117271271 105749607 94690838 84395075 75091195 66898141 59823723 53796158 48710918
1642D8710918m240231l458252k690709j878581r48329J85900J609688L380287N495624
$$ 48710918 44470687 41012435 38321726 36443145 35494816 35680716 37290404 40670691 46166315
1651D6166315P873402J0351972J2717715J4749870J6266527J7159033J7399092J7024469
$$ 46166315 54039717 64391689 77109404 91859274 108125801 125284834 142683926 159708395
1659A59708395J6108541J4732285J2971134J0902558Q625660O277923M029122K047977
$$ 159708395 175816936 190549221 203520355 214422913 223048573 229326496 233355618 235403595
1667B35403595M51946p32708j578521k220345k792492l371258l957233m505634m985104
$$ 235403595 235855541 235122833 233544312 231323967 228531475 225160217 221202984 216697350 211712246
1676B11712246n426235n923920o589394p476787q534508r609794j0513812j1107215
$$ 211712246 206286011 200362091 193772697 186295910 177761402 168151608 157637796 146530581
1684A46530581j1361752j1359854j1238670j1109991j1002884j0857663j0566530j0033770
$$ 146530581 135168829 123808975 112570305 101460314 90457430 79599767 69033237 58999467
1692E8999467r219604q150301o899142n560050m225864k982104j902464j038909m02709
$$ 58999467 49779863 41629562 34730420 29170370 24944506 21962402 20059938 19021029 18618320
1701A8618320N0516M20457Q32491J393490K143786L030539L913889M599683M894199
$$ 18618320 18668836 19089293 19921784 21315274 23459060 26489599 30403488 35003171 39897370
1710C9897370M655800L837176K503147Q23130r59735k581787l816600m521811m663918
$$ 39897370 44553170 48390346 50893493 51716623 50756888 48175101 44358501 39836690 35172772
1719C5172772m309260l588212k649229j616432n65870M78117J532026K635126L828831
$$ 35172772 30863512 27275300 24626071 23009639 22443769 22921886 24453912 27089038 30917869
1728C0917869N138254O554842Q027830R465475J0754337J1788373J2502814J2892303
$$ 30917869 36056123 42610965 50638795 60104270 70858607 82646980 95149794 108042097
1736A08042097J3011866J2952900J2809476J2645932J2482500J2299919J2061157J1738091
$$ 108042097 121053963 134006863 146816339 159462271 171944771 184244690 196305847 208043938
1744B08043938J1330433J0872211J0421753J0043163R784718R665527R671803R765281
$$ 208043938 219374371 230246582 240668335 250711498 260496216 270161743 279833546 289598827
1752B89598827R897194J0021706J0104771J0125083J0074311R957199R792366R611931
$$ 289598827 299496021 309517727 319622498 329747581 339821892 349779091 359571457 369183388
1760C69183388R451904R337120R262428R184838R036407Q755036Q322334P785759P250328
$$ 369183388 378635292 387972412 397234840 406419678 415456085 424211121 432533455 440319214 447569542
1769D47569542O838608O637077O655083O816826O992569P052574O915817O577301O099396
$$ 447569542 454408150 461045227 467700310 474517136 481509705 488562279 495478096 502055397 508154793
1778E08154793N583839N132675M819756M673119M670677M745483M802666M748001M523773
$$ 508154793 513738632 518871307 523691063 528364182 533034859 537780342 542583008 547331009 551854782
1787E51854782M140358L684540L292274L092194L139000L377075L651848L776779L621216
$$ 551854782 555995140 559679680 562971954 566064148 569203148 572580223 576232071 580008850 583630066
1796E83630066L178596K577134K023925J711350J729202K032585K471199K869644L107529
$$ 583630066 586808662 589385796 591409721 593121071 594850273 596882858 599354057 602223701 605331230
1805F05331230L162460L098832L014946K982330L015137L076706L116378L106842L060570
$$ 605331230 608493690 611592522 614607468 617589798 620604935 623681641 626798019 629904861 632965431
1814F32965431L015404L007584L044586L102646L138427L114472L013000K841492K624817
$$ 632965431 635980835 638988419 642033005 645135651 648274078 651388550 654401550 657243042 659867859
1823F59867859K398910K203522K079086K056580K144547K314682K505188K641601K673950
$$ 659867859 662266769 664470291 666549377 668605957 670750504 673065186 675570374 678211975 680885925
1832F80885925K605057K493439K418136K428131K498551K534943K423629K104340J624145
$$ 680885925 683490982 685984421 688402557 690830688 693329239 695864182 698287811 700392151 702016296
1841G02016296J134415Q24661Q26645J141587J630706K080002K302170K221832J903687
$$ 702016296 703150711 703975372 704802017 705943604 707574310 709654312 711956482 714178314 716082001
1850G16082001J503372J184158J035614J044770J126632J185761J174164J109695J048965
$$ 716082001 717585373 718769531 719805145 720849915 721976547 723162308 724336472 725446167 726495132
1859G26495132J037751J072464J095886J029892Q25729M97589J23673j88599l52859
$$ 726495132 727532883 728605347 729701233 730731125 731556854 732054443 732178116 731989517 731636658
1868G31636658l45002k14004n9052J3047p0343l20587o89087j084977j406097j568222
$$ 731636658 731291656 731077652 731018600 731031647 730961304 730640717 729951630 728866653 727460556 725892334
1878G25892334j529236j301041r48104n72205k80456j50681k01111l79639n85022p03964
$$ 725892334 724363098 723062057 722113953 721541748 721261292 721110611 720909500 720529861 719944839 719240875
1888G19240875o60934m46778j21612K13623M61197N64270N22308L83682K17743Q7357
$$ 719240875 718579941 718133163 718011551 718225174 718686371 719250641 719772949 720156631 720374374 720461731
1898G20461731K8763M5547J11923J85700K25220K05459J33667N2643K9373J26419L68576
$$ 720461731 720490494 720536041 720647964 720833664 721058884 721264343 721398010 721450653 721480026 721606445 721975021
1909G21975021P20368J091690J372146J477662J392288J172790R20258P30209O49109
$$ 721975021 722695389 723787079 725159225 726636887 728029175 729201965 730122223 730852432 731501541
1918G31501541O59485P00531P07092O46286N29328L95660K84653K10495J58920J00403
$$ 731501541 732161026 732861557 733568649 734214935 734744263 735139923 735424576 735635071 735793991 735894394
1928G35894394J1291j08871k38953l47900m11072m24042m02908l75824l71628m07715
$$ 735894394 735905685 735796814 735557861 735209961 734798889 734374847 733971939 733596115 733224487 732816772
1938G32816772m83245n81208o76803p48978p95975q37097r09500j047821j262894j524505
$$ 732816772 732333527 731752319 731075516 730326538 729530563 728693466 727783966 726736145 725473251 723948746
1948G23948746j764832j896744j846618j584473j135178n69152K2964N59845R89304
$$ 723948746 722183914 720287170 718440552 716856079 715720901 715151749 715174713 715734558 716723862
1957G16723862J291046J469421J539994J519317J424179J272049J082688Q73870O57959
$$ 716723862 718014908 719484329 721024323 722543640 723967819 725239868 726322556 727196426 727854385
1966G27854385M38233K15149o027k04545l42941l77960k78854m4480K86179O44302
$$ 727854385 728292618 728507767 728501740 728297195 727954254 727576294 727297440 727252960 727539139 728183441
1976G28183441R54590J161957J251602J250229J208572J173401J164856J167145J142349
$$ 728183441 729138031 730299988 731551590 732801819 734010391 735183792 736348648 737515793 738658142
1985G38658142J054459Q95157O95343N14907M17023M38385N67551P50122R06067R66568
$$ 738658142 739712601 740607758 741303101 741818008 742235031 742673416 743240967 743991089 744897156 745863724
1995G45863724Q99811P24563M99573K96936J71661J39237J72348K16369K16294J41830
$$ 745863724 746763535 747488098 747987671 748284607 748456268 748595505 748767853 748984222 749200516 749342346
2005G49342346O87j67465l10517l90091l99093l63007l26767l31268l91159m89426
$$ 749342346 749343033 749175568 748865051 748474960 748075867 747712860 747386093 747054825 746663666 746174240
2015G46174240n83343o26450n89752m75693l17383j63269n6381j9379m3335r7503j41678
$$ 746174240 745590897 744964447 744374695 743899002 743581619 743418350 743361969 743342590 743299255 743201752 743060074
2026G43060074j44425r5520q316Q5526J52283J67846J29242N4550k6474q3618j01242
$$ 743060074 742915649 742820129 742811813 742897339 743049622 743217468 743346710 743401260 743374786 743291168 743189926
2037G43189926q2092m6082j9836k4262o4697j29318j95465k40326k51083k32544k03705
$$ 743189926 743107834 743061752 743041916 743017654 742952957 742823639 742628174 742387848 742136765 741904221 741700516
2048G41700516j89514k11106k75268l71704m77524n65949o18286o30951o17752o02341
$$ 741700516 741511002 741299896 741024628 740652924 740175400 739609451 738991165 738360214 737742462 737140121
2058G37140121o07757o45294p09610p78199q23822q23516p70646o77413n69840m76761
$$ 737140121 736532364 735887070 735177460 734399261 733575439 732751923 731981277 731303864 730734024 730257263
2068G30257263m19540m00696m06876m12445l91693l29284k25831r8495K7084J25122
$$ 730257263 729837723 729437027 729030151 728617706 728226013 727896729 727670898 727572403 727599487 727724609
2078G27724609J80741J93939J79062J57165J47858J59454J86081K11182K13852J80359
$$ 727724609 727905350 728099289 728278351 728435516 728583374 728742828 728928909 729140091 729353943 729534302
2088G29534302J10473J9379o8436j27411j43661j19247p1793k8153j0528k9450p6751
$$ 729534302 729644775 729664154 729595718 729468307 729324646 729205399 729133606 729105453 729094925 729065475 728988724
2099G28988724j31989j69449j70898j34811p6218k2278J679j8387p7820j53198k14615
$$ 728988724 728856735 728687286 728516388 728381577 728305359 728283081 728284760 728266373 728188553 728035355 727820740
2110G27820740k35901k08817j45187p3700k6550k5101p0267j41754k06604k35367k15072
$$ 727820740 727584839 727376022 727230835 727157135 727130585 727105484 727035217 726893463 726686859 726451492 726236420
2121G26236420j56327q8729m8218o0120j26724k26975l23562l80097l77578l21427
$$ 726236420 726080093 725991364 725943146 725883026 725756302 725529327 725205765 724825668 724448090 724126663
2131G24126663k40173j70670j41296j59073k05231k44674k41852j77536n9815Q0262
$$ 724126663 723886490 723715820 723574524 723415451 723210220 722965546 722723694 722546158 722486343 722566605
2141G22566605J99890K62146K52609J83029Q6823M348l5858k6397J5640N6915O4774
$$ 722566605 722766495 723028641 723281250 723464279 723551102 723555450 723519592 723493195 723508835 723565750 723630524
2152G23630524K0446p1182j83410k79541l28370l18069k62833j95312j53580j64184
$$ 723630524 723650970 723579788 723396378 723116837 722788467 722470398 722207565 722012253 721858673 721694489
2162G21694489k30408l30734m28696m89884m96444m54254l90854l39508l26310l56369
$$ 721694489 721464081 721133347 720704651 720214767 719718323 719264069 718873215 718533707 718207397 717851028
2172G17851028m12826m64401m81186m47464l70102k75345j96381j59149j69372k10953
$$ 717851028 717438202 716973801 716492615 716045151 715675049 715399704 715203323 715044174 714874802 714663849
2182G14663849k52304k60620k17667j27258j5641Q1788J34201J29470P8583R842m4250
$$ 714663849 714411545 714150925 713933258 713806000 713790359 713872147 714006348 714135818 714214401 714224243 714179993
2193G14179993o1875m2190m425K0370M502o3401j71966k92206l88184m33578m21295
$$ 714179993 714118118 714075928 714071503 714091873 714096375 714032974 713861008 713568802 713180618 712747040 712325745
2204G12325745l67661l03192k60086k57645k94342l49273l92075l97720l57666k85035
$$ 712325745 711958084 711654892 711394806 711137161 710842819 710493546 710101471 709703751 709346085 709061050
2214G09061050k08664j61056j65024k23083l17078m13971m82254n02396m77295m29382
$$ 709061050 708852386 708691330 708526306 708303223 707986145 707572174 707089920 706587524 706110229 705680847
2224G05680847l90320l87725m30451n04532n79300o20117o03561n29633m21524l15933
$$ 705680847 705290527 704902802 704472351 703967819 703388519 702768402 702164841 701635208 701213684 700897751
2234G00897751k47040k32010k64435l16085l50953l41110k78168j77688p1716N035
$$ 700897751 700650711 700418701 700154266 699838181 699487228 699146118 698867950 698690262 698618546 698623581
2244F98623581L0975P248m3869q8501r8190o3858m58N8975P9651M0512n4855j77612
$$ 698623581 698654556 698661804 698617935 698529434 698431244 698367386 698366928 698425903 698505554 698546066 698491211 698313599
2256F98313599k88163l51638l54309l06931k40021j89514j79520k12402k68021l13797
$$ 698313599 698025436 697673798 697319489 697012558 696772537 696583023 696403503 696191101 695923080 695609283
2266F95609283l17382k64511j64567m8599M2572P6447M2419m1504j35574j95618j91955
$$ 695609283 695291901 695027390 694862823 694814224 694856796 694933243 694975662 694934158 694798584 694602966 694411011
2277F94411011j23215j8005P7667J19781Q5450j7624j53885k78397l54309l69644l40958
$$ 694411011 694287796 694269791 694347458 694467239 694552689 694535065 694381180 694102783 693748474 693378830 693037872
2288F93037872l02810k92511l29285m06418m93545n50995n49622m84543l78723k71454
$$ 693037872 692735062 692442551 692113266 691706848 691213303 690662308 690112686 689628143 689249420 688977966
2298F88977966k00500j85166k18505k73362l17840l31269l13873k84195k67410k78702
$$ 688977966 688777466 688592300 688373795 688100433 687782593 687451324 687137451 686853256 686585846 686307144
2308F86307144l13797l46527l40652k67868j25885N2719K06680K68097J94626o180
$$ 686307144 685993347 685646820 685306168 685038300 684912415 684965134 685171814 685439911 685634537 685628357
2318F85628357k71759n05142o17905n73654m09317k19193j10244j45188l14255n40771
$$ 685628357 685356598 684851456 684233551 683659897 683250580 683031387 682921143 682775955 682461700 681920929
2328F81920929p27005q05512p69805o66352n59005m91562m77066n15290o19507q22143
$$ 681920929 681193924 680388412 679618607 678952255 678393250 677901688 677424622 676909332 676289825 675467682
2338F75467682j141358j529769j839676j850815j362610l14941J131897K615051L689194
$$ 675467682 674326324 672796555 670956879 669106064 667743454 667428513 668560410 671175461 674864655
2347F74864655M008026L466720K245713P25479o79169j679001k195740k334671k286224
$$ 674864655 678872681 682339401 684585114 685310593 684631424 682952423 680756683 678422012 676135788
2356F76135788k212677k181778k173538k130738k018203j846695j661072j504211j387787
$$ 676135788 673923111 671741333 669567795 667437057 665418854 663572159 661911087 660406876 659019089
2365F59019089j292115j181030j030655q40530o29425m20609k28729n4397J08490K66494
$$ 659019089 657726974 656545944 655515289 654674759 654045334 653624725 653395996 653341599 653450089 653716583
2375F53716583M21067N69381P07779Q31070R30176R89838R93194R29184Q03604O41785
$$ 653716583 654137650 654707031 655414810 656245880 657176056 658165894 659159088 660088272 660891876 661533661
2385F61533661M82407L62396L02200K97241L21350L40805L27988K73743J87073R2010
$$ 661533661 662016068 662378464 662680664 662977905 663299255 663640060 663968048 664241791 664428864 664520874
2395F64520874J2207l5629m9973m5166m3564o7749j29013k20718l19977l95584m22516
$$ 664520874 664533081 664497452 664447479 664402313 664358749 664291000 664161987 663941269 663621292 663225708 662803192
2406F62803192l92990l23181k44751j91345j84326k20490k76184l18375l21045k77404
$$ 662803192 662410202 662087021 661842270 661650925 661466599 661246109 660969925 660651550 660330505 660053101
2416F60053101k01798j24893p8278q0948j32675k13699k95258l51715l72314l66059
$$ 660053101 659851303 659726410 659648132 659567184 659434509 659220810 658925552 658573837 658201523 657835464
2426F57835464l56826l73001m33045n34668o53686p53022p95669p63092o61698n21087
$$ 657835464 657478638 657105637 656672592 656137924 655484238 654731216 653935547 653172455 652510757 651989670
2436F51989670l83301k82822k34222k27585k32925k16904j58081n5924O6453J75094
$$ 651989670 651606369 651323547 651089325 650861740 650628815 650411911 650253830 650197906 650264359 650439453
2446F50439453K38342K42081J95770J26801O9504M8675O7826J10092J43661J39542
$$ 650439453 650677795 650919876 651115646 651242447 651311951 651360626 651428452 651538544 651682205 651821747
2456F51821747Q4381j2055j20086k03018k34528k09351j47705q5220n8670q7814j68076
$$ 651821747 651906128 651894073 651773987 651570969 651336441 651127090 650979385 650894165 650835495 650747681 650579605
2467F50579605k72980l64151m11224m03214l54843k97775k65655k78855l34015m07180
$$ 650579605 650306625 649942474 649531250 649128036 648773193 648475418 648209763 647930908 647596893 647189713
2477F47189713m64325m78898m44183l75366l04566k62680k67944l16772l84827m40140
$$ 647189713 646725388 646246490 645802307 645426941 645122375 644859695 644591751 644274979 643890152 643450012
2487F43450012m55780m22897l53928k76642k22702k13623k52227l21808l93753m39301
$$ 643450012 642994232 642571335 642217407 641940765 641718063 641504440 641252213 640930405 640536652 640097351
2497F40097351m43916m10385l60489l22266l19061l57361m24843m94423n37300n35469
$$ 640097351 639653435 639243050 638882561 638560295 638241234 637883873 637459030 636964607 636427307 635891838
2507F35891838m88052m14276l41988k97699k93617l23525l66745l97110l95202l57972
$$ 635891838 635403786 634989510 634647522 634349823 634056206 633732681 633365936 632968826 632573624 632215652
2517F32215652k98538k41127k08854k13318k48032k91252l15208k99645k39487j50642
$$ 632215652 631917114 631675987 631467133 631253815 631005783 630714531 630399323 630099678 629860191 629709549
2527F29709549o0349K480K1362j526m7035q6479r6931o9848j5411M2572P8240P4043
$$ 629709549 629649200 629651680 629673042 629671516 629624481 629538002 629441071 629371223 629355812 629398384 629476624 629550667
2539F29550667L0403l6049r8648j32713j26229q3465k5711K1324L5629R804m6578j12075
$$ 629550667 629581070 629545021 629446373 629313660 629187431 629103966 629078255 629099579 629135208 629145012 629098434 628986359
2551F28986359j62773j83564j74217j49841j33362j45950j96343k77786l70064m47273
$$ 628986359 628823586 628640022 628465805 628315964 628182602 628036652 627840309 627562523 627192459 626745186
2561F26745186m90074m92325m64020m27437m06837m18854m63943n27573n84679o12144
$$ 626745186 626255112 625762787 625298767 624871330 624464493 624045639 623581696 623054123 622469444 621857300
2571F21857300n98450n50575m90685m47654m42467m79660n43556o05355o35681o18706
$$ 621857300 621258850 620708275 620217590 619769936 619327469 618847809 618304253 617698898 617063217 616444511
2581F16444511n58509m78325m08402l74450l85094m29840m84886n25170n35698n18493
$$ 616444511 615886002 615407677 614999275 614624825 614239731 613809891 613325005 612799835 612264137 611745644
2591F11745644m89808m72145m82635n25246n88646o51016o90041o92100o58150o02722
$$ 611745644 611255836 610783691 610301056 609775810 609187164 608536148 607846107 607154007 606495857 605893135
2601F05893135n46989n10407n01556n15290n35583n42374n22232m73251m08096l48549
$$ 605893135 605346146 604835739 604334183 603818893 603283310 602740936 602218704 601745453 601337357 600988808
2611F00988808l15857l21884l62244m19121m67148m85840m67529m22172l70674l35923
$$ 600988808 600672951 600351067 599988823 599569702 599102554 598616714 598149185 597727013 597356339 597020416
2621E97020416l30925l52668l83797m00696l85780l36685k67869k04505j70746j79177
$$ 597020416 596689491 596336823 595953026 595552330 595166550 594829865 594561996 594357491 594186745 594007568
2631E94007568k23999k85072l35159l52593l29017k73438k06146j51558j26877j35383
$$ 594007568 593783569 593498497 593163338 592810745 592481728 592208290 592002144 591850586 591723709 591588326
2641E91588326j66512k00882k17896k05726j64757j08757n7297k8915l2272o3096j05781
$$ 591588326 591421814 591220932 591003036 590797310 590632553 590523796 590466499 590437584 590405312 590342216 590236435
2652E90236435j41220j54152j41411j11694q3084p3128r1400j35117j89438k35595
$$ 590236435 590095215 589941063 589799652 589687958 589604874 589531746 589440346 589305229 589115791 588880196
2662E88880196k58522k54670k33383k11677k08016k31170k78740l36914l87421m16260
$$ 588880196 588621674 588367004 588133621 587921944 587713928 587482758 587204018 586867104 586479683 586063423
2672E86063423m17671l97987l70789l50723l47634l62663l88603m14162m28848m28009
$$ 586063423 585645752 585247765 584876976 584526253 584178619 583815956 583427353 583013191 582584343 582156334
2682E82156334m15077l99132l91998m02260m31976m75121n19981n54429n70869n70030
$$ 582156334 581741257 581342125 580950127 580547867 580115891 579640770 579120789 578566360 577995491 577425461
2692E77425461n60646n55496n66102n96389o41747o89812p27005p42950p37686p19147
$$ 577425461 576864815 576309319 575743217 575146828 574505081 573815269 573088264 572345314 571607628 570888481
2702E70888481p02705p01714p23038p64160q13484q56857q83942q92601q90426q90160
$$ 570888481 570185776 569484062 568761024 567996864 567183380 566326523 565442581 564549980 563659554 562769394
2712E62769394r03931r36928r85031j036644j077995j099052j098252j081733j060944
$$ 562769394 561865463 560928535 559943504 558906860 557828865 556729813 555631561 554549828 553488884
2721E53488884j046829j045189j054802j068382j076546j071282j051101j021309r91821
$$ 553488884 552442055 551396866 550342064 549273682 548197136 547125854 546074753 545053444 544061623
2730E44061623r74198r74960r93805j020889j041870j042138j013221r57604q86154
$$ 544061623 543087425 542112465 541118660 540097771 539055901 538013763 537000542 536042938 535156784
2739E35156784q15086p58820p23991p08428p03277o97785o86874o71845o61048o65741
$$ 535156784 534341698 533582878 532858887 532150459 531447182 530749397 530062523 529390678 528729630 528063889
2749E28063889o93436p44743q12035q81119r38225r72900r84154r79233r70268r68895
$$ 528063889 527370453 526625710 525813675 524932556 523994331 523021431 522037277 521058044 520087776 519118881
2759E19118881r81140j004448j029205j043778j040039j018638r89228r66873r65767
$$ 519118881 518137741 517133293 516104088 515060310 514020271 513001633 512012405 511045532 510079765
2768E10079765r93118j046982j117058j188774j249351j291733j315689j326065j328697
$$ 510079765 509086647 508039665 506922607 505733833 504484482 503192749 501877060 500550995 499222298
2777D99222298j326638j318092j297035j255684j188545j096497r88006q76694p79610
$$ 499222298 497895660 496577568 495280533 494024849 492836304 491739807 490751801 489875107 489095497
2786D89095497p09267o71768o62842o72645o88133p00417p06825p12280p25136p51305
$$ 489095497 488386230 487714462 487051620 486378975 485690842 484990425 484283600 483571320 482846184 482094879
2796D82094879p92007q40721q86612r19114r31549r25178r06792q85963q70018q61206
$$ 482094879 481302872 480462151 479575539 478656425 477724876 476799698 475892906 475006943 474136925 473275719
2806D73275719q55904q46596q25500p87811p34520o71158o06766n50194n08652m84542
$$ 473275719 472419815 471573219 470747719 469959908 469225388 468554230 467947464 467397270 466888618 466404076
2816D66404076m76189m79431m89197n02663n20057n44777n81169o32515o97670p71141
$$ 466404076 465927887 465448456 464959259 464456596 463936539 463391762 462810593 462178078 461480408 460709267
2826D60709267q44498r08928r59015r94911j021576j045418j072464j104965j140976
$$ 460709267 459864769 458955841 457996826 457001915 455980339 454934921 453862457 452757492 451616516
2835D51616516j176224j206817j230812j250382j269493j294174j328240j374549j431847
$$ 451616516 450440292 449233475 448002663 446752281 445482788 444188614 442860374 441485825 440053978
2844D40053978j497955j569176j642685j716652j790161j863403j936303k007980k076797
$$ 440053978 438556023 436986847 435344162 433627510 431837349 429973946 428037643 426029663 423952866
2853D23952866k140618k197723k248192k294350k339897k390404k449836k521019k603798
$$ 423952866 421812248 419614525 417366333 415071983 412732086 410341682 407891846 405370827 402767029
2862D02767029k694283k785911k868729k932701k967148k965202k923279k842789k730560
$$ 402767029 400072746 397286835 394418106 391485405 388518257 385553055 382629776 379786987 377056427
2871C77056427k597961k459755k333451k236175k182389k181587k235908k339287k480354
$$ 377056427 374458466 371998711 369665260 367429085 365246696 363065109 360829201 358489914 356009560
2880C56009560k643052k813720k979508l134155l274689l400955l514480l617516l711739
$$ 356009560 353366508 350552788 347573280 344439125 341164436 337763481 334249001 330631485 326919746
2889C26919746l799438l881931l959561m030781m091911m136715m156170m138508m072341
$$ 326919746 323120308 319238377 315278816 311248035 307156124 303019409 298863239 294724731 290652390
2898B90652390l946724l756867l506737l210182k889423k570744k276687k021904j809674
$$ 290652390 286705666 282948799 279442062 276231880 273342457 270771713 268495026 266473122 264663448
2907B64663448j634845j488591j363468j259060j179428j132564j125393j160412j235199
$$ 264663448 263028603 261540012 260176544 258917484 257738056 256605492 255480099 254319687 253084488
2916B53084488j341248j467399j599541j725044j831017j907711j948776j949997j909981
$$ 253084488 251743240 250275841 248676300 246951256 245120239 243212528 241263752 239313755 237403774
2925B37403774j829719j710911j558094j377792j181221r81122p90214o17523m64802
$$ 237403774 235574055 233863144 232305050 230927258 229746037 228764915 227974701 227357178 226892376
2934B26892376l27034j94778n9948P9479K15740L34034M15935M47140M22077L45822
$$ 226892376 226565342 226370564 226310616 226390095 226605835 226939869 227355804 227802944 228225021 228570843
2944B28570843K32792J00631l4427j61286k75097l74794m60414n30186n80540o05888
$$ 228570843 228803635 228904266 228869839 228708553 228433456 228058662 227598248 227068062 226487522 225881634
2954B25881634o02169n67475n04703m22154l33194k54841k06013k04964k64721l91254
$$ 225881634 225279465 224711990 224207287 223785133 223451939 223197098 222991085 222786121 222521400 222130146
2964B22130146n81036q20388j090184j367168j629753j858826k037601k148629k171382
$$ 222130146 221549110 220728722 219638538 218271370 216641617 214782791 212745190 210596561 208425179
2973B08425179k080822j851922j466140r21231k37445N39302J344471K107258K765064
$$ 208425179 206344357 204492435 203026295 202105064 201867619 202406921 203751392 205858650 208623714
2982B08623714L277474L630772L836841L923283L922958L866444L778076L678398L585892
$$ 208623714 211901188 215531960 219368801 223292084 227215042 231081486 234859562 238537960 242123852
2991B42123852L518371L490734L507748L561802L629417L678265L675346L597908L439274
$$ 242123852 245642223 249132957 252640705 256202507 259831924 263510189 267185535 270783443 274222717
3000B74222717L212433K943764K666550K410774K196560K030449J905937J806526J711636
$$ 274222717 277435150 280378914 283045464 285456238 287652798 289683247 291589184 293395710 295107346
3009B95107346J601047J460781J283398J070328Q29162N70755L06092M4841k06871
$$ 295107346 296708393 298169174 299452572 300522900 301352062 301922817 302228909 302273750 302066879
3018C02066879m44870o65817q67023j043454j189918j300221j370029j399746j397629
$$ 302066879 301622009 300956192 300089169 299045715 297855797 296555576 295185547 293785801 292388172
3027B92388172j379986j370124j391144j457920j567746j696682j802291j836491j762466
$$ 292388172 291008186 289638062 288246918 286788998 285221252 283524570 281722279 279885788 278123322
3036B78123322j571770j290837r77344p03831n34057n05619o20366q49208j146145
$$ 278123322 276551552 275260715 274283371 273579540 273045483 272539864 271919498 271070290 269924145
3045B69924145j465931j776409k062016k318649k546330k741794k895470k996426l036994
$$ 269924145 268458214 266681805 264619789 262301140 259754810 257013016 254117546 251121120 248084126
3054B48084126l017617k949581k852039k749043k664242k616443k615643k661533k742424
$$ 248084126 245066509 242116928 239264889 236515846 233851604 231235161 228619518 225957985 223215561
3063B23215561k838764k926541k983055k993221k952213k866879k753754k634506k531757
$$ 223215561 220376797 217450256 214467201 211473980 208521767 205654888 202901134 200266628 197734871
3072A97734871k462807k437191k453575k501488k564392k624569k669315k692337k693291
$$ 197734871 195272064 192834873 190381298 187879810 185315418 182690849 180021534 177329197 174635906
3081A74635906k672424k626114k544212k413960k226410j986103j713934j446123j223659
$$ 174635906 171963482 169337368 166793156 164379196 162152786 160166683 158452749 157006626 155782967
3090A55782967j080056j031513j073294j183195j331806j490135j635895j753435j831045
$$ 155782967 154702911 153671398 152598104 151414909 150083103 148592968 146957073 145203638 143372593
3099A43372593j858978j829577j742115j603975j433516j254167j087570r46064q28419
$$ 143372593 141513615 139684038 137941923 136337948 134904432 133650265 132562695 131616631 130788212
3108A30788212p22819o13460m88453l46107j94321m6969Q2665J87931K69966L37029
$$ 130788212 130065393 129451933 128963480 128617373 128423052 128376083 128458748 128646679 128916645 129253674
3118A29253674M00486M70228N53074O49910P57703Q69637R78870J080952J174936J264019
$$ 129253674 129654160 130124388 130677462 131327372 132085075 132954712 133933582 135014534 136189470 137453489
3128A37453489J353693J448546J549177J651077J745873J824245J879311J908254J913071
$$ 137453489 138807182 140255728 141804905 143455982 145201855 147026100 148905411 150813665 152726736
3137A52726736J898432J870193J834240J795979J760750J732921J714077J702423J690770
$$ 152726736 154625168 156495361 158329601 160125580 161886330 163619251 165333328 167035751 168726521
3146A68726521J669902J630268J566067J477871J370945J254463J138249J028595R27486
$$ 168726521 170396423 172026691 173592758 175070629 176441574 177696037 178834286 179862881 180790367
3155A80790367Q33416P41329O46515N44911M35600L19996K00786Q0872l8624j57451
$$ 180790367 181623783 182365112 183011627 183556538 183992138 184312134 184512920 184593792 184555168 184397717
3165A84397717k75860l92895n05791o10275p02210p79094q41599q91800r31930r62792
$$ 184397717 184121857 183728962 183223171 182612896 181910686 181131592 180289993 179398193 178466263 177503471
3175A77503471r83371r92585r90314r79233r63364r46216r29909r13982q97656q80260
$$ 177503471 176520100 175527515 174537201 173557968 172594604 171648388 170718479 169804497 168906841 168026581
3185A68026581q65040q56342q59070q74691r01890r35669r70898j004314j036015j068143
$$ 168026581 167161541 166305199 165446129 164571438 163669548 162733879 161762981 160758667 159722652 158654509
3195A58654509j104174j145458j192112j241465j291933j341238j389494j436367j482096
$$ 158654509 157550335 156404877 155212765 153971300 152679367 151338129 149948635 148512268 147030172
3204A47030172j525488j565227j600094j629581j655140j678725j703281j729784j757984
$$ 147030172 145504684 143939457 142339363 140709782 139054642 137375917 135672636 133942852 132184868
3213A32184868j785650j809931j827994j838321j840611j835565j823511j804762j778860
$$ 132184868 130399218 128589287 126761293 124922972 123082361 121246796 119423285 117618523 115839663
3222A15839663j745606j705074j657639j604337j545210j480675j411362j338148j262026
$$ 115839663 114094057 112388983 110731344 109127007 107581797 106101122 104689760 103351612 102089586
3231A02089586j184730j106100j025353r40208q48913p50390o45370n34716m19817
$$ 102089586 100904856 99798756 98773403 97833195 96984282 96233892 95588522 95053806 94633989
3240I4633989k99635j72519l6249J11179K68946M35428O07500P82538R60226J140899
$$ 94633989 94334354 94161835 94125586 94236765 94505711 94941139 95548639 96331177 97291403 98432302
3250I8432302J327305J522436J728182J945381K173501K410001K651778K895660L139000
$$ 98432302 99759607 101282043 103010225 104955606 107129107 109539108 112190886 115086546 118225546
3259A18225546L379822L616476L846674M068470M278478M475432M658203M827318M982729
$$ 118225546 121605368 125221844 129068518 133136988 137415466 141890898 146549101 151376419 156359148
3268A56359148N123205N245877N348053N427742N487365N532036N568905N603352N637645
$$ 156359148 161482353 166728230 172076283 177504025 182991390 188523426 194092331 199695683 205333328
3277B05333328N670414N697537N716629N726452N728111N722561N710392N690288N660534
$$ 205333328 211003742 216701279 222417908 228144360 233872471 239595032 245305424 250995712 256656246
3286B56656246N620957N572834N519142N461120N398522N328255N245513N146790N030346
$$ 256656246 262277203 267850037 273369179 278830299 284228821 289557076 294802589 299949379 304979725
3295C04979725M895763M743729M575481M392567M197426L995361L792992L596802L411064
$$ 304979725 309875488 314619217 319194698 323587265 327784691 331780052 335573044 339169846 342580910
3304C42580910L236274L070527K910537K757187K613411K485581K379608K297516K237358
$$ 342580910 345817184 348887711 351798248 354555435 357168846 359654427 362034035 364331551 366568909
3313C66568909K191963K154579K119217K084274K050324K019272J990699J961213J924819
$$ 366568909 368760872 370915451 373034668 375118942 377169266 379188538 381179237 383140450 385065269
3322C85065269J875458J808701J724205J626625J523933J426010J342774J281433J245193
$$ 385065269 386940727 388749428 390473633 392100258 393624191 395050201 396392975 397674408 398919601
3331C98919601J232644J237907J252289J267242J276779J278534J273804J265602J255303
$$ 398919601 400152245 401390152 402642441 403909683 405186462 406464996 407738800 409004402 410259705
3340D10259705J241226J218071J178474J116066J026917R09538P65076N95550M03710
$$ 410259705 411500931 412719002 413897476 415013542 416040459 416949997 417715073 418310623 418714333
3349D18714333J95503k1324k33078m24614n78766o80771p18384o83632n71594l81393
$$ 418714333 418909836 418888512 418655434 418230820 417652054 416971283 416252899 415569267 414997673 414616280
3359D14616280j17379K10305N84449R82819J380157J752358K077904K339668K524986
$$ 414616280 414498901 414709206 415293655 416276474 417656631 419408989 421486893 423826561 426351547
3368D26351547K626152K641983K578507K450332K276688K078056J870537J663437J458969
$$ 426351547 428977699 431619682 434198189 436648521 438925209 441003265 442873802 444537239 445996208
3377D45996208J256523J056786Q63724O85615N32646M14238L38898L12004L39394M24614
$$ 445996208 447252731 448309517 449173241 449858856 450391502 450805740 451144638 451456642 451796036 452220650
3387D52220650N66749P57408R77974J202202J400719J550484J638984J669655J655235
$$ 452220650 452787399 453544807 454522781 455724983 457125702 458676186 460315170 461984825 463640060
3396D63640060J613770J558571J496239J426315J345215J252288J151734J051750R60770
$$ 463640060 465253830 466812401 468308640 469734955 471080170 472332458 473484192 474535942 475496712
3405D75496712Q84704Q23479P75223P37114P06939O83556O63223O39038O02112N46074
$$ 475496712 476381416 477204895 477980118 478717232 479424171 480107727 480770950 481409988 482012100 482558174
3415D82558174M72641L91846L20396K74391K60621K74314L01438L25279L33977L25279
$$ 482558174 483030815 483422661 483743057 484017448 484278069 484552383 484853821 485179100 485513077 485838356
3425D85838356L05176K83546K69203K65732K72637K86216L02201L16848L28064L35122
$$ 485838356 486143532 486427078 486696281 486962013 487234650 487520866 487823067 488139915 488467979 488803101
3435D88803101L39088L41759L44810L47367L47213L41797L30315L17268L11890L23524
$$ 488803101 489142189 489483948 489828758 490176125 490523338 490865135 491195450 491512718 491824608 492148132
3445D92148132L57247M10042M70924N25207N61257N74264N66216N42984N12237M79317
$$ 492148132 492505379 492915421 493386345 493911552 494472809 495047073 495613289 496156273 496668510 497147827
3455D97147827M49562M27704M18091M21333M32778M43306M43534M30184M07944L87725
$$ 497147827 497597389 498025093 498443184 498864517 499297295 499740601 500184135 500614319 501022263 501409988
3465E01409988L80364L90320M13665M41628M66499M84734M97055N03502M99458M77524
$$ 501409988 501790352 502180672 502594337 503035965 503502464 503987198 504484253 504987755 505487213 505964737
3475E05964737M33998L74298L15704K78550K77519L10860L63159M12521M43840M54598
$$ 505964737 506398735 506773033 507088737 507367287 507644806 507955666 508318825 508731346 509175186 509629784
3485E09629784M54254M54025M57649M60358M54636M38652M20951M15268M29879M59137
$$ 509629784 510084038 510538063 510995712 511456070 511910706 512349358 512770309 513185577 513615456 514074593
3495E14074593M83894M81834M44031L80745L20396K90757L05671L54882M10995M46892
$$ 514074593 514558487 515040321 515484352 515865097 516185493 516476250 516781921 517136803 517547798 517994690
3505E17994690M49791M30107M12331M20189M62379N28374N95245O40984O55365O42357
$$ 517994690 518444481 518874588 519286919 519707108 520169487 520697861 521293106 521934090 522589455 523231812
3515E23231812O13250N78499N40581M95758M39186L72810L07007K59209K45857K78282
$$ 523231812 523845062 524423561 524964142 525459900 525899086 526271896 526578903 526838112 527083969 527362251
3525E27362251L55873M67301N90515O98318P64504P74994P35893O75125O34117O47202
$$ 527362251 527718124 528185425 528775940 529474258 530238762 531013756 531749649 532424774 533058891 533706093
3535E33706093P20329Q21838Q91839Q72535P42188N33981L25127J98669K01607L18298
$$ 533706093 534426422 535248260 536140099 537012634 537754822 538288803 538613930 538812599 539014206 539332504
3545E39332504M83284O19774O82678O79932O59180O69517P29561Q19168R02519R59740
$$ 539332504 539815788 540435562 541118240 541798172 542457352 543126869 543856430 544675598 545578117 546537857
3555E46537857J000252J048088J104813J125068J028481P48863K92854k31857o45561
$$ 546537857 547538109 548586197 549691010 550816078 551844559 552593422 552886276 552654419 552008858
3564E52008858p74308n35202J8349P14798J340485J725349J804810J625404J309853
$$ 552008858 551234550 550699348 550717697 551432495 552772980 554498329 556303139 557928543 559238396
3573E59238396J002006Q17795Q17299R90295J258507J492539J550064J332245Q40148
$$ 559238396 560240402 561058197 561875496 562865791 564124298 565616837 567166901 568499146 569339294
3582E69339294J96228l87954o95038o02036j40419N13535J119118J478233J514969
$$ 569339294 569535522 569147568 568452530 567850494 567710075 568223610 569342728 570820961 572335930
3591E72335930J290665R51118O52008M95758N11475O71043R19037J190720J418686
$$ 572335930 573626595 574577713 575229721 575725479 576236954 576907997 577827034 579017754 580436440
3600E80436440J533164J474534J218071P96394L05595j17073l41072k87132L4065N18074
$$ 580436440 581969604 583444138 584662209 585458603 585764198 585647125 585306053 585018921 585052986 585571060
3610E85571060R90868J259918J186714P55234J09749m69895o68296k83051O45027J794357
$$ 585571060 586561928 587821846 589008560 589763794 589873543 589403648 588735352 588452301 589097328 590891685
3620E90891685K665444K793693J980362M17557j364937k720222l165245k581406j242637
$$ 590891685 593557129 596350822 598331184 598748741 597383804 594663582 591498337 588916931 587674294
3629E87674294L34434J627769K313805K352486J937904J374588R45091Q22525J035004
$$ 587674294 588008728 589636497 591950302 594302788 596240692 597615280 598560371 599382896 600417900
3638F00417900J465416J882172J999626J579132N45616r32465k457275l533859l776207
$$ 600417900 601883316 603765488 605765114 607344246 607889862 606957397 604500122 600966263 597190056
3647E97190056l088570j722374j71661J047783J618767J536331J063652N74608L69796
$$ 597190056 594101486 592379112 592207451 593255234 594874001 596410332 597473984 598048592 598418388
3656E98418388N62477J068078J679306K164611K348862K155533J612282Q38470J0834
$$ 598418388 598980865 600048943 601728249 603892860 606241722 608397255 610009537 610848007 610858841
3665F10858841o92596j158486j385460j481857j599617j834030k145806k358856k244034
$$ 610858841 610166245 609007759 607622299 606140442 604540825 602706795 600560989 598202133 595958099
3674E95958099j643600n70870P75147K083435L044014L446236L215599K400779J143303
$$ 595958099 594314499 593743629 594518776 596602211 599646225 603092461 606308060 608708839 609852142
3683F09852142l45153j792222k892799l375168l094749k110939o94275P53364J843224
$$ 609852142 609506989 607714767 604821968 601446800 598352051 596241112 595546837 596300201 598143425
3692E98143425K329597K178116J539345O66771j74866p71370r87091p78923k16675
$$ 598143425 600473022 602651138 604190483 604857254 604682388 603911018 602923927 602145004 601928329
3701F01928329N06478J100311J264725Q18481j89323j456795k527504k977791k603416
$$ 601928329 602434807 603535118 604799843 605618324 605429001 603972206 601444702 598466911 595863495
3710E95863495j512833p7476J230697K031975K171631J737251R78279J79596m41436
$$ 595863495 594350662 594273186 595503883 597535858 599707489 601444740 602423019 602602615 602161179
3719F02161179p80487q29545o33621k54440K39410P53823J153030J264496R32503J04026
$$ 602161179 601380692 600551147 599917526 599663086 599902496 600656319 601809349 603073845 604006348 604110374
3729F04110374j091079k317238l115387l078690k059250k98194J613273K956658L204231
$$ 604110374 603019295 600702057 597586670 594507980 592448730 592150536 593763809 596720467 599924698
3738E99924698K277527N95360j126328k229118k433815j945725j290703r78698j195908
$$ 599924698 602202225 602797585 601671257 599442139 597008324 595062599 593771896 592793198 591597290
3747E91597290j709633k032699j744576p63359N88455J765824K306480K077866J325378
$$ 591597290 589887657 587854958 586110382 585347023 585935478 587701302 590007782 592085648 593411026
3756E93411026N06477K7542L6507L84026P49016Q35914N27763p8048p46269j224366
$$ 593411026 593917503 593945045 593981552 594365578 595114594 595950508 596478271 596400223 595653954 594429588
3766E94429588j345634j074410m97627K12212Q45566J210174J189652P91053J54763
$$ 594429588 593083954 592009544 591511917 591724129 592569695 593779869 594969521 595760574 595915337
3775E95915337m90876r21783j017952q09670m50744j23558N9089J03035J01128J54457
$$ 595915337 595424461 594502678 593484726 592675056 592224312 592100754 592159843 592262878 592364006 592518463
3785E92518463K97852M84390O27975O71425O21910N28946M26827K89879M3296l74221
$$ 592518463 592816315 593300705 593928680 594600105 595222015 595750961 596177788 596467667 596510963 596136742
3795E96136742r36661j511994j916008k014198j801262j402359r88350o61926l93562
$$ 596136742 595200081 593688087 591772079 589757881 587956619 586554260 585565910 584903984 584510422
3804E84510422n6305M63486J145134J802825K160874K006531J317710K88239p66716
$$ 584510422 584454117 584917603 586062737 587865562 590026436 592032967 593350677 593638916 592872200
3813E92872200j567574j990966k085533j985131j789551j497955j038246l66211M48074
$$ 592872200 591304626 589313660 587228127 585242996 583453445 581955490 580917244 580551033 580999107
3822E80999107J212998J704407J792984J520767J077385O78100M30489K73094K9488
$$ 580999107 582212105 583916512 585709496 587230263 588307648 588985748 589416237 589689331 589718819
3831E89718819m54216j180268j965027k522354k619247k202759j419868n20401K94418
$$ 589718819 589264603 588084335 586119308 583596954 580977707 578774948 577355080 576834679 577129097
3840E77129097R75189J607170K284317K953949L348580L072776J821061l82653l073654
$$ 577129097 578104286 579711456 581995773 584949722 588298302 591371078 593192139 592809486 589735832
3849E89735832n447197o660080o197014m126510j107636J867180L879357M446678L676300
$$ 589735832 584288635 577628555 571431541 567305031 566197395 568064575 571943932 576390610 580066910
3858E80066910K145538N88760m45861p97196o75697m66003m78325p84417j213111j481286
$$ 580066910 582212448 582801208 582355347 581558151 580882454 580416451 579938126 579153709 577940598 576459312
3868E76459312j370964q46786o5804P15256J261330J450195J292076Q90236L80898
$$ 576459312 575088348 574241562 574175758 574891014 576152344 577602539 578894615 579784851 580165749
3877E80165749j15891n14145p61375q35495p47605n48782l21274j55868j08795j69182
$$ 580165749 580049858 579535713 578774338 577938843 577191238 576642456 576321182 576165314 576056519 575887337
3887E75887337k53792k41280l6430L68843Q64639J252137J321373R45510J52474q71201
$$ 575887337 575633545 575392265 575355835 575724678 576589317 577841454 579162827 580108337 580260811 579389610
3897E79389610j840400k478524k616005k244148j497497n86930K81716R66110J401787
$$ 579389610 577549210 575070686 572454681 570210533 568713036 568126106 568407822 569373932 570775719
3906E70775719J585121J540756J304932R21554M48609l8796m61006p52182q77609q40721
$$ 570775719 572360840 573901596 575206528 576128082 576576691 576537895 576076889 575324707 574447098 573606377
3916E73606377o78902m49944k17704l5515O6414Q7967N3711l510o4621j35422k37312
$$ 573606377 572927475 572477531 572259827 572224312 572290726 572378693 572432404 572428894 572364273 572228851 571991539
3927E71991539l77960n25665o08063n47524l15895K8649L54614N18799M48455J83068
$$ 571991539 571613579 571087914 570479851 569932327 569616432 569645081 569999695 570518494 570966949 571150017
3937E71150017j44730l87916m68140m09660l08724k58674k89994l61366m04358l80402
$$ 571150017 571005287 570617371 570149231 569739571 569430847 569172173 568882179 568520813 568116455 567736053
3947E67736053l03192k19917j65215j35383j04103n8212k3766m7379j51176k99645
$$ 567736053 567432861 567212944 567047729 566912346 566808243 566750031 566726265 566678886 566527710 566228065
3957E66228065m13322m25720l37067k22320j72196k22854l22419l76396l30124k26059
$$ 566228065 565814743 565389023 565051956 564829636 564657440 564434586 564112167 563735771 563405647 563179588
3967E63179588j73340k54974m41017n95932n80406l77655j30272m3030k15034n38636
$$ 563179588 563006248 562751274 562310257 561714325 561133919 560756264 560625992 560582962 560367928 559829292
3977E59829292p63702o97632l87192j17912j98441o83746j270523j496696j136628
$$ 559829292 559065590 558367958 557980766 557862854 557664413 556980667 555710144 554213448 553076820
3986E53076820m80651k19307r29032k491455l954468m099159k508812m53873q60366
$$ 553076820 552596169 552376862 551447830 548956375 545001907 540902748 538393936 537940063 537079697
3995E37079697p076683k0921097m1064758o2816163p9668350
$$ 537079697 530003014 509081917 468017159 405200996 325532646
4000C25532646
$$ 325532646
##END=$$ End of the data block
