##TITLE=$$ Begin of the data block
##JCAMP-DX=5.00 $$ ACD/SpecManager v 10.08
##SPECTROMETER/DATA SYSTEM=16PC
##DATE=04 Jun 2013 10:15:36
##DATA TYPE=INFRARED SPECTRUM
##DATA CLASS=XYDATA
##ORIGIN=
##OWNER=
##NPOINTS=3601
##FIRSTX=400.00000000
##LASTX=4000.00000000
##MAXX=4000.00000000
##MINX=400.00000000
##MAXY=76.79664612
##MINY=8.39398003
##XFACTOR=1.0000000000
##YFACTOR=0.000000100000000
##FIRSTY=36.75894165
##DELTAX=1.00000000
##XUNITS=1/CM
##YUNITS=TRANSMITTANCE
##XYDATA=(X++(Y..Y))
400 367589417 460142174 532796860 580177040 604943047 615117531 619620514 624471321 631384048
408 631384048 638893204 644745102 647876587 648952026 649559021 650962296 653368149 656065598 658127060
417 658127060 659047089 658903961 658073044 656843185 655261841 653266830 650909119 648428574 646117020
426 646117020 644104919 642270813 640348434 638137703 635637550 632999916 630358086 627679291 624763260
435 624763260 621375732 617400017 612883759 607958870 602709312 597100296 591014252 584348907 577086716
444 577086716 569286385 561022835 552351112 543345642 534197311 525293884 517211151 510604858 506056519
453 506056519 503950195 504425735 507403984 512642059 519785271 528407860 538055191 548292313 558748589
462 558748589 569138184 579249573 588920898 598027000 606488838 614290619 621472778 628086319
470 628086319 634126282 639488831 643991089 647454605 649808731 651151810 651731796 651847534 651722870
479 651722870 651417542 650814056 649683380 647793350 645002365 641300201 636781540 631577187 625788002
488 625788002 619460373 612614632 605305786 597673302 589950256 582437172 575476494 569460258 564864349
497 564864349 562250328 562164612 564918861 570326424 577541847 585132065 591391945 594768295 594183807
506 594183807 589110031 579411469 565152206 546592636 524465446 500388527 477090340 458153496
514 458153496 447216301 446885872 457833748 478496361 505540314 534890366 562878799 587066040
522 587066040 606489296 621384163 632631416 641224823 647947388 653286362 657501144 660731430
530 660731430 663079453 664647980 665558090 665955276 666004944 665867004 665656357 665404129 665052185 664486389
540 664486389 663602142 662365646 660843048 659177017 657525177 655986633 654554291 653113785 651489563
549 651489563 649513016 647081680 644182739 640870209 637209244 633209496 628775101 623690262 617656555
558 617656555 610385132 601741714 591912193 581532707 571709709 563870506 559445610 559460716 564186134
567 564186134 572991829 584486008 596900864 608575287 618351517 625745583 630867691 634172211
575 634172211 636178474 637278633 637684097 637479820 636721039 635507088 633998184 632381325 630807686
584 630807686 629335480 627902184 626345062 624467735 622124290 619280815 616008759 612405739 608482399
593 608482399 604097633 599007530 593033676 586267128 579176445 572519188 567059898 563231583 560935745
602 560935745 559625549 558659325 557744751 557208862 557907753 560781212 566273575 573936615 582456436
611 582456436 590118980 595495377 598002129 598064232 596821747 595558128 595151825 595801620 597100143
620 597100143 598332176 598794365 597974625 595577469 591493225 585824966 579004936 571902885 565783768
629 565783768 562027283 561672173 564980736 571249390 578988457 586412811 592025299 595042458 595495377
638 595495377 594010963 591423798 588413811 585317917 582140923 578697739 574777641 570248413 565079613
647 565079613 559309196 552994881 546173668 538835487 530905952 522245598 512683067 502101212 490570641
656 490570641 478491211 466671448 456280365 448639946 444899864 445694656 450916176 459698563
664 459698563 470638466 482166023 492924995 502018929 509053993 514009247 517038536 518320732
672 518320732 518017578 516321716 513524742 510032997 506309319 502766037 499663429 497052612 494771042
681 494771042 492483292 489751854 486133080 481281815 475024986 467351990 458300362 447782173 435475655
690 435475655 420909615 403780899 384383125 363897858 344312630 327899742 316457729 310697556
698 310697556 310132084 313572083 319982300 329219856 342207603 360402718 384820366 415130997
706 415130997 449328270 484151382 516054955 542252121 561370010 573496895 579734383 581565323
714 581565323 580361061 577177773 572792740 567816086 562741051 557902336 553410454 549153366 544895363
723 544895363 540425224 535665741 530685844 525621262 520567856 515516357 510361252 504962234 499210777
732 499210777 493067474 486559906 479759636 472754936 465618324 458361664 450886765 442961769 434272118
741 434272118 424565277 413851662 402555962 391502228 381674118 373812485 368026009 363627205
749 363627205 359324951 353735237 346001778 336239929 325584793 315811462 308698635 305422192 306233234
758 306233234 310519276 317153378 324924126 332839966 340217934 346598663 351620522 354967003 356424255
767 356424255 355996437 353981438 350939674 347553635 344437447 341982040 340292320 339228973 338518257
776 338518257 337880859 337133484 336240616 335314293 334574203 334286957 334703178 336009216 338301239 341584702
786 341584702 345790138 350796509 356455002 362607079 369097481 375779228 382513046 389160118 395577621
795 395577621 401624184 407183876 412203178 416727371 420919075 425041237 429409332 434323006 439997482
804 439997482 446512985 453789635 461591644 469564934 477302895 484434738 490708008 496033669 500463028
813 500463028 504094315 506944237 508850784 509468918 508386459 505327454 500362396 494031944 487321968
822 487321968 481490593 477802925 477258110 480389671 487177467 497078247 509148369 522227020 535142326
831 535142326 546908798 556875954 564795685 570788612 575218925 578522835 581051369 582987061 584357109
840 584357109 585125351 585307541 585053482 584656258 584491158 584918213 586192360 588418465 591553345 595444221
850 595444221 599873161 604590302 609330330 613821487 617801933 621047859 623412018 624858093 625472565
859 625472565 625445251 625016365 624404068 623734894 623002701 622073441 620738106 618795013 616127472 612743912
869 612743912 608760872 604342766 599631805 594717102 589669151 584632683 579932480 576124725 573943596
878 573943596 574134293 577222939 583308105 591961250 602285271 613119087 623316727 632006531
886 632006531 638746071 643535004 646701126 648721390 650043488 650969620 651623611 651992264 652006912
895 652006912 651627884 650893402 649926147 648894806 647954865 647191620 646587830 646029129 645339355 644337463
905 644337463 642895126 640977707 638661041 636115494 633560524 631198692 629147720 627394753 625801086
914 625801086 624166489 622337074 620315247 618312912 616712570 615934448 616262550 617707214 619970093
923 619970093 622535820 624847755 626491203 627301369 627360764 626898346 626155014 625280533 624300766 623155479
933 623155479 621766663 620097160 618171654 616058693 613834114 611547470 609208145 606789818 604248314
942 604248314 601541023 598641548 595548096 592283478 588889427 585418549 581926880 578474693 575140190
951 575140190 572043686 569369926 567374229 566351547 566564941 568147812 571013870 574821205 579021378
960 579021378 582993469 586225166 588468018 589800186 590566864 591217270 592113037 593391151 594936295
969 594936295 596462822 597653465 598283653 598277473 597686920 596627007 595208359 593499832 591521606
978 591521606 589253273 586646118 583639679 580194702 576346054 572253914 568218994 564631577 561857605
987 561857605 560106544 559343414 559292374 559528885 559613762 559200020 558070488 556111488 553270302 549544525
997 549544525 545022507 539939842 534695549 529785500 525662079 522579079 520502205 519131279 518027039
1006 518027039 516776962 515123062 512999878 510481796 507684631 504677773 501443901 497891388 493900452
1015 493900452 489371643 484259682 478584099 472419014 465868530 459042778 452054329 445053101 438304672
1024 438304672 432278481 427690353 425435257 426385155 431097260 439541054 450971985 464033928
1032 464033928 477077255 488578529 497502975 503476219 506726418 507855072 507556725 506405563
1040 506405563 504766121 502817039 500629845 498242340 495693512 493023720 490259056 487401543 484429054
1049 484429054 481302299 477971764 474384117 470491943 466265907 461705627 456841621 451722412 446392174
1058 446392174 440868225 435130043 429124527 422784729 416050758 408883972 401268883 393204880 384689331
1067 384689331 375703850 366207275 356139412 345435066 334044266 321948624 309168434 295759907
1075 295759907 281807957 267423344 252749653 237977009 223349190 209154453 195696621 183255634
1083 183255634 172055569 162254410 153956528 147235174 142145319 138713760 136911116 136626205 137664585
1092 137664585 139791174 142807570 146647081 151446505 157567701 165545368 175964127 189287930
1100 189287930 205682907 224887676 246180630 268473663 290527763 311241531 329927711 346483498
1108 346483498 361380157 375457306 389580116 404273491 419475937 434513092 448313065 459789543
1116 459789543 468250885 473677521 476771774 478770027 481100540 485016251 491319160 500240326 511469002
1125 511469002 524287033 537748070 550857506 562725372 572677040 580307350 585471802 588222504
1133 588222504 588718872 587152138 583715248 578620224 572137260 564620819 556501427 548249664 540337181
1142 540337181 533214149 527296638 522940636 520384064 519664001 520553246 522569542 525079842 527469711
1151 527469711 529306602 530417137 530849457 530746536 530206871 529209137 527631760 525343094 522299042
1160 522299042 518590126 514413071 509988441 505474167 500924606 496314430 491612549 486857719 482182541
1169 482182541 477752037 473632393 469652901 465358391 460122681 453424988 445186157 435999947 427102013
1178 427102013 420031013 416089745 415837097 418849411 423872757 429299240 433739471 436430664 437320061
1187 437320061 436837616 435525284 433730850 431495819 428639946 424935875 420249023 414575005 407991219
1196 407991219 400585136 392417831 383533211 373981972 363827972 353120155 341858330 329979935
1204 329979935 317382793 303971367 289696045 274565392 258635540 241998119 224785767 207201080
1212 207201080 189550419 172260284 155861778 140942631 128079624 117765331 110340748 105944881
1220 105944881 104493818 105700779 109142580 114358168 120950851 128660221 137382393 147138348 158013229
1229 158013229 170094070 183426952 197996750 213721218 230449448 247960129 265965137 284124451
1237 284124451 302078800 319497719 336129303 351840553 366629601 380603333 393921776 406731300
1245 406731300 419111481 431061516 442526894 453445206 463776398 473492393 482532310 490758629
1253 490758629 497955055 503873940 508304482 511099014 512123375 511150093 507778206 501471291 491752052
1262 491752052 478488655 462133141 443769493 424918633 407177849 391863441 379808998 371379013
1270 371379013 366618958 365395432 367415314 372119370 378559875 385398674 391096001 394236145 393841782
1279 393841782 389536095 381494789 370256042 356520767 341053314 324705544 308492393 293612652
1287 293612652 281349354 272862587 268956242 269908218 275418129 284675636 296512680 309601917
1295 309601917 322670403 334702148 345087585 353671570 360659561 366395340 371080856 374551163
1303 374551163 376209869 375169525 370556755 361880188 349333191 333937759 317482719 302273064
1311 302273064 290746670 285039291 286591110 295880070 312344360 334510384 360295830 387404099
1319 387404099 413718758 437611275 458111877 474932098 488355522 499034996 507742462 515128975
1327 515128975 521548347 526979599 531053734 533158226 532579803 528657608 520949745 509424210 494664078
1336 494664078 478021851 461617775 448083763 440045319 439461555 447052422 462044449 482363319
1344 482363319 505210762 527806396 548012886 564635925 577359810 586433792 592308464 595384827
1352 595384827 595935020 594143333 590167007 584139175 576107178 565968361 553481674 538402634
1360 538402634 520723610 500929260 480154610 460144043 442976952 430609512 424362411 424521370
1368 424521370 430196991 439506874 450030899 459390106 465763969 468187561 466576347 461523476
1376 461523476 453993340 445039215 435620995 426530609 418381615 411609726 406461411 402984505 401051331
1385 401051331 400429802 400886993 402279587 404583511 407844849 412074242 417140503 422718277 428319397
1394 428319397 433395729 437463875 440201111 441476746 441321144 439858437 437242775 433620567 429124527
1403 429124527 423880043 418012352 411641693 404872284 397789268 390465736 382980042 375431213 367939148
1412 367939148 360633354 353636932 347062912 341030426 335693283 331263809 328008003 326202698 326064644
1421 326064644 327676468 330945053 335612946 341321335 347698517 354437218 361325645 368227043 375022812
1430 375022812 381556358 387609901 392927017 397268257 400469017 402472382 403326569 403154068 402111473
1439 402111473 400354729 398007736 395131683 391695099 387560387 382513733 376351318 369006233 360664673
1448 360664673 351806755 343128586 335357590 329030991 324330826 321052170 318714237 316760769 314754963
1457 314754963 312489643 309985352 307411594 304991417 302945023 301483231 300821533 301174870 302714787
1466 302714787 305503139 309444714 314292698 319709816 325355377 330954170 336319313 341331787 345905457
1475 345905457 349966507 353462067 356384926 358795624 360829353 362686234 364616280 366897087 369793930
1484 369793930 373493156 378020630 383187714 388620186 393896103 398760185 403324661 408144150 414103851
1493 414103851 422145004 432938766 446646881 462862968 480738983 499215508 517251244 533978882
1501 533978882 548774414 561275368 571387672 579280777 585353127 590140915 594179230 597867470
1509 597867470 601395454 604762230 607870140 610631599 613029785 615110359 616925621 618479156 619712372
1518 619712372 620538445 620901451 620827332 620441742 619949417 619584999 619547729 619938812 620719833 621717644
1528 621717644 622684212 623401794 623787613 623940430 624091949 624473419 625159492 625978889 626548500 626424942
1538 626424942 625305290 623172913 620321388 617243919 614446564 612274780 610823441 609959412 609431763
1547 609431763 609011536 608599930 608260269 608160286 608447647 609111824 609899597 610341530 609899864 608192062
1557 608192062 605187912 601277885 597156219 593555222 590949173 589373474 588448105 587593117 586318245
1566 586318245 584431763 582067909 579534798 577091293 574789543 572467041 569869003 566801643 563206673
1575 563206673 559121590 554578094 549544449 543984299 538005829 531989441 526569328 522423897 519962997
1584 519962997 519082222 519137421 519170723 518270073 515863914 511804161 506227188 499331970 491255760
1593 491255760 482151451 472406502 462826920 454602623 448997765 446880684 448328133 452509651 457927208
1602 457927208 462902184 466091576 466823158 465142975 461613350 456988640 451917381 446767883 441601982
1611 441601982 436264801 430527611 424224663 417336426 409998360 402439766 394883194 387453308 380132980
1620 380132980 372784119 365214386 357256699 348821869 339912605 330602531 320995064 311175766 301169109
1629 301169109 290907288 280228920 268922005 256811180 243859730 230240993 216335354 202644577
1637 202644577 189659233 177738285 167054234 157617064 149351597 142186356 136123505 131280928
1645 131280928 127916574 126432838 127349138 131222868 138519640 149469995 163967648 181556168
1653 181556168 201508827 222963524 245053711 266993427 288112316 307863445 325826950 341717606
1661 341717606 355379829 366760368 375866356 382737465 387453651 390172844 391158142 390756989 389321594
1670 389321594 387109566 384228516 380666122 376388321 371436653 365948448 360075798 353851662 347096214
1679 347096214 339441986 330476685 319931736 307809010 294374409 280030003 265140610 249910488
1687 249910488 234364510 218424397 202025108 185213928 168203926 151383839 135297604 120592518
1695 120592518 107927456 97841139 90612001 86172829 84135246 83939800 85080309 87300882
1703 87300882 90671329 95498266 102111721 110623159 120759020 131832504 142848291 152687368
1711 152687368 160303307 164880676 165935936 163366146 157452688 148822155 138363743 127112331
1719 127112331 116115437 106316509 98480215 93164415 90729427 91359940 95083351 101779499 111191416
1728 111191416 122948408 136603146 151677570 167701569 184238892 200897827 217338638 233283825
1736 233283825 248534775 262985878 276628361 289532757 301815872 313595982 324953346 335906754
1744 335906754 346413193 356392479 365770149 374523544 382713432 390486603 398043785 405584221
1752 405584221 413249168 421088524 429062004 437069740 444997673 452754211 460291595 467609901 474752274
1761 474752274 481793480 488819580 495896111 503029709 510142097 517076340 523645515 529706688 535227356
1770 535227356 540305557 545131416 549906578 554763794 559725113 564715004 569612541 574308853 578742561
1779 578742561 582907104 586839828 590610123 594309921 598038483 601872902 605829506 609836693 613745575
1788 613745575 617385483 620644951 623532219 626180878 628787079 631507607 634375610 637277298 640007629
1797 640007629 642374420 644298248 645858383 647262573 648761597 650549011 652696838 655149841 657773209
1806 657773209 660424042 663009644 665505524 667937164 670341415 672736282 675116730 677473526 679816895
1815 679816895 682185974 684633408 687196274 689871826 692612915 695347519 698005295 700534515 702906265
1824 702906265 705104294 707122650 708971329 710687256 712335587 713988800 715694656 717453995 719229355
1833 719229355 720984879 722731857 724543610 726519699 728712387 731060562 733379440 735424652 737002029
1842 737002029 738065567 738746033 739294357 739966125 740913620 742136917 743510742 744866486 746075897
1851 746075897 747098236 747972336 748775711 749576950 750411987 751287079 752200623 753162308 754194717 755317078
1861 755317078 756518402 757739105 758872910 759795303 760405350 760664520 760611572 760343704 759972382 759575119
1871 759575119 759168167 758712921 758150482 757442017 756595001 755663071 754724045 753854523 753113785 752538452
1881 752538452 752144547 751924133 751840363 751826935 751800766 751689758 751461716 751139984 750793228 750507050
1891 750507050 750348740 750347443 750490952 750738449 751035309 751323547 751549377 751672974 751684418 751615372 751534576
1902 751534576 751522369 751633835 751870117 752179718 752491684 752766266 753027420 753360214 753869934 754624939
1912 754624939 755616608 756757126 757914047 758958893 759805298 760422897 760826950 761060791 761180038
1921 761180038 761245193 761314316 761430817 761608200 761817169 761991348 762050629 761935730 761638870 761212082
1931 761212082 760750427 760356598 760101242 759997253 759996490 760009003 759936905 759710541 759311600 758776474 758173447
1942 758173447 757565842 756970596 756337738 755562592 754530945 753181686 751558075 749819183 748201370
1951 748201370 746944275 746209183 746029816 746315994 746904678 747635117 748408813 749209747 750078659 751060562
1961 751060562 752154770 753291855 754348602 755187836 755705795 755865707 755704803 755321198 754842758
1970 754842758 754396667 754083252 753961945 754047089 754318008 754734955 755257492 755862045 756545258 757318039
1980 757318039 758187637 759140854 760133057 761094589 761948166 762635956 763140564 763492508 763762436 764034348
1990 764034348 764376755 764817810 765335999 765871582 766351700 766721573 766966248 767115097 767225113 767352066
2000 767352066 767522202 767719116 767889099 767966461 767903824 767693939 767375717 767017746 766690369 766437607
2010 766437607 766258926 766110229 765922852 765633621 765212631 764679565 764098358 763553543 763119125 762828217
2020 762828217 762663498 762567978 762471848 762325058 762118301 761884918 761682281 761564484 761557083 761646347 761784515
2031 761784515 761910095 761971741 761945724 761842117 761697769 761558685 761460495 761413193 761398544 761376648 761305008
2042 761305008 761156006 760929947 760654984 760374603 760128555 759934311 759778900 759622421 759414749 759114532
2052 759114532 758707123 758209991 757665329 757123718 756623840 756176224 755760040 755332031 754845428 754272842
2062 754272842 753619919 752927551 752257614 751670074 751199951 750843887 750563431 750302277 750011139 749669113
2072 749669113 749293518 748932190 748644562 748476791 748443909 748523865 748667374 748818436 748935852 749006577
2082 749006577 749047546 749091415 749168472 749288864 749434967 749567642 749641342 749624634 749513092 749332123 749129028
2093 749129028 748954086 748842239 748800583 748806839 748817749 748787613 748686295 748511581 748290482 748068695 747892227
2104 747892227 747786636 747747269 747739410 747713165 747624283 747454376 747218552 746960602 746732864 746574478 746493912
2115 746493912 746464996 746439285 746366730 746217575 745995178 745734024 745484238 745288544 745163879 745093002 745030746
2126 745030746 744922867 744729233 744439926 744081421 743705750 743371201 743120422 742963791 742877884 742816849
2136 742816849 742733002 742599487 742421112 742235413 742096939 742054672 742130356 742307816 742535858 742746353
2146 742746353 742877045 742895279 742806702 742651749 742486954 742361221 742294388 742269745 742240601 742150421 741958389
2157 741958389 741658173 741282349 740890732 740545654 740285492 740107117 739966736 739797440 739536972 739155731
2167 739155731 738669434 738133621 737622604 737199707 736893005 736685944 736526108 736348343 736101837 735770798
2177 735770798 735380707 734987793 734655609 734430313 734320984 734297104 734301224 734272232 734171982 734001236 733799820
2188 733799820 733629761 733547974 733581619 733713455 733886337 734023666 734057770 733954620 733725891 733421478
2198 733421478 733109055 732844696 732650986 732508774 732366333 732164001 731861649 731459198 730999298 730552444
2208 730552444 730188751 729948959 729828186 729776764 729720764 729591370 729350662 729005127 728600159 728199310
2218 728199310 727856522 727594070 727392960 727201004 726954422 726604691 726138916 725586166 725006866 724469757
2228 724469757 724025116 723686523 723427811 723196106 722935944 722614212 722234116 721833649 721470261 721194839
2238 721194839 721030807 720962219 720940170 720902100 720798111 720612335 720370712 720130310 719956055 719893112 719946136
2249 719946136 720075760 720211792 720279007 720224915 720038757 719754028 719435120 719150772 718947601 718830566
2259 718830566 718762512 718679047 718516998 718242798 717868652 717449493 717062683 716776886 716625214 716593781
2269 716593781 716629028 716660461 716628418 716506500 716307907 716079102 715879059 715757446 715735703 715797424 715894928
2280 715894928 715965347 715954437 715835190 715617294 715340729 715056992 714806366 714600372 714418564 714218750
2290 714218750 713956680 713607941 713180008 712711716 712261353 711884689 711613922 711446381 711346359 711260986
2300 711260986 711145477 710981598 710784912 710593567 710444717 710350952 710291443 710221176 710097809 709909058
2310 709909058 709687195 709502563 709432602 709524612 709764099 710066757 710302429 710342102 710112991 709634933
2320 709634933 709019547 708426132 707991333 707766037 707691269 707630157 707438736 707037201 706443787 705750885
2330 705750885 705065460 704451752 703912125 703410873 702910843 702386169 701794586 701037903 699960556 698425064
2340 698425064 696446152 694307556 692568512 691911240 692869034 695559311 699560623 704015732 707924652
2349 707924652 710494537 711385803 710749664 709069214 706901550 704660797 702527847 700495453 698482513
2358 698482513 696437607 694380341 692376785 690495682 688774261 687218323 685819092 684569931 683468933
2367 683468933 682512970 681693115 681001205 680442963 680042114 679834061 679846268 680081482 680513916 681099243
2377 681099243 681793442 682564163 683391495 684257889 685138092 685995026 686785355 687470398 688025360 688444748
2387 688444748 688741684 688945084 689092102 689221954 689363708 689526978 689699020 689848328 689937897 689940948
2397 689940948 689852142 689688950 689483643 689269409 689068298 688884659 688706589 688512650 688281250 688000336
2407 688000336 687674103 687323532 686983337 686688538 686461945 686304016 686190796 686083145 685943222 685750046
2417 685750046 685508881 685246582 684998627 684791412 684628754 684489899 684336395 684127502 683835907 683457336
2427 683457336 683010406 682528076 682044220 681579971 681140366 680714645 680287628 679850922 679411469 678992004
2437 678992004 678623810 678335876 678143539 678042755 678013000 678023987 678047333 678066330 678078156 678093109 678127441
2448 678127441 678191833 678286209 678395920 678495636 678558273 678564072 678507233 678396988 678253708 678101349 677959137
2459 677959137 677835541 677726517 677618103 677490692 677327576 677119675 676869812 676592026 676305466 676027756
2469 676027756 675766296 675514984 675256500 674969711 674640274 674268036 673868790 673469315 673096466 672766495
2479 672766495 672478790 672216644 671955872 671674652 671363525 671028366 670686035 670357285 670056992 669788284
2489 669788284 669542236 669302521 669052048 668779221 668481522 668166122 667845993 667533875 667238541 666959915
2499 666959915 666687698 666405640 666096649 665749130 665363083 664951019 664534378 664136200 663773880 663453369
2509 663453369 663168411 662904205 662644272 662376099 662095871 661809387 661528931 661267929 661035156 660831070
2519 660831070 660646591 660466309 660276413 660070267 659852676 659639969 659452667 659307632 659210968 659154129
2529 659154129 659118347 659080353 659022369 658937836 658833466 658724060 658627090 658554306 658507080 658476105 658444290
2540 658444290 658394470 658316116 658209763 658086929 657965393 657862167 657785645 657732162 657686844 657627716 657534637
2551 657534637 657395554 657209320 656986389 656742935 656494827 656250839 656009979 655761185 655489273 655180588
2561 655180588 654828339 654436646 654018707 653593140 653177872 652784500 652415237 652062607 651712036 651348038
2571 651348038 650958023 650538025 650093231 649636536 649183807 648746567 648327789 647921295 647514496 647096329
2581 647096329 646662598 646220016 645783615 645370636 644991989 644647522 644324951 644004059 643663940 643289795
2591 643289795 642877197 642431793 641965942 641492996 641023254 640559235 640096741 639626122 639137840 638627014
2601 638627014 638097839 637564926 637049828 636574898 636156235 635796661 635484962 635198250 634910507 634600830
2611 634600830 634260330 633894119 633517647 633149567 632804604 632486687 632190208 631902313 631609688 631303864
2621 631303864 630985909 630665283 630357857 630078163 629835587 629628372 629443474 629259987 629056091 628816833
2631 628816833 628540382 628239288 627935486 627651558 627401810 627187347 626997528 626816864 626633301 626443558
2641 626443558 626254005 626074944 625914879 625776291 625654755 625543404 625435448 625326500 625214500 625098457
2651 625098457 624976959 624849281 624716110 624579811 624442253 624302177 624154167 623989334 623800850 623587914
2661 623587914 623359146 623128624 622910767 622712593 622530060 622348824 622150192 621917534 621643486 621330643
2671 621330643 620990944 620641823 620299416 619974556 619668808 619373894 619075012 618755875 618407288 618030777
2681 618030777 617640038 617255363 616893883 616560669 616244621 615921059 615561714 615145874 614669495 614147224
2691 614147224 613605576 613072624 612566681 612089310 611625862 611153107 610649338 610104713 609524536 608926163
2701 608926163 608330536 607752190 607191887 606636658 606065025 605456352 604798622 604093208 603353119 602597847
2711 602597847 601845589 601107407 600384064 599666595 598939972 598188858 597403336 596583748 595741768 594897690
2721 594897690 594073524 593285599 592538910 591824646 591124458 590417023 589686775 588929100 588151321 587369080
2731 587369080 586599121 585853195 585133591 584433784 583742180 583049126 582352333 581659508 580986824 580352859
2741 580352859 579770737 579243164 578759842 578299828 577838631 577354469 576833649 576272011 575673561 575046463
2751 575046463 574399796 573739815 573069077 572386169 571687241 570967789 570225792 569463043 568687210 567910156
2761 567910156 567144890 566401558 565682640 564981956 564285545 563576241 562839088 562065735 561255150 560411415
2771 560411415 559539185 558641052 557715416 556760445 555777893 554776077 553771515 552786293 551842308 550957260
2781 550957260 550141258 549396553 548719139 548099976 547527618 546989021 546471977 545967216 545469818 544978256
2791 544978256 544492798 544010468 543522835 543016548 542476959 541894150 541267128 540604630 539920464 539228325
2801 539228325 538537598 537852097 537173538 536504669 535851212 535220490 534617767 534043655 533494644 532966194
2811 532966194 532456741 531969299 531510239 531083374 530687180 530312843 529946861 529576302 529191780 528788185
2821 528788185 528362007 527906418 527409973 526858330 526239624 525550537 524799194 524003105 523183212 522355804
2831 522355804 521527901 520695572 519848671 518976021 518071136 517134438 516171227 515187645 514185753 513162041
2841 513162041 512107849 511012955 509868774 508671074 507419357 506114426 504756737 503345070 501878281
2850 501878281 500357170 498787918 497180672 495548744 493903122 492249870 490588074 488910217 487205963
2859 487205963 485463867 483673744 481826706 479915733 477935829 475887756 473780441 471633492 469476700
2868 469476700 467345772 465275307 463291588 461407623 459620361 457912979 456258049 454622650 452971954
2877 452971954 451273193 449497643 447623405 445635757 443527031 441296501 438947372 436486359 433922462
2886 433922462 431267052 428533287 425735893 422887955 419998550 417070847 414102669 411090126 408033943
2895 408033943 404947243 401859894 398819046 395883789 393114471 390560913 388250771 386186256 384346046
2904 384346046 382694969 381196861 379825363 378567696 377421532 376386223 375452499 374596519 373779793
2913 373779793 372955971 372079887 371116180 370044212 368858376 367565346 366180878 364725800 363223991
2922 363223991 361701241 360185699 358707657 357300949 356001015 354841423 353848267 353033409 352391510
2931 352391510 351902161 351537743 351274605 351102066 351025352 351059875 351219749 351506386 351899834 352359238
2941 352359238 352831078 353259277 353597336 353814774 353899422 353854904 353695641 353440819 353110237 352721252
2951 352721252 352288589 351826324 351350784 350883293 350448723 350072746 349774895 349561615 349421234 349323120
2961 349323120 349220123 349056587 348776245 348330421 347684174 346818619 345731239 344433289 342949371
2970 342949371 341316528 339587822 337837372 336165085 334696617 333577156 332953415 332950668 333647575
2979 333647575 335058403 337128220 339744873 342762680 346031265 349418869 352825394 356182098 359445648
2988 359445648 362590027 365605011 368498192 371298561 374055176 376825638 379658394 382574577 385556030
2997 385556030 388547287 391469345 394241257 396799240 399109993 401172485 403012047 404669151 406187553
3006 406187553 407603951 408940849 410201530 411370888 412419090 413310890 414014931 414512138 414798203
3015 414798203 414881096 414774361 414490433 414038010 413423882 412658310 411759377 410754013 409674568 408553352
3025 408553352 407415161 406272926 405124931 403954391 402730942 401417580 399981766 398411369 396731415
3034 396731415 395012321 393361816 391900597 390725365 389873848 389306564 388913803 388547020 388060646
3043 388060646 387348137 386358986 385093117 383578491 381848640 379928627 377834969 375584526 373206215
3052 373206215 370743599 368251305 365782318 363376198 361051445 358802261 356602936 354414787 352194366
3061 352194366 349902496 347512779 345018158 342431984 339786644 337126236 334497223 331940155 329482689
3070 329482689 327135124 324889984 322722816 320596619 318469925 316305237 314078350 311782742 309427586
3079 309427586 307031593 304616661 302203522 299816399 297489338 295271339 293223915 291407013 289858990
3088 289858990 288578663 287517719 286589813 285690365 284722099 283613548 282326736 280854683 279213390
3097 279213390 277434788 275565243 273663387 271797981 270038624 268442841 267043571 265844173 264822483
3106 264822483 263945713 263185635 262530403 261986618 261572514 261307182 261200256 261248245 261435204 261738243
3116 261738243 262133961 262603626 263135986 263728886 264389782 265132675 265974941 266931458 268009453 269205227
3126 269205227 270506363 271896515 273361588 274896145 276502209 278185387 279947186 281779308 283661423
3135 283661423 285565186 287460861 289324436 291141930 292908516 294626236 296298866 297930622 299524670
3144 299524670 301084576 302613049 304110241 305571117 306983433 308328705 309585953 310737190 311772175
3153 311772175 312689247 313494167 314195900 314802666 315319042 315745869 316079998 316315346 316444607 316459370
3163 316459370 316351948 316118298 315759621 315283756 314703712 314034653 313289909 312478943 311607189 310679283
3173 310679283 309702377 308688450 307653999 306616001 305588474 304579048 303588848 302614975 301654530
3182 301654530 300705853 299769096 298844566 297929916 297020302 296108932 295189819 294258575 293312836 292350445
3192 292350445 291366596 290353622 289302483 288203945 287051697 285843544 284579849 283262634 281893158
3201 281893158 280471745 278999367 277477646 275911045 274305706 272668610 271004314 269313278 267591343
3210 267591343 265830688 264022923 262162704 260250721 258293800 256303806 254292946 252270584 250241947
3219 250241947 248208427 246171551 244135895 242111969 240115376 238164845 236278648 234471703 232751808
3228 232751808 231119595 229568615 228088570 226671276 225316563 224035854 222852726 221795330 220888405
3237 220888405 220144539 219561386 219126492 218826866 218659039 218633900 218774014 219105167 219647236 220409107
3247 220409107 221388645 222579975 223978863 225587540 227415199 229474277 231776295 234329529 237137222
3256 237137222 240198002 243507118 247056751 250836735 254835262 259039345 263435631 268009377 272743988
3265 272743988 277619209 282611027 287692184 292835293 298015003 303211651 308412228 313610668 318804798
3274 318804798 323993454 329172745 334334564 339467087 344558372 349600792 354594383 359546013 364465637
3283 364465637 369360695 374229279 379059219 383830719 388521919 393115349 397602119 401981621 406257362
3292 406257362 410433006 414507256 418473244 422318420 426027222 429583168 432972031 436183739 439215012
3301 439215012 442070084 444758797 447293816 449684639 451934662 454040375 455995369 457797775 459456825
3310 459456825 460995712 462448006 463849907 465228729 466596413 467949181 469272881 470552750 471782188
3319 471782188 472965126 474112625 475234985 476334457 477400932 478414879 479354477 480203972 480961266
3328 480961266 481639366 482263680 482865028 483470993 484099503 484754333 485425148 486093140 486737747 487345428
3338 487345428 487914810 488456001 488984604 489512787 490039902 490548706 491007690 491378937 491626549 491724014
3348 491724014 491656265 491419220 491017227 490461197 489769516 488968582 488093605 487188072 486304245 485501289
3358 485501289 484844513 484401169 484232826 484383926 484870911 485676384 486752548 488033981 489453087
3367 489453087 490953445 492493706 494042549 495568733 497034264 498395576 499611740 500654984 501517830
3376 501517830 502211952 502759056 503181229 503493195 503702621 503814392 503837395 503791275 503706284 503624763 503597565
3387 503597565 503679695 503921738 504359474 505002441 505826759 506777496 507782211 508771629 509697952 510545921
3397 510545921 511327591 512067375 512783585 513476105 514125938 514705849 515194473 515587616 515900116 516159744
3407 516159744 516397171 516635780 516886787 517148628 517409096 517649422 517848892 517990532 518066444 518082771
3417 518082771 518059120 518023911 518003387 518012619 518049507 518098259 518138313 518156700 518155060 518149986 518165131 518220863
3429 518220863 518325005 518470879 518641205 518816719 518985443 519146500 519310799 519495087 519714088 519971466
3439 519971466 520255737 520541916 520799904 521006889 521159210 521277008 521399193 521570168 521822891 522165756
3449 522165756 522580605 523030586 523474236 523881111 524240685 524562874 524871559 525193367 525546913 525935059
3459 525935059 526343880 526748047 527122536 527454071 527750740 528039093 528353958 528721123 529144440 529603577
3469 529603577 530065193 530499802 530897179 531267700 531633034 532010765 532404022 532802582 533192558 533567657
3479 533567657 533933182 534300079 534675674 535058556 535441704 535822411 536209564 536619835 537067947 537552948
3489 537552948 538055916 538549957 539017563 539463882 539914398 540397949 540925560 541478882 542016411 542494621
3499 542494621 542892075 543219948 543515320 543821220 544166679 544558372 544984970 545430984 545888557 546360359
3509 546360359 546854210 547375908 547925110 548497467 549089699 549702644 550338707 550994682 551656075 552296791
3519 552296791 552886009 553399239 553828697 554187279 554505692 554824638 555183411 555611305 556120300 556702309
3529 556702309 557330704 557968483 558583527 559164848 559734116 560341911 561046638 561881218 562825851 563801537
3539 563801537 564696121 565411491 565910683 566237946 566497765 566803093 567222214 567753258 568339729 568917122
3549 568917122 569457130 569983292 570552635 571217384 571999359 572892456 573886528 574986610 576202965 577512398
3559 577512398 578818207 579947662 580705070 580964127 580748901 580252647 579776230 579610786 579926338 580719032
3569 580719032 581839447 583076019 584247894 585263519 586130714 586932869 587791405 588827667 590123672
3578 590123672 591682205 593395309 595048599 596378441 597173309 597378349 597142830 596775131 596619453
3587 596619453 596910973 597688103 598802071 600013237 601112976 602005119 602713089 603329849 603956413
3596 603956413 604668846 605521736 606562309 607824669 609298363 610893097 612436905 613723373 614596672
3605 614596672 615026741 615137901 615169182 615386620 615981064 616991692 618279343 619561844 620507050 620867386
3615 620867386 620613708 620006676 619548187 619797897 621109886 623410416 626145782 628459854 629545212
3624 629545212 629002419 627030296 624342651 621857414 620318489 620035019 620847511 622297096 623877945
3633 623877945 625238914 626264992 627048340 627808952 628807716 630261650 632249107 634616203 636941109
3642 636941109 638616676 639063721 637999268 635619812 632578773 629740486 627822266 627109795 627390976
3651 627390976 628130074 628773155 629009552 628869019 628636513 628671036 629240456 630441513 632203445 634330559
3661 634330559 636548653 638551712 640065842 640926437 641135330 640847549 640274887 639550934 638643036
3670 638643036 637382965 635608368 633335991 630852852 628659286 627289162 627104607 628169594 630252113
3679 630252113 632920647 635665703 637988129 639453773 639747505 638751221 636624260 633822060 631004105
3688 631004105 628836403 627769814 627898102 628965569 630506020 632032356 633181534 633769722 633777351
3697 633777351 633315125 632605591 631963844 631736183 632175598 633296890 634794464 636104355 636615219
3706 636615219 635941620 634121017 631628571 629192734 627504997 626963081 627560081 628948669 630620079
3715 630620079 632100983 633085709 633475876 633347015 632882423 632310600 631858139 631717682 632021942 632817726
3725 632817726 634035912 635467491 636764984 637498322 637282562 635953598 633721161 631200027 629249268
3734 629249268 628646355 629724922 632168884 635098419 637441254 638416252 637872658 636296768 634481201
3743 634481201 633053207 632137337 631353569 630137253 628172073 625660591 623262367 621739998 621536255
3752 621536255 622533607 624135132 625598640 626417885 626531944 626267509 626083221 626284943 626873589 627582436
3762 627582436 628047371 627995415 627355156 626260338 624980659 623828087 623073769 622884445 623273964 624086761
3772 624086761 625030556 625768013 626043167 625783501 625122070 624320717 623633957 623190994 622963371 622827644
3782 622827644 622678680 622512550 622427254 622548447 622939224 623560066 624306145 625085335 625872574 626691895
3792 626691895 627536316 628292656 628737755 628631859 627855072 626497269 624832535 623186226 621778145
3801 621778145 620648613 619715881 618922462 618360138 618270683 618905983 620332069 622311211 624351158
3810 624351158 625905838 626611443 626417198 625543556 624308205 622946014 621535873 620068626 618583488
3819 618583488 617257996 616375160 616182365 616740265 617868767 619231300 620506897 621538048 622362823
3828 622362823 623112526 623849335 624454346 624646339 624124527 622753639 620677299 618288498 616072311
3837 616072311 614412842 613474007 613224525 613574181 614520416 616184158 618681107 621890831 625272102
3846 625272102 627883987 628671150 626918068 622656021 616792374 610855026 606438446 604598198 605475693
3855 605475693 608323593 611897011 615004616 616949654 617675781 617599144 617262878 617018013 616884766
3864 616884766 616629639 615977364 614821663 613318176 611827774 610752258 610358276 610679207 611526108
3873 611526108 612593460 613587418 614316826 614712753 614789581 614591866 614167328 613573914 612898064 612251091
3883 612251091 611729469 611363831 611098175 610828743 610489044 610127754 609919891 610089874 610781212 611945190
3893 611945190 613314629 614483757 615052452 614766312 613595047 611725540 609492836 607283134 605444756
3902 605444756 604221039 603715477 603888283 604587593 605602608 606720276 607764778 608605194 609149017
3911 609149017 609335480 609149017 608640213 607933121 607196274 606583061 606173325 605952911 605844498 605768127
3921 605768127 605689697 605624466 605599556 605607491 605587387 605451660 605137177 604648933 604068909 603527412 603153114
3932 603153114 603026276 603149338 603442955 603768730 603976097 603960800 603711319 603312416 602899590 602581749
3942 602581749 602381325 602231255 602032051 601728249 601347923 600977592 600692825 600503807 600356865 600188522
3952 600188522 599981308 599770622 599597778 599455910 599281425 599007416 598632202 598236465 597925377 597739868
3962 597739868 597615547 597433510 597124481 596736717 596395607 596187019 596060600 595855141 595436020 594830780
3972 594830780 594235001 593858032 593732643 593656883 593346939 592688942 591866379 591224022 590950165 590848770
3982 590848770 590440788 589365692 587763557 586257095 585445976 585267792 584805641 582874794 579086418
3991 579086418 574529343 571236000 570337830 569865761 563764801 543300552 500710754 433455353
3999 433455353 346732788
4000 346732788
##END=$$ End of the data block
