##TITLE=$$ Begin of the data block
##JCAMP-DX=5.00 $$ ACD/SpecManager v 10.08
##SPECTROMETER/DATA SYSTEM=16PC
##DATE=19 Jun 2013 12:03:10
##DATA TYPE=INFRARED SPECTRUM
##DATA CLASS=XYDATA
##ORIGIN=
##OWNER=
##NPOINTS=3601
##FIRSTX=400.00000000
##LASTX=4000.00000000
##MAXX=4000.00000000
##MINX=400.00000000
##MAXY=86.28551483
##MINY=10.59637070
##XFACTOR=1.0000000000
##YFACTOR=0.000000100000000
##FIRSTY=49.58974075
##DELTAX=1.00000000
##XUNITS=1/CM
##YUNITS=TRANSMITTANCE
##XYDATA=(X++(Y..Y))
400D95897408J27077751R7126846N9831848K7467804P756500J349717L335571P240524
408H27083969Q779297P274399M532623K586212K093735K283020K022629Q95843n63202
417H56988525j471405j373520n27801M27856J033097J276321J415253J596451J666488
426H61031265J332855M91028o04400j490021j828232j640472j246109r86710r74960
435H54084244j064835j037216q13522n11780l20511l18985m06952l94134j58081K60467
445H49318695O98853R88388J054916R29108O95648M35409K11487P2861N3177J41296
455H54599838K62909L08609K02103l8147l00446m57840m51889l26843j77841o2485
465H53557968M0054J94779M30145O79321Q13218P28073M26025K5787l12042m75158
$$ plain form
400 495897408 622975159 720102005 779933853 807401657 815158157 816507874 819843445 827083969
408 827083969 835863266 843137665 847670288 850256500 852350235 854633255 856655884 857551727 856988525
417 856988525 855517120 854143600 853615799 854043655 855076752 856353073 857768326 859364777 861031265
426 861031265 862364120 862855148 862250748 860760727 858932495 857292023 856045914 855059204 854084244
435 854084244 853019409 851982193 851168671 850656891 850336380 850017395 849610443 849216309 849058228 849318695
445 849318695 850017548 851005936 852060852 852989960 853685608 854121017 854332504 854405365 854458542 854599838
455 854599838 854862747 855171356 855373459 855335312 855034866 854577026 854125137 853798294 853620453 853557968
465 853557968 853598022 853792801 854222946 854902267 855715485 856443558 856869583 856895370 856583328 856108170
475H56108170m43573k70691k4643K43759M93088O63604O74744M67148O2256m19846
485H57554016q01697r40246q03910m89120j61819L1890L5401j06659k87552m02298
495H53628006l94592k70310q3847R5139K16675K66342K67486K60697K78244L27987
505H54591827L94898M55246M96521N16815N18570M93088M17022K68937M6997k23542
515H57976379m94690p19451q61969r01490q27331o40030l59802l6164K56958M49524
525H53841934N06592M45938L22189J93482Q8577J373q4152j69143k31019k40020j88980
536H54486771j05210l7613k5100p2174j51673k24838k69623k89612l04184l29361l64379
547H52313004l89786l82996l27911k24838r0790M8218J68914K62680L43628M36554
$$ plain form
475 856108170 855664597 855393906 855369263 855613022 856106110 856769714 857444458 857911606 857973862 857554016
485 857554016 856752319 855812073 855008163 854519043 854357224 854389114 854424515 854317856 854030304 853628006
495 853628006 853233414 852963104 852879257 852974396 853191071 853457413 853724899 853985596 854263840 854591827
505 854591827 854986725 855441971 855938492 856455307 856973877 857466965 857883987 858152924 858199921 857976379
515 857976379 857481689 856762238 855900269 854998779 854171448 853531418 853171616 853135452 853392410 853841934
525 853841934 854348526 854794464 855116653 855310135 855398712 855400085 855315933 855146790 854915771 854675751 854486771
536 854486771 854381561 854343948 854318848 854246674 854095001 853870163 853600540 853310928 853006744 852677383 852313004
547 852313004 851923218 851540222 851212311 850987473 850896683 850944901 851113815 851376495 851720123 852156677
557H52156677N55725O76346P35016O56433M06799L2807l42636n78308n92957m11453
567H53294449j49841N6762J32981R3536J6022k8382k2964o943l3874j24207k51083
578H52976456l68271m44336m83856n07813n24444n13230m41360k98996j19629L0289
588H49304810R0408M4632o8970j81503k31934j98974j03302R689R2621J16730P5836
599H48950043j5412j26342k23160k78168k81448k42081j78909j10779m6539Q697M3030
610H47498932L4180m1504j88446l73993n36194o08292n53665l84979j57547N8746K07825
621H44955063K67715K47727J78528J01928N3864N0812Q1710J04447P0190m8065k29034
632H45834885m06342n03311m81796l68042k41013j82495k28577l52249m88739n75943
$$ plain form
557 852156677 852712402 853388748 854123764 854780197 855186996 855219803 854877167 854298859 853705902 853294449
567 853294449 853144608 853201370 853334351 853427887 853443909 853415527 853392563 853385620 853351746 853227539 852976456
578 852976456 852608185 852163849 851679993 851172180 850647736 850134506 849693146 849394150 849274521 849304810
588 849304810 849395218 849439850 849370880 849189377 848957443 848758469 848655167 848664856 848757477 848874207 848950043
599 848950043 848934631 848808289 848585129 848306961 848025513 847783432 847604523 847493744 847447205 847455902 847498932
610 847498932 847533112 847491608 847303162 846929169 846392975 845784683 845231018 844846039 844688492 844747238 844955063
621 844955063 845222778 845470505 845649033 845750961 845804825 845855637 845937347 846041794 846111984 846063919 845834885
632 845834885 845428543 844925232 844443436 844075394 843834381 843651886 843423309 843071060 842582321 842006378
642H42006378n89523n39856m53415l53470k56882j82647j51062j66626k01798k05383
652H38905716j38245j7852P5836N0354j21842l57666n04303m47464k23617l3875j33743
663H37053299o54907j474304k239686k543258k159653j186600j1978Q86078J181564
672H28850555Q48389J40228n71975r98536j055374q58535o15693m92401n30090o55441
682H24061127p56531p66449p04956o45599o51093p18231p84912p91397p43561p31430
692H16766968q70514j216202j714020k237472k685776l059921l455506l963852m581298
701G92982407n203934n742874o255188o967850q133240r822998j1842804j3902130
709G25111389j5960846j8479385k2285843k7997208l5274505m2401886m6588021m5003891
$$ plain form
642 842006378 841416855 840876999 840423584 840070114 839813232 839630585 839479523 839312897 839111099 838905716
652 838905716 838767471 838749619 838825455 838875809 838753967 838396301 837891998 837444534 837220917 837187042 837053299
663 837053299 836398392 834924088 832684402 830141144 827981491 826794891 826782913 827668991 828850555
672 828850555 829698944 829839172 829267197 828268661 827213287 826354752 825739059 825246658 824716568 824061127
682 824061127 823304596 822538147 821833191 821187592 820536499 819818268 819033356 818241959 817498398 816766968
692 816766968 815896454 814680252 812966232 810728760 808042984 804983063 801527557 797563705 792982407
701 792982407 787778473 782035599 775780411 768812561 760679321 750856323 739013519 725111389
709 725111389 709150543 690671158 668385315 640388107 605113602 562711716 516123695 471119804
717D71119804l6126289k0724182j963577J5475006K6922264K9294128K2158585P964897
725E14120636q600502k1954842k7304153k2197762p429199J3129654L3813820M9162292
733E22739944N5822602N3548889M4872818L3690414K3518372J6274261J2058716R817429
741G72343445Q323517O873779N413132M214019L468781L106766K883911K592850K196655
750H11416855J793976J494674J325989J234818J157608J075363J008377R69391R36661
759H22413712Q68682P48825O06308M92478M36630M23050M11530L79715L43856L37448
769H27462234L69721M04129L85361K89688J56402O7521Q8424K16370L80707M90188
779H30310745M92172L98636K64664J42365N1422j6175p3013j17035j34430j18179p7591
$$ plain form
717 471119804 434993515 414269333 412305756 427780762 454703026 483997154 506155739 514120636
725 514120636 505520134 483565292 456261139 434063377 426634178 439763832 473577652 522739944
733 522739944 578562546 632111435 676984253 710674667 734193039 750467300 762526016 772343445
741 772343445 780666962 787540741 792953873 797167892 800636673 803743439 806627350 809220200 811416855
750 811416855 813210831 814705505 816031494 817266312 818423920 819499283 820507660 821477051 822413712
759 822413712 823282394 824031219 824637527 825130005 825566635 825989685 826401215 826780930 827124786 827462234
769 827462234 827831955 828236084 828621445 828911133 829067535 829135056 829223480 829439850 829820557 830310745
779 830310745 830802917 831201553 831466217 831608582 831660004 831643829 831570816 831453781 831319351 831201172 831123581
790H31123581k8839J8158O5994J15204J46637J22375R461j84632l98101n38712n30243
801H29920883l57361p6294K14692M20990M91256M31061K93350J56403R7046J62887
811H31754913L50876N97534P98722Q49838O94733L50036j06964n81589r99145j318054
821H32390900j510849j541291j372375r99909m89959J8005L71170M83856L97416K60543
831H28007507K41013M17786P25097R88388J032028P88575L44848j07650l78495l81393
841H31677704j70212J03302K80838K79083J20926r3689k51770k87704k07978p8659
851H31371841J8540K6474o0959j99127l16315l47443k63519q7127J15737K62528K92206
862H30812836J93176J1520j72958k86255k94952k18888j12228k7161J4496K6627L6011
$$ plain form
790 831123581 831094742 831112900 831178894 831294098 831440735 831563110 831572571 831387939 830989838 830451126 829920883
801 829920883 829563522 829487228 829701920 830122910 830614166 831045227 831338577 831494980 831592026 831754913
811 831754913 832105789 832703323 833502045 834351883 835046616 835396652 835289688 834708099 833708954 832390900
821 832390900 830880051 829338760 827966385 826966476 826476517 826494522 826865692 827349548 827746964 828007507
831 828007507 828248520 828666306 829391403 830379791 831411819 832200394 832545242 832437592 832059097 831677704
841 831677704 831507492 831610794 831891632 832170715 832291641 832197952 831946182 831658478 831450500 831371841
851 831371841 831390381 831416855 831355896 831156769 830840454 830493011 830229492 830142365 830258102 830520630 830812836
862 830812836 831006012 831017532 830844574 830558319 830263367 830044479 829932251 829905090 829919586 829946213 829982224
873H29982224N5847P2632O1798Q926o7596j29090j40991j00937m2877j4801m5471j25809
885H29513855k14691k68479k69241k30179j81656j50528j44882j61209j95236k50778
895H27446976l36914m62113o33240q65936j190948j644059k230682k883453l443985
904H13755646l693009l430023k567978j198578M20609J944656L063507L606797L585357
913H15486984L158493K551499J960830J495591J170883R41696P54623N82505M31213
922H28534317L22800K67715K53830K51083K30179J80207J13372N1880J2741n645j8921
933H30193558m3793q3160j21766j34277j03683l2807N3177J19400J39847J09634M6540
944H30142670j8540o0730p1563o1036n0964n9738r1629j37558j78223j95694j81198
$$ plain form
873 829982224 830038071 830110703 830172501 830181427 830113831 829984741 829843750 829742813 829699936 829685135 829639664 829513855
885 829513855 829299164 829030685 828761444 828531265 828349609 828199081 828054199 827892990 827697754 827446976
895 827446976 827110062 826647949 826014709 825148773 823957825 822313766 820083084 817199631 813755646
904 813755646 810062637 806632614 804064636 802866058 803286667 805231323 808294830 811901627 815486984
913 815486984 818645477 821196976 823157806 824653397 825824280 826765976 827520599 828103104 828534317
922 828534317 828857117 829124832 829378662 829629745 829859924 830040131 830153503 830205383 830218124 830212479 830193558
933 830193558 830149765 830066605 829944839 829810562 829706879 829674072 829727249 829846649 829986496 830096130 830142670
944 830142670 830124130 830063400 829991837 829930801 829879837 829820099 829728470 829590912 829412689 829216995 829035797
955H29035797j37024p5760j3046L5324N7602N0125J7548k7619o7978r0255q8959p2021
967H28623734n5695n6610q3924j35040j97296k54211k92054l03878k90985k62452k34222
978H26457367k29111k70309l76663n52826p81784j025773j231231j344223j323853
987H19321594j156387q58841m77295p3090K92283N73120P50122Q29925Q35877P95288
997H20832596P30285O52543N67779M77982L85742K93350K03858J17340L5781l8757
1007H24258499j03989j59454k08130k56119l04489l46985l67355l48587k83432j83945
1017H21696014p7743j526J8616k1668j04599j95923k60391k75040k35900j58921p0343
1028H20312576j068K6703N570n5695j38550k22320k93503l48969l90396m17938m25263
$$ plain form
955 829035797 828898773 828823013 828809967 828845291 828902893 828953018 828970566 828942947 828874969 828784714 828695755 828623734
967 828623734 828568039 828511429 828427505 828292465 828095169 827840958 827548904 827245026 826954041 826691589 826457367
978 826457367 826228256 825957947 825581284 825028458 824246674 823220901 821989670 820645447 819321594
987 819321594 818165207 817306366 816829071 816755981 817048264 817621384 818371506 819201431 820037308 820832596
997 820832596 821562881 822215424 822783203 823261185 823646927 823940277 824144135 824261475 824297256 824258499
1007 824258499 824154510 823995056 823786926 823530807 823226318 822879333 822511978 822163391 821879959 821696014
1017 821696014 821618271 821616745 821635361 821613693 821509094 821313171 821052780 820777740 820541840 820382919 820312576
1028 820312576 820311508 820338211 820343781 820288086 820149536 819927216 819633713 819284744 818894348 818476410 818051147
1039H18051147m07104l69034l37066l54310m58526o55289q99963j104203j172027j046982
1049H11246643p45621l57513p248K02484K32315J19324n4855k08054k96783l24479
1059H09806213l23028l23868l35541l46451l38668l07312k66724k43759k61078l27683
1069H06732101m33731n56945o70701p50274p78198p46308o58417n27191l73382k16675
1079H01020279p3700M3259J27029J71661J77918J55640J27258J19552J52894K29034
1089H02250824L30200M27857M99115N36346N47028N41381N22156M81644M08859L03269
1099H06848679J82037P1182m272l5630l1204j1215N569Q317k594k1744m1199n3406
1111H06914520n3711l9367j5259R308K1743J5107q011l6087n6458o3705o4621p4768
$$ plain form
1039 818051147 817644043 817275009 816937943 816583633 816125107 815469818 814569855 813465652 812293625 811246643
1049 811246643 810501022 810143509 810136261 810338745 810571060 810690384 810635529 810427475 810130692 809806213
1059 809806213 809483185 809159317 808823776 808477325 808138657 807831345 807564621 807320862 807059784 806732101
1069 806732101 806298370 805741425 805070724 804320450 803542252 802795944 802137527 801610336 801236954 801020279
1079 801020279 800946579 800989838 801116867 801288528 801466446 801622086 801749344 801868896 802021790 802250824
1089 802250824 802581024 803008881 803507996 804044342 804591370 805132751 805654907 806136551 806545410 806848679
1099 806848679 807030716 807101898 807097626 807061996 807030792 807019577 807025146 807033463 807030869 807009125 806967926 806914520
1111 806914520 806860809 806821442 806806183 806815491 806837234 806852341 806844330 806808243 806751785 806688080 806623459 806548691
1123H06548691j06964j63346k29873k84195l03269k76947k09198j18942k6932M4480
1133H04873505Q6517R8801R0866P6599O5842O0424N4016L6240k29n3558j14060j66473
1145H05108490j98822k06146j93253j71738j54266j48926j57470j75095j93405k05155
1155H03304214k05612j93786j69602j33667q6517l2425J9836N9205P7972P6675O2027
1166H02778320M0207M196o6986j95312l81470n83343p20673p05261m88510r6665L67813
1177G99952316P65076R80835R73892P90177N29632K92816J36566O1951L1510N645l1967
1188H04488449p2479r5825r1858o9657n0811n3482q0338j15433j38244j36109j14517
1199H03469696r5291j01624j45034k15836k88620l34625l38745l03803k50168k01950
$$ plain form
1123 806548691 806441727 806278381 806048508 805764313 805461044 805184097 804974899 804855957 804829025 804873505
1133 804873505 804960022 805058823 805149689 805226288 805292130 805352554 805406570 805442810 805442581 805389023 805274963 805108490
1145 805108490 804909668 804703522 804510269 804338531 804184265 804035339 803877869 803702774 803509369 803304214
1155 803304214 803098602 802904816 802735214 802601547 802515030 802482605 802502441 802561646 802639618 802716293 802778320
1166 802778320 802818527 802822723 802755737 802560425 802178955 801595612 800874939 800169678 799681168 799584503 799952316
1177 799952316 800717392 801698227 802672119 803462296 803991928 804284744 804421310 804483261 804514771 804520416 804488449
1188 804488449 804415970 804320145 804228287 804158630 804107819 804054337 803973999 803858566 803720322 803584213 803469696
1199 803469696 803374405 803272781 803127747 802911911 802623291 802288666 801949921 801646118 801395950 801194000
1209H01194000j74484j70288j78299j88370j92108j90506j87530j85776j82953j74942
1219G99368744j58081j34278j09558r3612r3842j12991j46713j84174k07672k01111
1229G97926712j55945p6294J7853R9182J42899J38015R1706K4566m0512q9340j20468
1240G97958374j41373j61438j82724j99432k02713j87531j55868j17874q5221o4773
1250G96459427n7907o2561p8354j09558j62812k40097l32489m22821m88281n12237
1260G93992310m94690m47541l91235l43781l11889k94113k84119k77481k71759k66724
1270G90608978k59704k51084k44674k50168k79083l36228m13895m92935n51605n80444
1280G86949158n86167n88302o08292o55899p26852q06656q82721r47800j006012j063003
$$ plain form
1209 801194000 801019516 800849228 800670929 800482559 800290451 800099945 799912415 799726639 799543686 799368744
1219 799368744 799210663 799076385 798966827 798873215 798779373 798666382 798519669 798335495 798127823 797926712
1229 797926712 797770767 797694473 797712326 797811508 797954407 798092422 798184128 798208694 798168182 798078842 797958374
1240 797958374 797817001 797655563 797472839 797273407 797070694 796883163 796727295 796609421 796524200 796459427
1250 796459427 796401520 796338959 796260605 796151047 795988235 795748138 795415649 794992828 794504547 793992310
1260 793992310 793497620 793050079 792658844 792315063 792003174 791709061 791424942 791147461 790875702 790608978
1270 790608978 790349274 790098190 789853516 789603348 789324265 788988037 788574142 788081207 787529602 786949158
1280 786949158 786362991 785774689 785166397 784510498 783783646 782976990 782094269 781146469 780140457 779077454
1290G79077454j122208j182022j233292j264114j260758j211853j111908r66720p93381
1299G68931198o15921m56085l24936k15988j11237J1597J67541L59421N76706Q00705
1309G69123001J007385J173706J282731J329193J322250J282043J233368J193238J166610
1318G80113525J144867J113358J060181R80453Q76389P55081O24389M90570L58048
1327G87516861K26898Q9798o7291k61841n05829p96966j116257j431198j706238j913071
1337G80034866k036285k079239k061462k016602j984177j997909k072067k192078k314682
1346G61280365k379990k328949k125473j764221j276703p24106j91268K30484M59976
1355G51180115M47616J87607k78625q76999j520767k127305k624053k940217k998962
$$ plain form
1290 779077454 777955246 776773224 775539932 774275818 773015060 771803207 770691299 769724579 768931198
1299 768931198 768315277 767859192 767534256 767318268 767207031 767218628 767386169 767745590 768322296 769123001
1309 769123001 770130386 771304092 772586823 773916016 775238266 776520309 777753677 778946915 780113525
1318 780113525 781258392 782371750 783431931 784412384 785288773 786043854 786668243 787158813 787516861
1327 787516861 787743759 787833557 787766266 787504425 786998596 786201630 785085373 783654175 781947937 780034866
1337 780034866 777998581 775919342 773857880 771841278 769857101 767859192 765787125 763595047 761280365
1346 761280365 758900375 756571426 754445953 752681732 751405029 750680923 750489655 750720139 751180115
1355 751180115 751627731 751815338 751536713 750659714 749138947 747011642 744387589 741447372 738448410
1364G38448410k724304k062302j014709L32565J813660L209305M308166M965286N147095
1373G52423172M934387M491272L999939L597565L332672L164215K997284K738647K347489
1382G84026642J850509J328049Q75550N60531M03824L74908M07486M29688L84979K52915
1392G90895081N7601j47018l00827l68042l54385k99988k54517k46124k68936k95868
1402G88416977l06778l07007l29361m06189n44128p11670q55332r28115r18351q58841
1412G82251205q13293q51288j019058j320038j709900k112198k451858k697907k889175
1421G66386490l122330l505936m095458m854279n667191o396026o943817p286377p454987
1430G17060089p492218p421493p248230o982193o647339o268540n846786n362091m809265
$$ plain form
1364 738448410 735724106 733661804 732647095 732979660 734793320 738002625 742310791 747276077 752423172
1373 752423172 757357559 761848831 765848770 769446335 772779007 775943222 778940506 781679153 784026642
1382 784026642 785877151 787205200 788080750 788641281 789045105 789420013 789827499 790257187 790642166 790895081
1392 790895081 790952682 790805664 790504837 790136795 789782410 789482422 789227905 788981781 788712845 788416977
1402 788416977 788110199 787803192 787473831 787067642 786523514 785811844 784956512 784028397 783110046 782251205
1412 782251205 781437912 780586624 779567566 778247528 776537628 774425430 771973572 769275665 766386490
1421 766386490 763264160 759758224 755662766 750808487 745141296 738745270 731801453 724515076 717060089
1430 717060089 709567871 702146378 694898148 687915955 681268616 675000076 669153290 663791199 658981934
1439F58981934m245606l791199l571167l632583l911743m302140m779777n481415o640816
1448F18625488q401947j0654106j3043098j5215988j7148133j9284859k2317237k6637993
1456D85922127l1795502l6337166l8237953l5778084k8437462j7339954n006447N476933
1464B98466492J1514358J1871414P093316o08902p951584j1503907q761386R39693
1472C01059494J6011677L2972736M7567787N6266671N7505989N2112732M2717285L2491073
1480F38705444K3864136J7826691J4044876J1548385R485856P530441N818558M610977
1488G33435364L993759L797989L730697L560257L209992K736893K253265J872711J692963
1497G60283890J778030K111817K551803K846298K745285K159653J252136L84674p4920
$$ plain form
1439 658981934 654736328 650945129 647373962 643741379 639829636 635527496 630747719 625266304 618625488
1448 618625488 610223541 599569435 586526337 571310349 554162216 534877357 512560120 485922127
1456 485922127 454126625 417789459 379551506 343773422 315335960 297996006 292989559 298466492
1464 298466492 309980850 321852264 328945580 328336678 320385094 308881187 300119801 301059494
1472 301059494 317071171 350043907 397611694 453878365 511384354 563497086 606214371 638705444
1480 638705444 662569580 680396271 694441147 705989532 715475388 723005829 728824387 733435364
1488 733435364 737429123 741227112 744957809 748518066 751728058 754464951 756718216 758590927 760283890
1497 760283890 762061920 764173737 766725540 769571838 772317123 774476776 775728912 776113586 776038666
1506G76038666L6697N89371J246948J676254J728287J483841J150818R01260P73850
1515G85625992O90384N50155L24631P1030j18256j83792j27792Q697J86310L82690
1525G87410049N75104P19147P57675O65054M89045L44390L47672N29251P88269R35059
1535G93560715P98874L42407k98386q75091j149597j015549n39475P9193O12412R01260
1545G92416763R10874P27081N02930L89251M65699P01980R58939J042480P94373J83182
1555G99093552o47507j417999j823426j675796j001511m0283Q53806J370391J371994
1564G96083221R44519L37372j60904l59497k41012M6081K78397K79693J0682m12522
1574G96806030p85751r30328p87278m46167q5907J30844J40915L968j55258k30713
$$ plain form
1506 776038666 776075363 776664734 777911682 779587936 781316223 782800064 783950882 784852142 785625992
1515 785625992 786316376 786866531 787191162 787262192 787143936 786960144 786832352 786841049 787027359 787410049
1525 787410049 787985153 788704300 789461975 790127029 790616074 790960464 791308136 791837387 792625656 793560715
1535 793560715 794359589 794701996 794403610 793528519 792378922 791363373 790823898 790903091 791515503 792416763
1545 792416763 793327637 794054718 794557648 794946899 795412598 796114578 797073517 798115997 798910370 799093552
1555 799093552 798446045 797028046 795204620 793528824 792527313 792487030 793340836 794711227 796083221
1564 796083221 797027740 797365112 797204208 796844711 796603699 796649780 796928177 797207870 797218552 796806030
1574 796806030 796020279 795089951 794302673 793856506 793770599 793901443 794042358 794046326 793891068 793660355
1584G93660355j92795q8349R995N9051O5537O4316P9574J05515J16577R9411O5079
1595G94044266M3869N4474R1323J27793J42288J31531J08642Q1406M4327j0758o8664
1606G94790497q4305q545J63117L58429M52957L43246K6627l73612o65588o97098m47159
1617G93858566m1504L19443M73480L73917R8114k11411m26101m76074l59345j16730
1627G93492355J83030M49981N75714M58222M9515n95704j307678j845245j988297j641464
1637G87830429q84018M3945Q43430J285019J312485J069488Q22296Q06809J088714
1646G94218597J500016J720810J464614O73371m02451j295776j567612j052551K6627
1655G95285645J163406J836624J786270J138306L05023k68707l54920m1656L68271
$$ plain form
1584 793660355 793467560 793379211 793389206 793448257 793513794 793578110 793657684 793763199 793879776 793979187 794044266
1595 794044266 794088135 794142609 794233932 794361725 794504013 794635544 794744186 794825592 794869919 794859161 794790497
1606 794790497 794706192 794697647 794860764 795219193 795672150 796015396 796042023 795668411 795002823 794305725 793858566
1617 793858566 793817062 794136505 794609985 794983902 795082016 794870605 794444504 793968430 793609085 793492355
1627 793492355 793675385 794125366 794701080 795159302 795208817 794613113 793305435 791460190 789471893 787830429
1637 787830429 786946411 786990356 787833786 789118805 790431290 791500778 792323074 793129883 794218597
1646 794218597 795718613 797439423 798904037 799577408 799174957 797879181 796311569 795259018 795285645
1655 795285645 796449051 798285675 800071945 801210251 801515274 801246567 800891647 800849991 801218262
1664H01218262N71212M50745J17874j98593l25851k57264j30233r9869k03934l28369
1674H00813980k86713K6932N32456R78546J076050O77337j19095r99221j585846j628495
1684G99485931j120300k85950N46189J105728J288910J163482Q86307N95322L40042
1693H04005661Q5297k27814o11496r95789j254043j267777r96246n12848K2736M30832
1703G98678513N97381N25971L30810J72959J74942L47213N82657P10068N85556J76086
1713H02882156m14199r82819j317520j291199r17969l45535K11563N65949O41708M97131
1723G99529266K89002J75476K25677L70865M43039K79694j62049p54547j250534j414795
1733G97731094j160507o05697j0529L70102M22592K28729m883q2092O4545L45993N86319
$$ plain form
1664 801218262 801789474 802240219 802358093 802159500 801833649 801576385 801446152 801346283 801142349 800813980
1674 800813980 800527267 800554199 801086655 802065201 803141251 803818588 803699493 802700272 801114426 799485931
1684 799485931 798365631 798079681 798625870 799731598 801020508 802183990 803070297 803665619 804005661
1693 804005661 804090958 803863144 803251648 802255859 801001816 799734039 798737793 798224945 798247681 798678513
1703 798678513 799275894 799801865 800132675 800305634 800480576 800827789 801410446 802120514 802706070 802882156
1713 802882156 802467957 801485138 800167618 798876419 797958450 797612915 797824478 798390427 799032135 799529266
1723 799529266 799818268 799993744 800219421 800590286 801033325 801313019 801150970 800396423 799145889 797731094
1733 797731094 796570587 795964890 795954361 796324463 796747055 796975784 796970901 796888809 796953354 797299347 797885666
1744G97885666O37970M66308J58539j36032k92587k64816r1935J38245L37372M45404
1754G99284134M43802L46832J88904J3733j33515k15606k07215j00479Q8043L12882
1764H00021515N01633N71746M62494J71891k23694n89371p85599p35931m68369r9029
1774G98827286K26364M02603M08478K93350J32828j3581j17111j65024j41906l6621
1784G99816666J33590L02430L67660K47955n6533m40064p31583p87200n72968j89667
1794G98090286J77536L62931L01055N6992k23694l97110l94821k47040n2109Q0109
1804G97754135Q3389m1503k35825m18396n24750n33142m68521l80173l11508k74506
1814G94649200k46200j90811q6212N6991K02484L13187L74603L98331M04663M00543
$$ plain form
1744 797885666 798523636 798989944 799148483 799012451 798719864 798455048 798363113 798501358 798838730 799284134
1754 799284134 799727936 800074768 800263672 800277405 800143890 799928284 799721069 799620590 799708633 800021515
1764 800021515 800523148 801094894 801557388 801729279 801505585 800916214 800130615 799394684 798926315 798827286
1774 798827286 799053650 799456253 799864731 800158081 800290909 800277328 800160217 799995193 799853287 799816666
1784 799816666 799950256 800252686 800620346 800868301 800811768 800371704 799640121 798852921 798279953 798090286
1794 798090286 798267822 798630753 798931808 798988800 798765106 798367996 797973175 797726135 797674026 797754135
1804 797754135 797837524 797796021 797560196 797141800 796617050 796083908 795615387 795235214 794923706 794649200
1814 794649200 794403000 794212189 794125977 794182968 794385452 794698639 795073242 795471573 795876236 796276779
1824G96276779L73459L07236K07672J12839P1334J09253K02485K88696L10364K58026
1834G98518143J81808J54648K12097L16696L72086K86560M2572k79083n39475o17981
1844G98648071m82559k05917Q1024K60239K84881J89362N2643n1117r0943q1024o0196
1855G98544464o1569r1095j27258j36643r4909j0376P7819J10398M2114j28632l48968
1866G97775345n30319n91278n02549l05328q8120N8289Q8043J5106j05819k19345k98691
1877G95295334l48206l84826m18930m46854m68750m98657n68466p03660r00955j117019
1887G89439011j286240j354980j309510j177978j008225q36563o69098m91256k89078
1896G81016083o8360J43662L16543M38309N16129N71060O11343O28052O02036N26428
$$ plain form
1824 796276779 796650238 796957474 797165146 797277985 797349319 797458572 797661057 797949753 798260117 798518143
1834 798518143 798699951 798854599 799066696 799383392 799755478 800042038 800084610 799805527 799266052 798648071
1844 798648071 798165512 797959595 798040619 798300858 798585739 798775101 798827744 798776627 798685684 798604660 798544464
1855 798544464 798482895 798391800 798264542 798127899 798032990 798022614 798100433 798210831 798252945 798124313 797775345
1866 797775345 797245026 796653748 796151199 795845871 795757751 795816040 795904083 795919189 795813370 795594025 795295334
1877 795295334 794947128 794562302 794143372 793696518 793227768 792729111 792160645 791456985 790556030 789439011
1887 789439011 788152771 786797791 785488281 784310303 783302078 782465515 781796417 781305161 781016083
1896 781016083 780947723 781091385 781407928 781846237 782362366 782933426 783544769 784172821 784774857 785301285
1906G85301285M21295L31345L00140L42026M28238M98504M97284M06113K54669J06659
1916G88887558J9989J7014P5912J45874J81580J67007J22070Q2779P6828J06964J50452
1927G90034027J75781J62659J11389M3411j3504l6850j9607K8839Q6441J27029J28937
1938G90828552Q4534M883q2855j45874j60828j26724o4850r461J3581k213l8452o6147
1950G90234146o4316l2501R918L6164K8686q087n2109p4157n5924J984P8964J46027
1962G90248795J79061J70289J29013P4768K8534Q39p477m349J450P019J3351K3499
1974G90864792L6774M6615M5319K9297K746k1210l0136j7471R537L3645L5782O104
1986G91041794n1651j20087j78680k12250k19727k11792k04162k08359k29034k59247
$$ plain form
1906 785301285 785722580 786053925 786354065 786696091 787124329 787622833 788120117 788526230 788780899 788887558
1916 788887558 788907547 788924561 789000473 789146347 789327927 789494934 789617004 789699783 789776611 789883575 790034027
1927 790034027 790209808 790372467 790483856 790527267 790513763 790476913 790457306 790486145 790572586 790699615 790828552
1938 790828552 790913086 790917969 790835114 790689240 790528412 790401688 790336838 790327377 790340958 790338745 790300293 790234146
1950 790234146 790169830 790137329 790147247 790183411 790212097 790204010 790151901 790077744 790021820 790023804 790102768 790248795
1962 790248795 790427856 790598145 790727158 790801926 790830460 790831299 790823822 790819473 790820923 790827942 790841293 790864792
1974 790864792 790901566 790948181 790993500 791022797 791025543 791004333 790974197 790956726 790966263 790999908 791035690 791041794
1986 791041794 790990143 790870056 790691376 790479126 790259399 790047607 789843445 789635086 789406052 789146805
1996G89146805k90528l17611l40958l69186m10614m71802n54810o56433p72247q97446
2006G84065170j028366j163330j300506j436692j562576j658707j695175j638641j465378
2015G71115799j175385q00552l96805k4338K73514M84238O24390P20367P92999Q44651
2025G72458878Q65249Q46634P93839P23953O60171O14548N85098N59082N24750M77371
2035G79109573M23661L74679L38822L18603L11432L12195L18298L25165L28979L24097
2045G82485504L07694K82058K53830K32926K24533K27127K35748K41776K41699K35672
2055G84968567K27508K18583K08358J92948J67999J34888R8724O9656N6687O4545Q9187
2066G86497650J19171J39542J38092J10855O5842J7776j7395l1585k5406q164J0529
$$ plain form
1996 789146805 788856277 788538666 788197708 787828522 787417908 786946106 786391296 785734863 784962616 784065170
2006 784065170 783036804 781873474 780572968 779136276 777573700 775914993 774219818 772581177 771115799
2015 771115799 769940414 769139862 768743057 768718719 768992233 769476471 770100861 770821228 771614227 772458878
2025 772458878 773324127 774170761 774964600 775688553 776348724 776963272 777548370 778107452 778632202 779109573
2035 779109573 779533234 779907913 780246735 780565338 780876770 781188965 781507263 781832428 782161407 782485504
2045 782485504 782793198 783075256 783329086 783562012 783786545 784013672 784249420 784491196 784732895 784968567
2055 784968567 785196075 785414658 785623016 785815964 785983963 786118851 786217575 786287231 786343918 786408463 786497650
2066 786497650 786616821 786756363 786894455 787005310 787071152 787088928 787071533 787039948 787014542 787006378 787016907
2077G87016907K3498L0899L4256L5858L5248L0136K0829J0223M044N416J4801K6551
2089G87288666L4790L4637K7008J3657j602j6709l1738m5471n7297o5079o8893o8588
2101G87043381o5766n8517m3717j8157J7929N5999Q3313Q7509O3401J6861l7461q4915
2113G87059860j15890j31302j36032j36414j32599j22451j04142q2321o6757o9885
2123G85962067r5291j38550j85089k20566k36359k34985k26059k22092k30636k52991
2133G83919449k84348l15323l35998l37982l18909k82288k39410k04163j86462j87454
2143G81227112j97067k00196j85165j50528j06506o5995l6316j5030R308M4861Q9951
2154G80414429J30996J51291J41373J08566P2174N3788O5765J02081J44348J71662
$$ plain form
2077 787016907 787040405 787071304 787105560 787141418 787176666 787206802 787227631 787237854 787241898 787247314 787262115 787288666
2089 787288666 787323456 787358093 787385101 787398758 787397156 787380447 787348709 787303238 787245941 787180862 787111969 787043381
2101 787043381 786977615 786919098 786875381 786857224 786875153 786931152 787014465 787101974 787165375 787182236 787144775 787059860
2113 787059860 786943970 786812668 786676636 786540222 786407623 786285172 786181030 786098709 786031952 785962067
2123 785962067 785866776 785728226 785543137 785322571 785086212 784851227 784625168 784403076 784172440 783919449
2133 783919449 783635101 783319778 782983780 782645798 782326889 782044601 781805191 781601028 781414566 781227112
2143 781227112 781030045 780829849 780644684 780494156 780387650 780321655 780285339 780270309 780279617 780324478 780414429
2154 780414429 780545425 780696716 780838089 780946655 781018829 781072617 781138382 781240463 781384811 781556473
2164G81556473J72195J48621J16348R0256P7820P5607P2708N9662L2959j068l3493
2175G82368088n7144p1106p8507q2702q3161p6599o1569m1275k4872k2507l6468n8213
2187G81673965p1258o0196k0905L4180Q3008J03607Q6670L9139j7777o2332q1329p4005
2199G81632767n1651k8229j4343j3123k1744l3874m5548n5923o7673q2397j01319j21841
2211G80995102j40991j56250j68534j79290j87760j90124j77079j41906q2703r384
2221G79561081O0959J08261J20850R7961N0430q011o6299j20850j76010k37274l08609
2232G79082489l91617m82559n75562o59103p18613p36694o99615o03486m57458k82440
2242G73475342j05896M6539J57318K17743K27966J95771J33514N8136j1825o1112q3465
$$ plain form
2164 781556473 781728668 781877289 781993637 782083893 782161713 782237320 782310028 782369690 782402649 782401581 782368088
2175 782368088 782310944 782239838 782161331 782078629 781995468 781918869 781857300 781816025 781791153 781768646 781732178 781673965
2187 781673965 781602707 781542511 781521606 781555786 781638794 781742401 781829071 781868210 781850433 781788101 781706772 781632767
2199 781632767 781581116 781552887 781538544 781525421 781503677 781469803 781424255 781368332 781300659 781218262 781116943 780995102
2211 780995102 780854111 780697861 780529327 780350037 780162277 779972153 779795074 779653168 779570465 779561081
2221 779561081 779622040 779730301 779851151 779949112 779999542 779991531 779925232 779804382 779628372 779391098 779082489
2232 779082489 778690872 778208313 777632751 776973648 776255035 775518341 774818726 774215240 773757782 773475342
2242 773475342 773369446 773415985 773573303 773791046 774019012 774214783 774348297 774406433 774394608 774333496 774250031
2253G74250031q3924p6904p9346j01166j41601j88904k27203k46964k50091k50931
2263G72602997k69394l21655m11225n24521o33850p05490p13882o50254n27572l76740
2273G67468414k33459j24817o1264l3493k4109j6403o409k441j8921o5232j37252k19727
2285G66524887k91366l35312l46985l34244l12729k99377l06015l35694l84369m40826
2295G63137970m94766n37873n66787n84870n95855o02570o06537o10657o24008o61392
2305G57252655p37152q53500r90754j110687j172562j156997j081162r99069r75494
2314G48175278j056366j244049j493454j733628j893463j932144j846619j668853j451187
2323G33855515j246872j092759r99679r47495q98513q16727o89011n35431l99093l20053
$$ plain form
2253 774250031 774166107 774089203 774009857 773908691 773767090 773578186 773350983 773104019 772853928 772602997
2263 772602997 772333603 772011948 771600723 771076202 770442352 769736862 769022980 768372726 767845154 767468414
2273 767468414 767234955 767110138 767048874 767015381 766991272 766974869 766968460 766966019 766947098 766881866 766744614 766524887
2285 766524887 766233521 765898209 765551224 765216980 764904251 764604874 764298859 763963165 763578796 763137970
2295 763137970 762643204 762105331 761538544 760953674 760357819 759755249 759148712 758538055 757914047 757252655
2305 757252655 756515503 755662003 754671249 753560562 752388000 751231003 750149841 749150772 748175278
2314 748175278 747118912 745874863 744381409 742647781 740754318 738822174 736975555 735306702 733855515
2323 733855515 732608643 731515884 730516205 729568710 728670197 727853470 727164459 726629028 726229935 725909882
2333G25909882l15628l76816m84696o33697q31528j070328j286087j340866j060943
2342G18509293l31116Q10165K127457L250046L814163L625107K747650J476517K04086
2351G36233368p48749j245193j343766j219482j047668r19724q27866p02896m80728
2360G27697296j44119K68936O85806J037827J281128J412582J460266J471100J489945
2369G36660767J545791J641083J758347J871566J962662K029266K080918K124252K151871
2378G53826523K140045K062531J905136J679229J416321J153870R18503P17697N45654
2387G66365509L94363K62833J55869Q0261L2806L510k2125n1499q2626j06049j12915
2398G66919937j02157q3237o9733p4234j01318j50147k14233k85339l53547m08020
$$ plain form
2333 725909882 725594254 725217438 724732742 724099045 723267517 722197189 720911102 719570236 718509293
2342 718509293 718178177 718988342 721115799 724365845 728180008 731805115 734552765 736029282 736233368
2351 736233368 735484619 734239426 732895660 731676178 730628510 729708786 728880920 728178024 727697296
2360 727697296 727553177 727822113 728507919 729545746 730826874 732239456 733699722 735170822 736660767
2369 736660767 738206558 739847641 741605988 743477554 745440216 747469482 749550400 751674652 753826523
2378 753826523 755966568 758029099 759934235 761613464 763029785 764183655 765102158 765819855 766365509
2387 766365509 766759872 767022705 767178574 767258835 767291641 767295151 767273026 767221527 767138901 767032852 766919937
2398 766919937 766817780 766734543 766664810 766590576 766489258 766339111 766124878 765839539 765485992 765077972
2408G65077972m36401m30450l89481l21579k43378j68838j05972n0736P706P9040J62888
2419G63180771K48566L17764L56521L61786L41339L11203K85645K69852K62222K54288
2429G66189957K39181K14768J82953J47552J13297Q2550N8746M4632M1351M7150N6152
2440G67418289N9052M8294K3346r766l9596n6611n8517n2414m9286n8822q1482j10245
2452G67032242j33896j45493j45874j43432j47019j60904j82266k04773k23083k41776
2462G65303726k71301l25699m10461n18570o27976p08847p34176o90461n81588m28086
2472G60006561k60391j09863Q39O0272P0267M0588j0757o8131j16577j49002j65100
2483G59298706j70441j71966j73874j74942j68762j50528j19477q4915o0577o0883
$$ plain form
2408 765077972 764641571 764211121 763821640 763500061 763256683 763087845 762981873 762931137 762938843 763017883 763180771
2419 763180771 763429337 763747101 764103622 764465408 764806747 765117950 765403595 765673447 765935669 766189957
2429 766189957 766429138 766643906 766826859 766974411 767087708 767170258 767229004 767273636 767314987 767362137 767418289
2440 767418289 767477341 767525635 767548981 767539215 767499619 767443008 767384491 767332077 767282791 767223969 767142487 767032242
2452 767032242 766898346 766752853 766606979 766463547 766316528 766155624 765973358 765768585 765545502 765303726
2462 765303726 765032425 764706726 764296265 763777695 763149719 762440872 761706696 761016235 760434647 760006561
2472 760006561 759746170 759636307 759637146 759697418 759767685 759808273 759797516 759729385 759612808 759463806 759298706
2483 759298706 759128265 758956299 758782425 758607483 758438721 758288193 758168716 758083801 758023224 757962341
2493G57962341r0561j43356k03476k52228k76184k72064k44064k04392j63955j33667
2503G55978394j20316j29395j62506k17895k86102l55835m13590m51431m71878m86527
2513G52882919n13763n68924o55441p61719q61817r25598r30252q67920p49740n97687
2523G45450058m34570k76642j31760r15J12457K02484K63214K92359K95791K80991
2533G46053467K52762K05230J23062q621j93710m15878o40259q25577r37042r58023
2543G42655411q95462p70722o14319m56085l20205k21177j63726j42289j45340j59530
2553G38766556j74256j85852j97448k15073k44751k86484l36609l85818m25186m49219
2563G35865860m56924m55170m53034m60739m83093n18265n58395n94711o21796o39877
$$ plain form
2493 757962341 757871780 757728424 757524948 757272720 756996536 756724472 756480408 756276016 756112061 755978394
2503 755978394 755858078 755728683 755566177 755348282 755062180 754706345 754292755 753841324 753369446 752882919
2513 752882919 752369156 751800232 751144791 750383072 749521255 748595657 747665405 746797485 746047745 745450058
2523 745450058 745015488 744738846 744607086 744606171 744718628 744921112 745184326 745476685 745772476 746053467
2533 746053467 746306229 746511459 746634521 746625900 746432190 746016312 745376053 744550476 743613434 742655411
2543 742655411 741759949 740989227 740374908 739918823 739598618 739377441 739213715 739071426 738926086 738766556
2553 738766556 738592300 738406448 738209000 737993927 737749176 737462692 737126083 736740265 736315079 735865860
2563 735865860 735408936 734953766 734500732 734039993 733556900 733038635 732480240 731885529 731263733 730623856
2573G30623856o52390o62002o68641o67266o56052o38428o24924o29272o61926p23572
2583G24039383q04672q88977r60694j009216j030197j025238j000595r65042r28650
2592G15426102q99659q81881q71277q57086q30078p87888p39288p04575p02438p43408
2602G07408524q22144r18808j010437j081543j129761j165847j204300j254197j315307
2611F97506180j378861j432342j467896j483154Tj475220j466751j464310j471939
2620F84382553j493988j532440j587601j655578j728058j790619j827851j821517j757050
2629F69187851j624374j421967j158600q51288n27725k15149O1951K87323M55704N68466
2639F64762192O31637O50940O29883N70374M77142L54996K13470O3400q5983k25372
$$ plain form
2573 730623856 729971466 729309464 728640823 727973557 727317505 726679077 726054153 725424881 724762955 724039383
2583 724039383 723234711 722345734 721385040 720375824 719345627 718320389 717319794 716354752 715426102
2592 715426102 714526443 713644562 712773285 711916199 711086121 710298233 709558945 708854370 708151932 707408524
2602 707408524 706586380 705667572 704657135 703575592 702445831 701279984 700075684 698821487 697506180
2611 697506180 696127319 694694977 693227081 691743927 690260773 688785553 687318802 685854492 684382553
2620 684382553 682888565 681356125 679768524 678112946 676384888 674594269 672766418 670944901 669187851
2629 669187851 667563477 666141510 664982910 664131622 663603897 663388748 663450699 663738022 664193726 664762192
2639 664762192 665393829 666044769 666674652 667245026 667722168 668077164 668290634 668354034 668268051 668042679
2649F68042679l49350m51203n24978n64652n63965n21545m38461l21045j78757k2278
2659F64106445J35727K84806M18319N33142O33622P27767Q23288R23157J024170J112671
2669F70723114J174774J197968J178055J121749J041718R52682Q65708P87048P18384
2678F79761200O58340O04172N52292M99496M44336L88642L36914K93808K61764K36664
2688F84037628K09580J72119J18179M7531l5934j29166k31857l45383m67529n90210
2698F82784958o98090p74688q10471q06580p74154p28913o83059o42701o07376n75103
2708F75683823n45273n19791n00488m88587m82788m83017m90493n09262n41001n86014
2718F70537109o40106o97632p53631q07343q58917r07898r52454r88693j015701j035614
$$ plain form
2649 668042679 667693329 667242126 666717148 666152496 665588531 665066986 664628525 664307480 664128723 664106445
2659 664106445 664242172 664526978 664945297 665478439 666112061 666839828 667663116 668586273 669610443 670723114
2669 670723114 671897888 673095856 674273911 675395660 676437378 677390060 678255768 679042816 679761200
2678 679761200 680419540 681023712 681576004 682075500 682519836 682908478 683245392 683539200 683800964 684037628
2688 684037628 684247208 684419327 684537506 684585037 684549103 684419937 684188080 683842697 683375168 682784958
2698 682784958 682086868 681312180 680501709 679695129 678920975 678192062 677509003 676866302 676258926 675683823
2708 675683823 675138550 674618759 674118271 673629684 673146896 672663879 672173386 671664124 671123123 670537109
2718 670537109 669897003 669199371 668445740 667638397 666779480 665871582 664919128 663930435 662914734 661879120
2728F61879120j054535j075668j094666j097031j065063r84879q57391o99081n35736
2737F53415070l91617k77786j91041j19018n2261O866M4785M1656j4954j24130k67029
2748F52070541m17480n48477o46363p13272p66143q26722r11712j023178j147004j256866
2758F43813324j329575j353454j337357j307220j293335j316872j382522j479035j588363
2767F31425591j697007j798439j894684j990013k086181k184906k287331k398033k520905
2776F12568092k655449k796325k934227l064347l188133l316383l458672l616333l779297
2785E83758926l927765m043159m115143m145622m143868m121551m087944m047165m003563
2794E47123146l959694l917198l878899l845558l821335l814506l832970l882789l961449
$$ plain form
2728 661879120 660824585 659748917 658654251 657557220 656492157 655507278 654649887 653950806 653415070
2737 653415070 653023453 652745667 652554626 652435608 652383347 652390213 652434998 652476654 652461700 652337570 652070541
2748 652070541 651653061 651104584 650458221 649744949 648978806 648152084 647240372 646217194 645070190 643813324
2758 643813324 642483749 641130295 639792938 638485718 637192383 635875511 634492989 633013954 631425591
2767 631425591 629728584 627930145 626035461 624045448 621959267 619774361 617487030 615088997 612568092
2776 612568092 609912643 607116318 604182091 601117744 597929611 594613228 591154556 587538223 583758926
2785 583758926 579831161 575788002 571672859 567527237 563383369 559261818 555173874 551126709 547123146
2794 547123146 543163452 539246254 535367355 531521797 527700462 523885956 520052986 516170197 512208748
2803E12208748m060288m167060m276124m389228m517670m669876m846382n035973n222320
2812D71023827n393029n550575n710297n896606o128387o411438o738396p091942p457886
2821D14645271p828712q207665q601188r014016r444389r885712j0336189j0803375
2829C40524025j1308212j1875038j2519398j3234768j3989372j4729844j5391845j5906639
2837B31568909j6201077j6192760j5795021j4931527j3568697j1744022r580498p267074
2845A26288233n014582k998829j316299L0489J115350K050219K944584L876190M877405
2854A31852760N938292P014189Q039083Q936930R635696J0077229J0224533J0064087
2862B01782799R603634Q866119P886581O707917N376491L940239K446442R39541n34973
$$ plain form
2803 512208748 508148460 503981400 499705276 495316048 490798378 486128502 481282120 476246147 471023827
2812 471023827 465630798 460080223 454369926 448473320 442344933 435933495 429195099 422103157 414645271
2821 414645271 406816559 398608894 390007706 380993690 371549301 361663589 351327400 340524025
2829 340524025 329215813 317340775 304821377 291586609 277597237 262867393 247475548 231568909
2837 231568909 215367832 199175072 183380051 168448524 154879827 143135805 133555307 126288233
2845 126288233 121273651 118274822 116958523 116989012 118104362 120154581 123099165 126975355 131852760
2854 131852760 137791052 144805241 152844324 161781254 171416950 181494179 191718712 201782799
2862 201782799 211386433 220252552 228139133 234847050 240223541 244163780 246610222 247549763 247014790
2871B47014790j931458l202171m300595n191688n854817o291160o518059o563778o460590
2880B00700474o239033n928802n560036n162735m766808m394703m058303l758107l484592
2889A57347355l226166k974338k728815k497979k294702k129021k003307j909066j834192
2898A35749769j768713j715956j691579j717863j807146j952572k120667k264213k336455
2907A18374605k310524k184229j978397j720924j436968j141529q42104n43375k52848
2916A05963707K1276K72599M99677P05414Q94594J070061J235418J399727J575566
2925A13638039J784610K047387K378330K783670L260660L802309M402724N058174N767526
2934A44923429O528655P334728Q174629R030285R876747J0683556J1414947J2035141
$$ plain form
2871 247014790 245083332 241881161 237580566 232388878 226534061 220242901 213724842 207161064 200700474
2880 200700474 194461441 188532639 182972603 177809868 173043060 168648357 164590054 160831947 157347355
2889 157347355 154121189 151146851 148418036 145920057 143625355 141496334 139493027 137583961 135749769
2898 135749769 133981056 132265100 130573521 128855658 127048512 125095940 122975273 120711060 118374605
2907 118374605 116064081 113879852 111901455 110180531 108743563 107602034 106759930 106216555 105963707
2916 105963707 105984983 106257582 106757259 107462673 108357267 109427328 110662746 112062473 113638039
2925 113638039 115422649 117470036 119848366 122632036 125892696 129695005 134097729 139155903 144923429
2934 144923429 151452084 158786812 166961441 175991726 185868473 196552029 207966976 220002117
2942B20002117J2514324J2833367J2987041J2984658J2847557J2605991J2295475J1953793
2950C21024323J1616745J1312255J1060067J0865326J0724601J0624390J0545349J0463753
2958D08236809J0355339J0198631R983215R710923R398689R069328Q744126Q432808
2966D84129868Q133163P834587P529221P215271O901970O600227O319237O059608N815468
2975E46538620N578842N345726N116577M895706M686051M487495M294625M102134L905983
2984E88951759L707276L509063L316193L131523K955017K785721K624359K472458K335167
2993F15788536K215042K110481K016068J923141J824608J720238J614113J515617J434136
3002F32161980J375694J342468J330033J330719J330223J312370J262054J172486J049423
$$ plain form
2942 220002117 232516441 245349808 258336849 271321507 284169064 296775055 309070530 321024323
2950 321024323 332641068 343953323 355013390 365878716 376603317 387227707 397773056 408236809
2958 408236809 418592148 428790779 438773994 448484917 457883606 466952934 475697060 484129868
2966 484129868 492263031 500097618 507626839 514842110 521744080 528344307 534663544 540723152 546538620
2975 546538620 552117462 557463188 562579765 567475471 572161522 576649017 580943642 585045776 588951759
2984 588951759 592659035 596168098 599484291 602615814 605570831 608356552 610980911 613453369 615788536
2993 615788536 618003578 620114059 622130127 624053268 625877876 627598114 629212227 630727844 632161980
3002 632161980 633537674 634880142 636210175 637540894 638871117 640183487 641445541 642618027 643667450
3011F43667450R12399P86743O93283O38505O11877N94482N70450N37567N09873N05981
3021F50028610N38559O02341O76041P36618P71026P86438Q06885Q57391R49326J071548
3031F57824783J196518J296768J360550J399002J438065J500931J591492J690368J764908
3040F71063385J787033J750183J672669J585617J514511J467209J432037J389084J324997
3049F84986725J241226J152039J077423J026687R99756R83353R61532R23005Q64791
3058F94216537P90253P10983O37284N78537N37491N08346M79584M39224L82157L15856
3068F99596252K59552K34070K51465L08075L85056M57840N07888N31845N37415N39551
3078G03609009N48630N69458N99594O37283O84128P45239Q26721R31015J057053J200409
$$ plain form
3011 643667450 644579849 645366592 646059875 646698380 647310257 647904739 648475189 649012756 649522629 650028610
3021 650028610 650567169 651169510 651845551 652582169 653353195 654139633 654946518 655803909 656753235 657824783
3031 657824783 659021301 660318069 661678619 663077621 664515686 666016617 667608109 669298477 671063385
3040 671063385 672850418 674600601 676273270 677858887 679373398 680840607 682272644 683661728 684986725
3049 684986725 686227951 687379990 688457413 689484100 690483856 691467209 692428741 693351746 694216537
3058 694216537 695006790 695717773 696355057 696933594 697471085 697979431 698459015 698898239 699280396 699596252
3068 699596252 699855804 700089874 700341339 700649414 701034470 701492310 702000198 702532043 703069458 703609009
3078 703609009 704157639 704727097 705326691 705963974 706648102 707393341 708220062 709151077 710208130 711408539
3088G11408539J356277J518555J679001J824188J939316K011413K036744K022247J981964
3097G27778244J927414J860886J775589J662597J520462J361618J209107J085663J000061
3106G41181641R45205R01566Q49762P80868O99158O16226N43137M83856M36859M00772
3116G47839050L75977L65448L68423L78495L85360L81851L67814L51104L41721L40042
3126G51495285L38593L22494K81601K21634J58539J15814J05514J25504J58234J83258
3136G53506470J90735J84860J81122J93329K22015K52609K61688K31400J59836O4392
3146G55448456k6550q4534r5062o0502K289P0877J26572J58691J65253J52207J27716
3157G55985413J01471Q1558P0190O5155N7907M1123J2741j9531m0894l7842p705L8452
$$ plain form
3088 711408539 712764816 714283371 715962372 717786560 719725876 721737289 723774033 725796280 727778244
3097 727778244 729705658 731566544 733342133 735004730 736525192 737886810 739095917 740181580 741181641
3106 741181641 742126846 743028412 743878174 744659042 745358200 745974426 746517563 747001419 747438278 747839050
3116 747839050 748215027 748580475 748948898 749327393 749712753 750094604 750462418 750813522 751155243 751495285
3126 751495285 751833878 752156372 752437973 752659607 752818146 752933960 753039474 753164978 753323212 753506470
3136 753506470 753697205 753882065 754063187 754256516 754478531 754731140 754992828 755224228 755384064 755448456
3146 755448456 755421906 755337372 755242310 755181808 755184097 755254974 755381546 755540237 755705490 755857697 755985413
3157 755985413 756086884 756168442 756238632 756303787 756361694 756402817 756415558 756396027 756355133 756317291 756309586 756348038
3169G56348038P8964R4681P9498M2954O485j1750m730J8845M2190M9973L7536R003
3181G56791687k3880n0812o6681o9351n8212l5401k365L4714O6681Q5373Q4000O3629
3193G56819382L1585k060k6474l6544k9831q850K2430N7907R3002J22071J41144J45721
3205G57329483J32828J00479M9896j3351p9499j35498j68762j71814j44577r4528l4485
3216G56770172K2583O7978R5367J04599R5368O9885L4256k670k8458l3722j8005Q545
3228G57185898K7847K3728q622n8365j03073j21460j04065n8593n951L2577M5548L5553
3240G56891022J3962o409k0142k8991l9597n6381p8659j00174j12763j08642q3618
3251G56269608m0055J4191O3324R2087Q8806N3100j373n4016q4686q6289o4239l5324
$$ plain form
3169 756348038 756427002 756521683 756601181 756644135 756650620 756638870 756634140 756652985 756695175 756745148 756782684 756791687
3181 756791687 756767807 756716995 756650314 756580963 756522751 756487350 756484985 756519699 756586380 756671753 756755753 756819382
3193 756819382 756850967 756848907 756822433 756785889 756756058 756747208 756769638 756827545 756920547 757042618 757183762 757329483
3205 757329483 757462311 757562790 757612686 757599335 757519836 757384338 757215576 757043762 756899185 756804657 756770172
3216 756770172 756792755 756860733 756956100 757060699 757156067 757225952 757260208 757257538 757229080 757195358 757177353 757185898
3228 757185898 757213745 757237473 757228851 757170486 757067413 756945953 756841888 756783295 756777344 756809921 756855469 756891022
3240 756891022 756904984 756898575 756878433 756849442 756809845 756753464 756674805 756574631 756461868 756353226 756269608
3251 756269608 756229553 756243744 756307068 756399155 756487961 756541061 756539688 756485672 756400986 756314697 756250458 756215134
3263G56215134j5564j2131k2659l9673n5695o9809q1787r0561r0713p5455m4403p019
3275G55609665K0218K1744p096n5923j03379j26876j14746p1106j2894L6926N9128
3286G55255661M5166j144o4774j24588j59912j56632j12915m2648L0899Q0719Q7891
3297G54837723M9133k2201j02692j69220k06528k12631j95770j68534j42593j23520
3307G53543167j11771j05133r9487r1934q1787p0191n9738n5389o1264p8736j05514
3318G52622223j32141j48010j44349j17797p3777k4643J4115L0441K0218j1444n1499
3329G51983337q4533j00098r5749q1482p0724p7133j03531j42365j76391j87302j65253
3340G50698776j13067m7913O561K8839P782n0354j26037j90354k19574k04238j53046
$$ plain form
3263 756215134 756199570 756187439 756164780 756125107 756069412 755999603 755917816 755827255 755736542 755661087 755616684 755609665
3275 755609665 755629883 755651627 755644531 755588608 755485229 755358353 755243607 755172501 755159607 755196533 755255661
3286 755255661 755300827 755299683 755234909 755110321 754950409 754793777 754680862 754638214 754669113 754749832 754837723
3297 754837723 754886856 754864655 754761963 754592743 754386215 754173584 753977814 753809280 753666687 753543167
3307 753543167 753431396 753326263 753226776 753134842 753053055 752982864 752923126 752867737 752806473 752727737 752622223
3318 752622223 752490082 752342072 752197723 752079926 752006149 751981506 751995621 752026062 752046280 752034836 751983337
3329 751983337 751898804 751798706 751702957 751621475 751550751 751473618 751370087 751227722 751051331 750864029 750698776
3340 750698776 750585709 750537796 750544357 750573196 750580978 750530624 750404587 750214233 749994659 749790421 749637375
3351G49637375r0256m3564l2501n9128j10626j65710k08664k32392k39258k34222k21100
3362G47999954k00805j76239j53428j39923j37405j37711j22604p5455O180J05515
3372G46968079J90277K29568K09656J42593N9052o333l2348j7319K5940P7896J26648
3383G47973709J66550J95923K13012K10953J82800J27411N4093j9455p3166r5062q4305
3394G48852463n2719j3810K1058M9743P4387R6435J10093J02462O2943p858r4376j66931
3406G49033890j97449j70135r1019J3656J07041J56937J44348P3394l2272j36337k01416
3417G48700638k03858j44577n0125L7537P9193N6763j9074j13373j88369k18277k00196
3428G47736282j50146r0103l7003L739L4484N9052Q0261R9106J12762J17951J08414
$$ plain form
3351 749637375 749547119 749503555 749471054 749411926 749301300 749135590 748926926 748694534 748455276 748221054 747999954
3362 747999954 747799149 747622910 747469482 747329559 747192154 747054443 746931839 746856384 746862564 746968079
3372 746968079 747158356 747387924 747597580 747740173 747799225 747792892 747760544 747743225 747769165 747847061 747973709
3383 747973709 748140259 748336182 748549194 748760147 748942947 749070358 749124451 749104996 749031830 748936768 748852463
3394 748852463 748799744 748785934 748806992 748856735 748931122 749027557 749137650 749240112 749303055 749295197 749200821 749033890
3406 749033890 748836441 748666306 748575287 748588943 748695984 748852921 748997269 749070663 749038391 748902054 748700638
3417 748700638 748496780 748352203 748302078 748339615 748418808 748475571 748456497 748343124 748154755 747936478 747736282
3428 747736282 747586136 747496033 747459030 747462769 747497253 747556305 747636566 747735672 747848434 747966385 748074799
3439G48074799P7362K3803m2190j00174j26953j10626n9205J603M2114M8446L0442
3450G47859421J4801K6321O8436J21002J50604J34430P2632j0300q1558j17950j15738
3461G48122101q6289m5700n035L1128O0348P9728Q3389P3395N8593N3253O4011Q4381
3473G48573303R2697O8589Q316o6758j19705j18942o0120K9984J08261J41296J22528
3484G48779449P3624K4719o332k3880m3335p2098r8877r8648n5389J8921Q3389R0942
3496G48672485K3117r6817k07519k48337j95846p9957L0900O8283N188j32065k77176
3507G47562256l58353l33404k05307j5564J76468L16543L72925L39889K37732J01090
3517G48194275k9831j23978j68533j72730j58920j50604j54877j61285j47247r6360
$$ plain form
3439 748074799 748152161 748175964 748133774 748033600 747906647 747796021 747736816 747738419 747780533 747828979 747859421
3450 747859421 747874222 747900543 747968979 748089981 748240585 748375015 748447647 748437347 748355789 748237839 748122101
3461 748122101 748035812 747990112 747985077 748016205 748076553 748156281 748239670 748313065 748371658 748424911 748488922 748573303
3473 748573303 748666000 748734589 748742905 748676147 748556442 748437500 748377380 748407364 748515625 748656921 748779449
3484 748779449 748853073 748877792 748871460 748847580 748804245 748732147 748633270 748534622 748479233 748498154 748581543 748672485
3496 748672485 748695602 748598785 748391266 748142929 747947083 747867126 747898026 747966309 747971497 747839432 747562256
3507 747562256 747203903 746870499 746665192 746649628 746826096 747142639 747515564 747855453 748093185 748194275
3517 748194275 748164444 748040466 747871933 747699203 747540283 747389679 747234802 747073517 746926270 746829910
3527G46829910j4496P0954J21002J10550M6158l2501p2785l8299O4468J85547K51999
3538G47522507K06909M4479j83792l90701m97055m74549l55834k15607j26419j16043
3548G45413895j56327j87378j58310o2942O0883J59606K04010K06605K02713K10266
3558G45893021J96380Q7967j80969o06537j085739j447373j534042j285171p75605
3567G39261932j82800K98004N39551N23376L26539O5002j53809k61535k32010q1024
3577G40103226J35040L14331L36762J11389l64075r74197j521607j813431j759491
3586G34567947j423339r86252o57273n68618p31888j058579j431808j765518k025299
3595G23919373k201157k273407k201538j951599j534195j024018n36422j74561K2583
$$ plain form
3527 746829910 746815414 746886368 747007370 747117920 747164078 747131577 747058792 747020493 747084961 747270508 747522507
3538 747522507 747729416 747773895 747590103 747199402 746702347 746227798 745871964 745656357 745529938 745413895
3548 745413895 745257568 745070190 744911880 744848938 744909821 745069427 745273437 745480042 745682755 745893021
3558 745893021 746089401 746177368 745996399 745389862 744304123 742856750 741322708 740037537 739261932
3567 739261932 739079132 739377136 739916687 740440063 740766602 740831604 740677795 740416260 740184250 740103226
3577 740103226 740238266 740552597 740889359 741000748 740636673 739662476 738140869 736327438 734567947
3586 734567947 733144608 732158356 731501083 730932465 730200577 729141998 727710190 725944672 723919373
3595 723919373 721718216 719444809 717243271 715291672 713757477 712733459 712197037 712022476 712045059
3604G12045059R7351J49842K87780N72510R91745J455460J822815J947479J735382
3613G21105423J202316N01328j02997l27454q316P88422J745300K401886K362366J497497
3623G31165771L9063j504974k577515k825241k247391j166305m3793P38525J023407
3632G22601547Q84552N24445J53045q4152j13144Q0719M51966Q67996J107864R36890
3642G27411728K36435q71735k021255k742310k699966j882401o23321N68618J269989
3651G18645782J343155R57108M49753J24359J17493L90319Q11692J248016J598816
3660G25686493J784439J732712J405563Q47168K00501l48435o75354p98035q68225
3669G28966827j059951j432953j865845k110291j938705j279449k61841Q53882J801986
$$ plain form
3604 712045059 712142410 712292252 712580032 713152542 714144287 715599747 717422562 719370041 721105423
3613 721105423 722307739 722809067 722706070 722378616 722370300 723158722 724904022 727305908 729668274 731165771
3623 731165771 731204834 729699860 727122345 724297104 722049713 720883408 720839615 721578140 722601547
3632 722601547 723486099 724010544 724163589 724079437 723966293 724047012 724498978 725366974 726474838 727411728
3642 727411728 727648163 726776428 724755173 722012863 719312897 717430496 716807175 717375793 718645782
3651 718645782 719988937 720946045 721395798 721520157 721637650 722027969 722839661 724087677 725686493
3660 725686493 727470932 729203644 730609207 731456375 731656876 731308441 730633087 729835052 728966827
3669 728966827 727906876 726473923 724608078 722497787 720559082 719279633 719017792 719871674 721673660
3678G21673660K404633K590713K356873J728210P64618m00619j536103k354507k616959
3687G24610519k242736j359787k56119P40585J388931J596528J411514R60007L89404
3696G27238846j56632n41381o44989l99094J52969Q29849J347123J424942R29260l6545
3706G30144348j146011j975708k193146j703110o88019M82865J418075J862946J772461
3715G27974701J283493O19202j2131m76990p21283p39822n49774j80130L11660Q23059
3725G28331985J204072J283569R31167J33896r43985j964569k507248k248153j139603
3734G23081131M98276K063827K925492K728805J589356M5547j220169j742020j508026
3743G28462219r24606n36270o75888j261139j862717j991653j416092l10135Q52737
$$ plain form
3678 721673660 724078293 726669006 729025879 730754089 731518707 731118088 729581985 727227478 724610519
3687 724610519 722367783 721007996 720751877 721492462 722881393 724477921 725889435 726849442 727238846
3696 727238846 727082214 726540833 725895844 725496750 725649719 726479568 727826691 729251633 730180893 730144348
3706 730144348 728998337 727022629 724829483 723126373 722438354 722921219 724339294 726202240 727974701
3715 727974701 729258194 729877396 729865265 729388275 728666992 727927170 727377396 727197266 727508926 728331985
3725 728331985 729536057 730819626 731750793 731884689 730940704 728976135 726468887 724220734 723081131
3734 723081131 723579407 725643234 728568726 731297531 732886887 732932434 731712265 729970245 728462219
3743 728462219 727537613 727001343 726325455 725064316 723201599 721209946 719793854 719483719 720336456
3752G20336456J579895J631165J125946M38919l6697r4986K04696O15845Q63190P82776
3762G27447205L78646k04620p62176j108399j130829q19397k68326L49579Q30384J012649
3772G25724716Q37021L79562j80969o36215q40683p68051n10254k15378r308O6986
3782G23847427N8365N2262J13220K41089L79715M63867M67911M19464L67279L27453
3792G26738052K56882P6981k59552p08008j136780j395874j415710j256867j065979
3801G19833145r66949r53446q80584n66483N6076Q49915J516723J760330J461487P50885
3811G22861099p3776p25632j080169j204682j254196j325684j377868j269608q86841
3820G13662643k53524M60434J027603J296997J275024J098786R34829Q66776Q44803
$$ plain form
3752 720336456 721916351 723547516 724673462 725112381 725075684 724980698 725185394 725801239 726664429 727447205
3762 727447205 727825851 727621231 726859055 725750656 724619827 723800430 723532104 723881683 724712067 725724716
3772 725724716 726561737 726941299 726760330 726124115 725283432 724515381 724005127 723789749 723780441 723847427
3782 723847427 723905792 723958054 724071274 724312363 724692078 725155945 725623856 726043320 726410599 726738052
3792 726738052 726994934 727071915 726812363 726104355 724967575 723571701 722155991 720899124 719833145
3801 719833145 718866196 717912750 717032166 716465683 716521759 717371674 718888397 720648727 722110214 722861099
3811 722861099 722787323 722061691 720981522 719776840 718522644 717196960 715819092 714549484 713662643
3820 713662643 713409119 713869553 714897156 716194153 717469177 718567963 719502792 720369568 721214371
3829G21214371P26471L77044k35061r94034j678848k060471k011795j570663r12858
3838G12854156k48870K98156P59049J268921J920624K615280L022537K718811J443710
3847G26652374o65436l026657m816436n334702m346924k206115L05557K331695L303681
3856G12197037L131866K159271R33381o3096n97229p17773o55060o59866q61359j208191
3866G13658981j508484j543426j194992n19257K72446R17511J227035J164780Q35419
3875G13310013M04510N188l02581n15061o35757o48194n35812l22266r0942M7684K6092
3886G10742874j24588k76947k74963k8000M25720R27429J263504TQ70056J62888o73981
3897G14277496j415481j873474j949845j662292j120682m80118J16120N76248Q64715
$$ plain form
3829 721214371 721940842 722317886 722082825 721088791 719409943 717349472 715337677 713767014 712854156
3838 712854156 712605286 712903442 713662491 714931412 716852036 719467316 722489853 725208664 726652374
3847 726652374 725986938 722960281 718143845 712809143 708462219 706256104 706561661 708893356 712197037
3856 712197037 715328903 717488174 718421555 718358459 717761230 717043457 716388397 715728531 714867172 713658981
3866 713658981 712150497 710607071 709412079 708892822 709165268 710082779 711309814 712474594 713310013
3875 713310013 713714523 713719711 713417130 712902069 712266312 711618118 711082306 710760040 710669098 710716782 710742874
3886 710742874 710618286 710341339 710066376 710038376 710464096 711391525 712655029 713918533 714788589 714951477 714277496
3897 714277496 712862015 710988541 709038696 707376404 706255722 705775604 705891724 706467972 707332687
3906G07332687R86710R63135Q17947N81207K94419J0452k17361l50190l74908l02811
3916G09741287j68991k1744R0866J36109J15814O6147L4027M5166P8201Q1406J5335
3927G10213623j01395j88369j53733L6850L21198N70907O68717N82046L73230J49384
3937G12472458j0758r2392j22070j25580j01013l8605M6540J08108J02921L5400l6468
3948G12238541m9973M959O6757N6687m4632j71738k27051j71737o9504l4256j23596
3959G11474457k76795l63311l04566j59607q4076j91116m36859o44150o59790m99191
3969G07854996l42407l67661n69763p44629o70776l37906P400O7444k20337n86624
3979G04089737o61240l41720M7455R155o28967j439667j685639j018219J1444K17972
$$ plain form
3906 707332687 708319397 709282532 710100479 710681686 710976105 710986557 710769196 710419006 710044098 709741287
3916 709741287 709572296 709550552 709641418 709777527 709893341 709959488 709993515 710038681 710116882 710198288 710213623
3927 710213623 710112228 709923859 709770126 709806976 710128174 710699081 711367798 711949844 712323074 712472458
3937 712472458 712461700 712369308 712247238 712121658 712020645 711982040 712028580 712136688 712239609 712275009 712238541
3948 712238541 712188568 712193527 712260284 712316971 712272339 712100601 711873550 711701813 711632309 711598053 711474457
3959 711474457 711197662 710834351 710529785 710370178 710286102 710094986 709658127 709013977 708354187 707854996
3969 707854996 707512589 707144928 706575165 705830536 705159760 704821854 704829254 704896698 704676361 704089737
3979 704089737 703428497 703086777 703134232 703143387 702514420 701074753 699389114 698370895 698382339 698600311
3989F98600311j204757l702240n404511m561386j571426p554n419540k2084656m9537391
3998F05106850q1247750j06772842
4000D17086258
$$ plain form
3989 698600311 697395554 693693314 688288803 683727417 682155991 682148437 676728897 654644241 605106850
3998 605106850 523859100 417086258
4000 417086258
##END=$$ End of the data block
