##TITLE=$$ Begin of the data block
##JCAMP-DX=5.00 $$ ACD/SpecManager v 10.08
##SPECTROMETER/DATA SYSTEM=16PC
##DATE=04 Jun 2013 13:42:40
##DATA TYPE=INFRARED SPECTRUM
##DATA CLASS=XYDATA
##ORIGIN=
##OWNER=
##NPOINTS=3601
##FIRSTX=400.00000000
##LASTX=4000.00000000
##MAXX=4000.00000000
##MINX=400.00000000
##MAXY=79.12420654
##MINY=16.00175285
##XFACTOR=1.0000000000
##YFACTOR=0.000000100000000
##FIRSTY=42.92261505
##DELTAX=1.00000000
##XUNITS=1/CM
##YUNITS=TRANSMITTANCE
##XYDATA=(X++(Y..Y))
$$ plain form
400 429226151 535759125 619920998 675307693 704307175 715435257 718662415 721251755 725969772
408 725969772 731961136 737102127 740120087 741333160 741994247 743102798 744690857 746017456 746362152
417 746362152 745714340 744837494 744721527 745881577 748027954 750303650 751865997 752381668 752124786
426 752124786 751679535 751516953 751737747 752109604 752293549 752064209 751381302 750321884 748974304 747388458
436 747388458 745588684 743597946 741418457 738983841 736141891 732709427 728578339 723788300 718501816
445 718501816 712886124 706988907 700713577 693931274 686667862 679242172 672257233 666436996 662398605
454 662398605 660480042 660700150 662840424 666575928 671576538 677540283 684173737 691165237 698179626
463 698179626 704887009 711012344 716387024 720986176 724936295 728480225 731892471 735369034 738934402
$$ packed form
400D29226151J06532974Q4161873N5386695K8999482J1128082L227158K589340M718017
408G25969772N991364N140991L017960J213073O61087J108551J588059J326599L44696
417G46362152o47812q76846j15967J160050K146377K275696J562347N15671k56882
426G52124786m45251j62582K20794L71857J83945k29340o82907j059418j347580j585846
436G47388458j799774j990738k179489k434616k841950l432464m131088m790039n286484
445G18501816n615692n897217o275330o782303p263412p425690o984939n820237m038391
454F62398605j918563K20108K140274L735504N000610N963745O633454O991500P014389
463F98179626O707383O125335N374680M599152L950119L543930L412246L476563L565368
$$ plain form
472 738934402 742423553 745560150 748102951 749980316 751332626 752427063 753492889 754578323 755516739
481 755516739 756031113 755908661 755135880 753906250 752490997 751055603 749535522 747651978 745058289
490 745058289 741534805 737119827 732111053 726952896 722086334 717849884 714474564 712141342 711032104
499 711032104 711312485 713043442 716072159 719975891 724091873 727607346 729648666 729327621 725764465
508 725764465 718178787 706121368 689835281 670598907 650824280 633727684 622575417 619731560
516 619731560 625886955 639813309 658767929 679383392 698665466 714700546 726852417 735486069
524 735486069 741457443 745651855 748740158 751155243 753171768 754969330 756628265 758106308 759261475
533 759261475 759946365 760129166 759955063 759698944 759626007 759848709 760268021 760638657 760716095 760395813
$$ packed form
472G38934402L489151L136597K542801J877365J352310J094437J065826J085434R38416
481G55516739N14374j22452p72781j229630j415253j435394j520081j883544k593689
490G45058289l523484m414978n008774n158157m866562m236450l375320k333222j109238
499G11032104K80381J730957L028717L903732M115982L515473K041320l21045l563156
508G25764465p585678j2057419j6286087j9236374j9774627j7096596j1152267k843857
516F19731560O155395J3926354J8954620K0615463J9282074J6035080J2151871Q633652
524G35486069N971374M194412L088303K415085K016525J797562J658935J478043J155167
533G59261475O84890J82801j74103k56119p2937K22702M19312L70636P7438l20282
$$ plain form
543 760395813 759767456 759055710 758492355 758190765 758090057 757989044 757644806 756883850 755675201 754132538
553 754132538 752447433 750774689 749122696 747292938 744910660 741551056 736924896 731054153 724362640
562 724362640 717630234 711818085 707818909 706226883 707201462 710466919 715428925 721349792 727513733
571 727513733 733334274 738392944 742435226 745351028 747170563 748063202 748319778 748296661 748319550 748580322
581 748580322 749074173 749617920 749946518 749849548 749277802 748367310 747367554 746510239 745884933 745377884
591 745377884 744700241 743490143 741441193 738414078 734495239 729987183 725330276 720974503 717237320
600 717237320 714202881 711716385 709496689 707332153 705270157 703686447 703171539 704262619 707143402
609 707143402 711471786 716443176 721076736 724589233 726674881 727558594 727813416 728057480 728693542
$$ packed form
543G60395813o28357p11746n63355l01590j00708j01013l44238p60956j208649j542663
553G54132538j685105j672744j651993j829758k382278l359604m626160n870743o691513
562G24362640o732406n812149l999176j592026R74579L265457M962006N920867O163941
571G27513733N820541N058670M042282K915802J819535Q92639K56576k3117K2889K60772
581G48580322M93851N43747L28598r6970n71746r10492r99756q57315o25306n07049
591G45377884o77643j210098k048950l027115l918839m508056m656907m355773l737183
600G17237320l034439k486496k219696k164536k061996j583710n14908J091080K880783
609G07143402M328384M971390M633560L512497K085648Q83713K54822K44064O36062
$$ plain form
618 728693542 729808273 731241074 732729111 734018402 734878235 735052872 734243011 732195511 728888779
627 728888779 724715347 720520248 717413101 716393356 717946243 721809464 727039337 732364349 736662445
636 736662445 739340744 740447235 740486374 740060959 739542236 738931808 737957993 736317215 733896179 730844498
646 730844498 727473450 724056396 720663605 717118530 713082504 708194733 702182465 694903946 686348190
655 686348190 676652679 666162033 655493851 645530014 637273026 631589546 628948555 629291725 632109795
664 632109795 636687469 642375565 648741455 655531158 662503510 669277496 675316925 680074615 683204346
673 683204346 684696732 684857101 684142761 682973480 681627502 680259476 678980179 677897873 677068863
682 677068863 676397018 675577698 674156494 671676178 667799072 662293091 654879761 645075150 632216568
$$ packed form
618G28693542J114731J432801J488037J289291Q59833J74637q09861k047500l306732
627G28888779m173432m195099l107147j019745J552887L863221N229873N325012M298096
636G36662445K678299J106491L9139m25415n18723o10428r73815j640778k421036l051681
646G30844498l371048l417054l392791l545075m036026m887771o012268p278519q555756
655F86348190r695511j0490646j0668182r963837q256988n683480k640991L43170K818070
664F32109795M577674N688096O365890O789703O972352O773986O039429M757690L129731
673F83204346J492386J60369p14340j169281j345978j368026j279297j082306q29010
682F77068863o71845q19320j421204k480316l877106n505981p413330r804611j2858582
$$ plain form
691 632216568 615774651 595850792 573581467 551141396 531230354 516217461 507357330 504493752
699 504493752 506422310 511720276 519579353 530176926 544385452 562998810 585926666 611813812
707 611813812 638288574 662699203 682949982 698044815 708137512 714167328 717336426 718693771
715 718693771 718960266 718561325 717744293 716667252 715428543 714071350 712606964 711061707 709505844
724 709505844 708027191 706654053 705283203 703681488 701581345 698826294 695468674 691753693 687985458
733 687985458 684355850 680837021 677202454 673150253 668441086 662961960 656688766 649600372 641642151
742 641642151 632790489 623192215 613268242 603666039 595028877 587669640 581326485 575167313 568094254
751 568094254 559234543 548396263 536264420 524235573 513961220 506806946 503457260 503806000
$$ packed form
691F32216568j6441917j9923859k2269325k2440071j9911042j5012893q860131k863578
699E04493752J928558N297966P859077J0597573J4208526J8613358K2927856K5887146
707F11813812K6474762K4410629K0250779J5094833J0092697O029816L169098J357345
715G18693771K66495l98941q17032j077041j238709j357193j464386j545257j555863
724G09505844j478653j373138j370850j601715k100143k755051l357620l714981l768235
733F87985458l629608l518829l634567m052201m709167n479126o273194p088394p958221
742F41642151q851662r598274r923973r602203q637162p359237o343155o159172p073059
751E68094254q859711j0838280j2131843j2028847j0274353p154274l349686L48740
$$ plain form
759 503806000 507124023 512375069 518514023 524661522 530138741 534433556 537175713 538162651 537413673
768 537413673 535197296 531985283 528337746 524758377 521583290 518941040 516783180 514958954 513293533
777 513293533 511650505 509971237 508299370 506791039 505699768 505333099 505978966 507826462 510911903
786 510911903 515117302 520223656 525994987 532251740 538896408 545879059 553124771 560466232 567625694
795 567625694 574269791 580120087 585074158 589275627 593094978 597017593 601483688 606742859 612787209
804 612787209 619385185 626195335 632901611 639310608 645369873 651114120 656573181 661693115 666306076
813 666306076 670154343 672955475 674473343 674572906 673251190 670644150 667026672 662810745 658541107
822 658541107 654875107 652533264 652204819 654418945 659404221 666982956 676549911 687161026 697727814
$$ packed form
759E03806000L318023N251046O138954O147499N477219M294815K742157R86938p48978
768E37413673k216377l212013l647537l579369l175087k642250k157860j824226j665421
777E13293533j643028j679268j671867j508331j091271l66669O45867J847496L085441
786E10911903M205399N106354N771331O256753O644668O982651P245712P341461P159462
795E67625694O644097N850296M954071M201469L819351L922615M466095N259171O044350
804F12787209O597976O810150O706276O408997O059265N744247N459061N119934M612961
813F66306076L848267K801132J517868R9563j321716k607040l617478m215927m269638
822F58541107l666000k341843l28445K214126M985276P578735R566955J0611115J0566788
$$ plain form
831 697727814 707264786 715111237 721048889 725275574 728252716 730488052 732348938 733971329 735289841
840 735289841 736156845 736484985 736341400 735958023 735663147 735772705 736496353 737894516 739898453 742369003
850 742369003 745156021 748131943 751185608 754193268 756997833 759416122 761284714 762519379 763158417
859 763158417 763355865 763323517 763240204 763173218 763049622 762692490 761906967 760570297 758684387 756356735
869 756356735 753728714 750883560 747792435 744336700 740406113 736033859 731505585 727374954 724361725
878 724361725 723156891 724202652 727536621 732764893 739177170 745956497 752401886 758076172 762835846
887 762835846 766751175 769973526 772620850 774729614 776282730 777279282 777795639 777997208 778093414
896 778093414 778260727 778573990 778984833 779357758 779545898 779466553 779139709 778666382 778163986 777690964
$$ packed form
831F97727814R536972P846451N937652M226685K977142K235336J860886J622391J318512
840G35289841Q67004L28140j43585l83377k94876J09558P23648J398163K003937K470550
850G42369003K787018K975922L053665L007660K804565K418289J868592J234665O39038
859G63158417J97448l2348q3313o6986j23596l57132p85523j336670j885910k327652
869G56356735k628021k845154l091125l455735l930587m372254m528274m130631l013229
878G24361725j204834J045761L333969N228272O412277O779327O445389N674286M759674
887G62835846L915329L222351K647324K108764J553116R96552N16357K01569R6206
896G78093414J67313L13263M10843L72925J88140p9345l26844m73327n02396m73022
$$ plain form
906 777690964 777204742 776582489 775691757 774479599 773024902 771522827 770202484 769218369 768576508
915 768576508 768138504 767705917 767144547 766481018 765915527 765738678 766189346 767324219 768963089 770742493
925 770742493 772251434 773187180 773460541 773204422 772687302 772176361 771817474 771582260 771304550 770780945
935 770780945 769879684 768607941 767101822 765549088 764087982 762731934 761361771 759788208 757848892
944 757848892 755494003 752811584 749981689 747186203 744521179 741961899 739404755 736767349 734096222
953 734096222 731625748 729744263 728873825 729304657 731058044 733843002 737133331 740342712 743022614
962 743022614 744999771 746396332 747521591 748697662 750099945 751691437 753272247 754608994 755564804
971 755564804 756159821 756531296 756826172 757095490 757253571 757124481 756541061 755436783 753871536 751985779
$$ packed form
906G77690964m86222o22253q90732j212158j454697j502075j320343r84115o41861
915G68576508m38004m32587n61370o63529n65491j76849M50668J134873J638870J779404
925G70742493J508941R35746K73361k56119n17120n10941l58887k35214k77710n23605
935G70780945r01261j271743j506119j552734j461106j356048j370163j573563j939316
944G57848892k354889k682419k829895k795486k665024k559280k557144k637406k671127
953G34096222k470474j881485q70438M30832J753387K784958L290329L209381K679902
962G43022614J977157J396561J125259J176071J402283J591492J580810J336747R55810
971G55564804N95017L71475K94876K69318J58081j29090n83420j104278j565247j885757
$$ plain form
981 751985779 749916687 747737198 745457001 743083420 740696106 738480835 736689606 735541840 735115662
990 735115662 735285187 735738983 736067200 735881653 734917374 733085937 730472946 727294312 723833008
999 723833008 720374146 717153397 714322510 711939240 709980850 708371506 707013397 705803680 704637985
1008 704637985 703403320 701977463 700243607 698116608 695563354 692599869 689261246 685557327 681442413
1017 681442413 676817551 671568756 665621262 658989334 651804810 644331055 636971855 630279770 624942894
1026 624942894 621722870 621322899 624201355 630391579 639403648 650270081 661739502 672561417
1034 672561417 681761856 688817902 693684464 696682739 698316727 699091110 699386826 699417038 699249039
1043 699249039 698864822 698223572 697309341 696146851 694790192 693291702 691668701 689886093 687863998
$$ packed form
981G51985779k069092k179489k280197k373581k387314k215271j791229j147766m26178
990G35115662J69525M53796L28217j85547r64279j831437k612991l178634l461304
999G23833008l458862l220749k830887k383270j958390j609344j358109j209717j165695
1008G04637985j234665j425857j733856k126999k553254k963485l338623l703919m114914
1017F81442413m624862n248795n947494o631928p184524p473755p359200o692085n336876
1026F24942894l220024l99971K878456O190224R012069J0866433J1469421J0821915
1034F72561417R200439P056046M866562K998275J633988P74383K95716L0212j67999
1043F99249039l84217o41250r14231j162490j356659j498490j623001j782608k022095
$$ plain form
1052 687863998 685511246 682765198 679620056 676125717 672356262 668366852 664158096 659670258 654804535
1061 654804535 649462051 643574753 637113800 630072174 622431831 614134903 605074120 595108681 584094276
1070 584094276 571915741 558503304 543827744 527882767 510666656 492183952 472471581 451644211
1078 451644211 429938049 407728386 385507812 363830719 343242569 324223633 307165470 292375813
1086 292375813 280095863 270502586 263683643 259592800 258016510 258586960 260860062 264450512 269181633
1095 269181633 275192051 282948303 293138275 306465263 323398094 343952370 367577858 393195724
1103 393195724 419386177 444682961 467892036 488341713 505987320 521334305 535202904 548407288
1111 548407288 561456261 574376984 586722527 597758102 606756744 613297348 617457733 619839172
$$ packed form
1052F87863998k352752k746048l145142l494339l769455l989410m208756m487838m865723
1061F54804535n342484n887298o460953p041626p640343q296928r060783r965439j1014405
1070E84094276j2178535j3412437j4675560j5944977j7216111j8482704j9712371k0827370
1078D51644211k1706162k2209663k2220574k1677093k0588150j9018936j7058163j4789657
1086B92375813j2279950r593277o818943m090843j576290N70450K273102L590450M731121
1095B69181633O010418P756252J0189972J3326988J6932831K0554276K3625488K5617866
1103C93195724K6190453K5296784K3209075K0449677J7645607J5346985J3868599J3204384
1111E48407288J3048973J2920723J2345543J1035575Q998642O540604M160385K381439
$$ plain form
1119 619839172 621421051 623303413 626429214 631370735 638236885 646707687 656167831 665886841 675190430
1128 675190430 683578415 690769196 696670532 701302643 704714432 706926270 707924347 707699661 706302490
1137 706302490 703879471 700669174 696963348 693058167 689225311 685714035 682769318 680635223 679522400
1146 679522400 679541779 680638885 682570419 684949646 687348709 689417496 690964966 691969986 692523422
1155 692523422 692737885 692670746 692297211 691536636 690309525 688590012 686421738 683892746 681087570
1164 681087570 678050232 674786835 671310959 667704086 664139404 660828247 657890396 655207520 652353821
1173 652353821 648688354 643618546 636941795 629102325 621203461 614716721 610977936 610680428 613598824
1182 613598824 618673172 624415436 629447174 632922592 634667816 635018806 634487762 633447266 631978111
$$ packed form
1119F19839172J581879J882362L125801M941521O866150Q470802R460144R719010R303589
1128F75190430Q387985P190781N901336M632111L411789K211838R98077k24686j397171
1137G06302490k423019l210297l705826l905181l832856l511276k944717k134095j112823
1146F79522400J9379J097106J931534K379227K399063K068787J547470J005020N53436
1155F92523422K14463o7139l73535p60575j227111j719513k168274k528992k805176
1164F81087570l037338l263397l475876l606873l564682l311157k937851k682876k853699
1173F52353821l665467n069808o676751p839470p898864o486740l738785k97508K918396
1182F13598824N074348N742264N031738L475418J745224L50990n31044j040496j469155
$$ plain form
1191 631978111 629913101 626999016 623058319 618062210 612097740 605282211 597685852 589307518 580096169
1200 580096169 569985466 558913383 546814461 533603439 519164772 503362007 486056633 467128181
1208 467128181 446486740 424090691 399977226 374315414 347472763 320067902 292982178 267307720
1216 267307720 244227314 224848938 210029774 200236359 195481243 195356274 199157791 206067638
1224 206067638 215336838 226419888 239024162 253074112 268616428 285708885 304332466 324348946
1232 324348946 345502701 367452164 389809494 412174835 434159698 455407181 475616341 494571419
1240 494571419 512174339 528463211 543603096 557843018 571446953 584621468 597463341 609944725
1248 609944725 621933022 633229446 643609619 652855225 660780716 667257690 672234192 675729141
$$ packed form
1191F31978111k065010k914085l940697m996109n964470o815529p596359q378334r211349
1200E80096169j0110703j1072083j2098922j3211022j4438667j5802765j7305374j8928452
1208D67128181k0641441k2396049k4113465k5661812k6842651k7404861k7085724k5674458
1216B67307720k3080406j9378376j4819164r793415m755116j24969L801517O909847
1224B06067638R269200J1083050J2604274J4049950J5542316J7092457J8623581K0016480
1232C24348946K1153755K1949463K2357330K2365341K1984863K1247483K0209160J8955078
1240D94571419J7602920J6288872J5139885J4239922J3603935J3174515J2841873J2481384
1248F09944725J1988297J1296424J0380173R245606P925491O476974M976502L494949
$$ plain form
1256 675729141 677782059 678365555 677296448 674207840 668632431 660192795 648830643 634965820
1264 634965820 619498138 603639221 588646660 575583382 565193291 557909698 553926811 553233223
1272 553233223 555555878 560249138 566229858 572056694 576175346 577249908 574436226 567485313 556654243
1281 556654243 542508392 525745811 507141037 487608757 468302307 450630074 436122360 426165352
1289 426165352 421699181 422994995 429592781 440411453 453982964 468735504 483256226 496484604
1297 496484604 507809792 517062187 524402313 530130692 534467926 537369461 538439751 536991768
1305 536991768 532254333 523681793 511285439 495878181 479138565 463434563 451417427 445473785
1313 445473785 447178650 456917953 473795738 495860443 520575829 545388832 568226547 587796822
$$ packed form
1256F75729141K052918N83496j069107l088608n575409q439636j1362152j3864823
1264F34965820j5467682j5858917j4992561j3063278j0390091p283593l982887o93588
1272E53233223K322655M693260N980720N826836M118652J074562k813682o950913j0831070
1281E56654243j4145851j6762581j8604774j9532280j9306450j7672233j4507714r957008
1289D26165352m466171J295814O597786J0818672J3571511J4752540J4520722J3228378
1297D96484604J1325188R252395P340126N728379M337234K901535J070290j447983
1305E36991768m737435q572540j2396354j5407258j6739616j5704002j2017136n943642
1313D45473785J704865R739303J6877785K2064705K4715386K4813003K2837715J9570275
$$ plain form
1321 587796822 603646355 616009026 625534554 633000259 639084892 644247589 648706055 652473755
1329 652473755 655409775 657241135 657565308 655871277 651642838 644571762 634841652 623367538 611843185
1338 611843185 602491684 597542076 598588676 606078415 619142647 635853653 653806229 670787506
1346 670787506 685280762 696643066 704960556 710716629 714458237 716593246 717347717 716822815 715055847
1355 715055847 712027054 707612915 701543427 693430176 682896652 669790497 654402695 637601089
1363 637601089 620802612 605754051 594162598 587277565 585552216 588505402 594836845 602759476
1371 602759476 610437126 616381264 619689407 620082016 617777596 613296585 607282410 600388489 593228722
1380 593228722 586354027 580226326 575183525 571412354 568952560 567736702 567648582 568571014 570402069
$$ packed form
1321E87796822J5849533J2362671R525528P465705O084633N162697M458466L767700
1329F52473755K936020J831360L24173j694031m228439p071076r730110j1474114j1524353
1338F11843185r351501m949608J046600P489739J3064232J6711006J7952576J6981277
1346F70787506J4493256J1362304Q317490N756073L741608K135009P54471n24902j766968
1355G15055847l028793m414139o069488q113251j0533524j3106155j5387802j6801606
1363F37601089j6798477j5048561j1591453o885033j725349K953186O331443P922631
1371F02759476P677650N944138L308143L92609k304420m481011o014175o893921p159767
1380E93228722o874695o127701n042801l771171k459794j215858q8120R22432J831055
$$ plain form
1389 570402069 573039703 576354408 580171585 584275703 588429489 592396393 595951118 598883400 600999985
1398 600999985 602139816 602197418 601145897 599043198 596013336 592207298 587761269 582769356 577282333
1407 577282333 571327629 564935074 558152695 551045647 543682861 536128960 528457184 520787430 513336754
1416 513336754 506452980 500602303 496293907 493958626 493822975 495832062 499661865 504821091 510802193
1425 510802193 517211838 523824425 530538826 537271843 543858604 550022011 555431824 559822235 563096886
1434 563096886 565358162 566841621 567792435 568350334 568501854 568111305 566999207 565010529 562039032
1443 562039032 558012352 552873917 546598930 539247627 531019478 522260857 513402977 504854240 496906395
1452 496906395 489707909 483312187 477754288 473091507 469371109 466549301 464436340 462732849 461166573
$$ packed form
1389E70402069K637634L314705L817177M104118M153786L966904L554725K932282K116585
1398F00999985J139831N7602j051521k102699l029862l806038m446029m991913n487023
1407E77282333n954704o392555o782379p107048p362786p553901p671776p669754p450676
1416E13336754o883774n850677m308396k335281j35651K009087L829803N159226N981102
1425E10802193O409645O612587O714401O733017O586761O163407N409813M390411L274651
1434E63096886K261276J483459R50814N57899J51520l90549j112098j988678k971497
1443E62039032m026680n138435o274987p351303q228149q758621q857880q548737p947845
1452D96906395p198486o395722n557899m662781l720398k821808k112961j703491j566276
$$ plain form
1461 461166573 459659920 458419647 457875748 458483810 460493927 463818169 468074684 472780914 477580948
1470 477580948 482373199 487273254 492448235 497934952 503554153 508965454 513818741 517904091 521219711
1479 521219711 523936043 526296082 528524513 530786171 533199158 535862656 538867722 542278748 546107864
1488 546107864 550311356 554826698 559640198 564857788 570742798 577695961 586166801 596501083
1496 596501083 608760834 622571983 637075539 651043091 663164597 672431564 678478546 681726913
1504 681726913 683246613 684375000 686240616 689401474 693735733 698615265 703247604 707015762 709663620
1513 709663620 711280060 712140656 712522736 712596512 712428055 712061234 711606674 711275024 711335526 712019882
1523 712019882 713420029 715427246 717743683 719970703 721746674 722882233 723433609 723665390 723905792
$$ packed form
1461D61166573j506653j240273n43899O08062K010117L324242M256515M706230M800034
1470D77580948M792251M900055N174981N486717N619201N411301M853287M085350L315620
1479E21219711K716332K360039K228431K261658K412987K663498L005066L411026L829116
1488E46107864M203492M515342M813500N217590N885010O953163Q470840J0334282
1496E96501083J2259751J3811149J4503556J3967552J2121506R266967O046982L248367
1504F81726913J519700J128387J865616L160858M334259M879532M632339L768158K647858
1513G09663620J616440Q60596L82080P3776j68457l66821m54560l31650O0502O84356
1523G12019882J400147K007217K316437K227020J775971J135559N51376K31781K40402
$$ plain form
1532 723905792 724351044 724917526 725232849 724794922 723238449 720578156 717296829 714212036 712168884
1541 712168884 711703033 712829895 715062714 717642517 719864044 721338730 722082367 722402191 722654190
1550 722654190 722999802 723276978 723046417 721795120 719211655 715413437 711016846 706997833 704373779
1559 704373779 703816299 705361938 708355484 711679611 714186172 715144653 714498062 712804031 710895691
1568 710895691 709439316 708620834 708117447 707348938 705848465 703530273 700707016 697866058 695356750
1577 695356750 693195343 691099930 688729782 685963745 683034515 680432892 678636703 677827988 677767487
1586 677767487 677885590 677525558 676185303 673628464 669834366 664863434 658769531 651639175 643742142
1595 643742142 635676765 628376274 622910080 620130730 620321007 623014336 627093124 631140976 633903999
$$ packed form
1532G23905792M45252N66482L15323m37927j556473k660293l281327l084793k043152
1541G12168884m65851J126862K232819K579803K221527J474686P43637L19824K51999
1550G22654190L45612K77176k30561j251297k583465l798218m396591m019013k624054
1559G04373779n57480J545639K993546L324127K506561R58481o46591j694031j908340
1568G10895691j456375q18482n03387p68509j500473k318192k823257k840958k509308
1577F95356750k161407k095413k370148k766037k929230k601623j796189q08715o0501
1586F77767487J18103l60032j340255k556839l794098m970932o093903p130356p897033
1595F43742142q065377p300491n466194k779350J90277K693329M078788M047852K763023
$$ plain form
1604 633903999 634666023 633387985 630568237 626911736 622973251 618937569 614621201 609664841 603795319
1613 603795319 597015762 589628563 582093735 574810944 567941093 561355171 554721603 547671242 539952812
1622 539952812 531508675 522452393 512980118 503262444 493359146 483174400 472455940 460838928
1630 460838928 447933121 433444824 417302513 399735451 381258392 362552109 344274101 326883240
1638 326883240 310555611 295228558 280746899 267036362 254224834 242668533 232897682 225528660
1646 225528660 221194267 220507431 224036846 232255001 245435600 263514118 285966320 311770897
1654 311770897 339503632 367555923 394425201 418977318 440592232 459141769 474819603 487907753
1662 487907753 498592682 506911049 512839165 516451111 518037682 518097496 517196960 515779915 514044685
$$ packed form
1604F33903999P62024j278038k819748l656501l938485m035682m316368m956360n869522
1613F03795319o779557p387199p534828p282791o869851o585922o633568p050361p718430
1622E39952812q444137r056282r472275r717674r903298j0184746j0718460j1617012
1630D60838928j2905807j4488297j6142311j7567062j8477059j8706283j8278008j7390861
1638C26883240j6327629j5327053j4481659j3710537j2811528j1556301r770851p369022
1646B25528660m334393o86836L529415Q218155J3180599J8078518K2452202K5804577
1654C11770897K7732735K8052291K6869278K4552117K1614914J8549537J5677834J3088150
1662D87907753J0684929Q318367N928116L611946J586571N9814r00536j417045j735230
$$ plain form
1671 514044685 511963654 509428673 506416092 503051720 499521370 495884209 491919823 487132645 480937080
1680 480937080 472926674 463067856 451696739 439312744 426287231 412648430 398055420 381956635
1688 381956635 363838043 343432999 320828094 296472073 271142063 245902176 222036953 200908241
1696 200908241 183717117 171219959 163526230 160101871 160017529 162353287 166577320 172712955 181212311
1705 181212311 192597485 207041340 224075069 242539101 260768814 276925392 289338818 296770802
1713 296770802 298557243 294639816 285516415 272139511 255786095 237920532 220066967 203707047
1721 203707047 190197544 180693378 176062393 176796417 182947998 194131546 209613285 228471470
1729 228471470 249774513 272709332 296618176 320951805 345191154 368804779 391276817 412199097
$$ packed form
1671E14044685k081031k534981l012581l364372l530350l637161l964386m787178o195565
1680D80937080q010406r858818j1371117j2383995j3025513j3638801j4593010j6098785
1688C81956635j8118592k0405044k2604905k4356021k5330010k5239887k3865223k1128712
1696B00908241j7191124j2497158p693729l424359q4342K335758M224033O135635Q499356
1705A81212311J1385174J4443855J7033729J8464032J8229713J6156578J2413426P431984
1713B96770802J786441l917427r123401j3376904j6353416j7865563j7853565j6359920
1721B03707047j3509503r504166m630985P34024O151581J1183548J5481739J8858185
1729B28471470K1303043K2934819K3908844K4333629K4239349K3613625K2472038K0922280
$$ plain form
1737 412199097 431370697 448839569 464854965 479740257 493748741 506969147 519325294 530666733
1745 530666733 540897446 550077858 558447227 566358452 574160843 582088089 590201340 598407059
1753 598407059 606527901 614385986 621861115 628908577 635546303 641835098 647863922 653737717 659554367
1762 659554367 665361862 671111755 676636887 681685028 686012955 689503250 692251282 694565125 696872330
1771 696872330 699565430 702859039 706720963 710902405 715047073 718822632 722021255 724600601 726667633
1780 726667633 728425064 730105820 731904297 733914337 736089172 738240356 740097198 741416855 742107697
1789 742107697 742306290 742355118 742674942 743582306 745139084 747115555 749091644 750652313 751580734
1798 751580734 751950531 752074738 752341995 753029404 754184723 755635223 757101669 758348312 759289017
$$ packed form
1737D12199097J9171600J7468872J6015396J4885292J4008484J3220406J2356147J1341439
1745E30666733J0230713R180412Q369369P911225P802391P927246Q113251Q205719
1753E98407059Q120842P858085P475129P047462O637726O288795O028824N873795N816650
1762F59554367N807495N749893N525132N048141M327927L490295K748032K313843K307205
1771F96872330K693100L293609L861924M181442M144668L775559L198623K579346K067032
1780G26667633J757431J680756J798477K010040K174835K151184J856842J319657O90842
1789G42107697J98593M8828L19824R07364J556778J976471J976089J560669R28421
1798G51580734L69797J24207K67257O87409J155319J450500J466446J246643R40705
$$ plain form
1807 759289017 760000153 760649643 761395798 762313004 763380890 764524689 765673065 766791763 767879715
1816 767879715 768942108 769965439 770913696 771747971 772444077 772999268 773420410 773711243 773876266 773942032
1826 773942032 773982468 774118958 774486008 775170212 776163483 777362137 778616638 779807510 780893097
1835 780893097 781899490 782854309 783712616 784334564 784543381 784238510 783498764 782602310 781937485 781840820
1845 781840820 782447357 783633499 785084152 786443787 787471848 788119049 788496323 788770370 789054184
1854 789054184 789358521 789622574 789792404 789883194 789984283 790198517 790557175 790969162 791242065 791170578
1864 791170578 790649567 789745483 788689880 787789688 787301788 787328873 787786179 788448486 789049454 789383698
1874 789383698 789366226 789037018 788515701 787943497 787434845 787053986 786810989 786670685 786564178 786408691
$$ packed form
1807G59289017P11136O49490P46155R17206J067886J143799J148376J118698J087952
1816G67879715J062393J023331R48257Q34275O96106N55191M21142K90833J65023O5766
1826G73942032M0436J36490L67050O84204R93271J198654J254501J190872J085587
1835G80893097J006393R54819Q58307O21948K08817l04871p39746q96454o64825r6665
1845G81840820O06537J186142J450653J359635J028061O47201L77274K74047K83814
1854G89054184L04337K64053J69830R0790J01089K14234L58658M11987K72903p1487
1864G91170578n21011r04084j055603r00192m87900K7085M57306O62307O00968L34244
1874G89383698j7472l29208n21317n72204n08652l80859k42997j40304j06507j55487
$$ plain form
1884 786408691 786132507 785705109 785157928 784580688 784091797 783791351 783720093 783848343 784095688 784371948
1894 784371948 784614868 784803696 784949341 785071793 785181732 785278549 785355377 785405273 785420609 785388412 785296249
1905 785296249 785146790 784977341 784864426 784900360 785147858 785596313 786148987 786657028 786985931 787079468
1915 787079468 786985092 786824188 786727524 786772003 786955719 787219467 787494354 787744904 787978210 788220520
1925 788220520 788481140 788730545 788910828 788967514 788884735 788699646 788487015 788322830 788246994 788242874 788242798
1936 788242798 788157959 787916641 787497787 786943512 786347046 785817795 785437241 785224533 785126953 785042267
1946 785042267 784864273 784528427 784039917 783467255 782909241 782452850 782145462 781990814 781966858 782052002
1956 782052002 782237778 782526932 782915039 783375092 783854446 784288254 784622498 784835129 784941788 784984818
$$ packed form
1884G86408691k76184m27398n47181n77240m88891l00446p1258J28250K47345K76260
1894G84371948K42920J88828J45645J22452J09939R6817P6828M9896J5336l2197r2163
1905G85296249j49459j69449j12915L5934K47498M48455N52674N08041L28903R3537
1915G87079468r4376j60904r6664M4479J83716K63748K74887K50550K33306K42310
1925G88220520K60620K49405J80283N6686q2779j85089k12631j64185p5836m120p6
1936G88242798q4839k41318m18854n54275n96466n29251l80554k12708r7580q4686
1946G85042267j77994l35846m88510n72662n58014m56391l07388j54648k3956Q5144
1956G82052002J85776K89154L88107M60053M79354M33808L34244K12631J06659M3030
$$ plain form
1966 784984818 785011597 785052261 785109100 785161438 785182495 785161438 785114288 785082855 785117264 785253830 785497437
1977 785497437 785821457 786181641 786539307 786878128 787205963 787539673 787883377 788214264 788486786 788654099
1987 788654099 788697510 788643417 788561478 788537979 788641052 788892365 789259720 789672012 790051193 790342331 790530472
1998 790530472 790638123 790705872 790769424 790842361 790914154 790961075 790962753 790916138 790836639 790748520 790670395 790602798
2010 790602798 790526428 790412903 790241547 790012054 789748611 789490814 789277802 789133072 789056396 789028091
2020 789028091 789019470 789005966 788975220 788929062 788879166 788839645 788820648 788825912 788852692 788894043 788941650 788987656
2032 788987656 789025040 789048233 789052811 789037247 789002991 788956146 788905945 788861771 788829880 788811264 788801651 788794708
2044 788794708 788785324 788771591 788754196 788732071 788699799 788647385 788564148 788445892 788299103 788140411 787988892
$$ packed form
1966G84984818K6779M0664N6839N2338K1057k1057m7150l1433L4409J36566K43607
1977G85497437L24020L60184L57666L38821L27835L33710L43704L30887K72522J67313
1987G88654099M3411n4093q1939k3499J03073K51313L67355M12292L79181K91138J88141
1998G90530472J07651O7749O3552P2937P1793M6921J678m6615p9499q8119p8125o7597
2010G90602798p6370j13525j71356k29493k63443k57797k13012j44730p6676k8305
2020G89028091q621j3504l0746m6158m9896l9521j8997N264K6780M1351M7607M6006
2032G88987656L7384K3193M578j5564l4256m6845n0201m4174l1891j8616r613o943
2044G88794708r384j3733j7395k2125l2272n2414q3237j18256j46789j58692j51519
$$ plain form
2055 787988892 787854996 787732773 787599945 787427368 787193909 786900635 786573639 786255264 785987854 785793762
2065 785793762 785666809 785575943 785481720 785355606 785194702 785021515 784870529 784769211 784723892 784716873 784718475
2076 784718475 784705811 784676819 784652405 784665146 784738846 784873428 785040359 785195312 785298920 785335236 785319748
2087 785319748 785290680 785289001 785338058 785430832 785534439 785607147 785619659 785570526 785488129 785415802 785390854 785425644
2099 785425644 785501785 785580139 785621109 785606537 785548553 785482635 785448074 785465851 785526199 785593872 785626602 785598526
2111 785598526 785515213 785411987 785336685 785324020 785378418 785470276 785550613 785576477 785531616 785434875 785329514
2122 785329514 785260315 785249710 785285950 785328903 785331497 785265961 785138321 784987335 784863129 784801788 784806366 784845963
2134 784845963 784874115 784854813 784784698 784694824 784635239 784647827 784743729 784897079 785057907 785178375 785235367
$$ packed form
2055G87988892j33896j22223j32828j72577k33459k93274l26996l18375k67410j94092
2065G85793762j26953r0866r4223j26114j60904j73187j50986j01318m5319p019J602
2076G84718475j2664k8992k4414J2741P3700J34582J66931J54953J03608L6316j5488
2087G85319748k9068j679M9057R2774J03607P2708J2512m9133q2397p2327k4948L4790
2099G85425644P6141P8354M0970j4572n7984o5918l4561J7777O0348O7673L2730k8076
2111G85598526q3313j03226p5302j2665N4398R1858Q0337K5864m4861r6741j05361
2122G85329514o9199j0605L6240M2953K594o5536j27640j50986j24206o1341M578L9597
2134G84845963K8152j9302p0115q9874n9585J2588R5902J53350J60828J20468N6992
$$ plain form
2145 785235367 785241928 785236435 785261765 785340424 785461197 785585251 785664749 785667877 785595703 785481720 785376129 785321884
2157 785321884 785332718 785387573 785441818 785448456 785383072 785254364 785098801 784960785 784869080 784822083 784790802
2168 784790802 784734573 784625702 784464874 784282074 784121323 784017258 783976593 783974075 783966370 783913956 783801880
2179 783801880 783648834 783495789 783386536 783344803 783363190 783408051 783438492 783428116 783378143 783317337 783285294
2190 783285294 783310776 783396149 783514938 783623428 783682404 783674164 783609085 783517227 783431778 783371582 783332443 783292084
2202 783292084 783224411 783114548 782967606 782807083 782661438 782549820 782472839 782412643 782343292 782246323 782119827
2213 782119827 781980438 781853485 781758881 781699142 781656952 781602402 781508636 781364746 781180725 780982361 780796814
2224 780796814 780638809 780504684 780374603 780225906 780044861 779835281 779616089 779412079 779241638 779109955
$$ packed form
2145G85235367O561n493K5330P8659J20773J24054P9498L128p2174j13983j05591n4245
2157G85321884J0834N4855N4245O638o5384j28708j55563j38016r1705m6997l1281
2168G84790802n6229j08871j60828j82800j60751j04065m0665k518p705n2414j12076
2179G83801880j53046j53045j09253m1733J8387M4861L0441j0376m9973o0806l2043
2190G83285294K5482Q5373J18789J08490N8976q240o5079r1858q5449o0196l9139m0359
2202G83292084o7673j09863j46942j60523j45645j11618p6981o0196o9351r6969j26496
2213G82119827j39389j26953r4604n9739m2190n4550r3766j43890j84021j98364j85547
2224G80796814j58005j34125j30081j48697j81045k09580k19192k04010j70441j31683
$$ plain form
2234 779109955 779008713 778921127 778832779 778735733 778630829 778524246 778422165 778327408 778238831 778153229 778067932
2245 778067932 777983246 777901688 777825546 777755585 777688675 777618484 777537384 777439270 777322311 777189026 777045135
2256 777045135 776895905 776743317 776585312 776417618 776237411 776046753 775853577 775668640 775500717 775354156
2266 775354156 775227814 775118027 775023117 774945068 774888229 774855194 774843750 774847260 774858246 774875412 774906082 774963837
2278 774963837 775058289 775185547 775320206 775418472 775429077 775310135 775044556 774644775 774147339 773597870
2288 773597870 773032074 772464447 771886826 771278763 770622559 769916534 769176865 768429642 767695541 766979294
2298 766979294 766265488 765526886 764735870 763873825 762930603 761899185 760767136 759518814 758143997
2307 758143997 756655045 755098877 753554382 752111130 750833588 749724350 748703537 747617416 746280746
$$ packed form
2234G79109955j01242q7586q8348r7046j04904j06583j02081r4757q8577q5602q5297
2245G78067932q4686q1558p6142o9961o6910p0191q1100r8114j16959j33285j43891
2256G77045135j49230j52588j58005j67694j80207j90658j93176j84937j67923j46561
2266G75354156j26342j09787r4910p8049n6839l3035j1444L510J0986J7166L0670N7755
2278G74963837R4452J27258J34659R8266J0605j18942k65579l99781m97436n49469
2288G73597870n65796n67627n77621o08063o56204p06025p39669p47223p34101p16247
2298G66979294p13806p38602p91016q62045r43222j031418j132049j248322j374817
2307G58143997j488952j556168j544495j443252j277542j109238j020813j086121j336670
$$ plain form
2316 746280746 744544983 742363739 739830017 737159958 734619141 732419891 730631561 729153366 727767334
2325 727767334 726251144 724493637 722550201 720608368 718882294 717497787 716435699 715559845 714705734
2334 714705734 713762512 712694931 711500092 710149307 708585892 706813202 705027847 703700867 703506699
2343 703506699 705080414 708687363 713976669 719957428 725258331 728568726 729073257 726691284 722026062
2352 722026062 716073227 709844742 704075470 699118042 695015640 691667633 688980026 686934204 685573425
2361 685573425 684951019 685085220 685946350 687471390 689580002 692185516 695196457 698520584 702075806
2370 702075806 705802917 709671555 713671646 717796707 722029953 726340942 730692291 735046158 739360580
2379 739360580 743574982 747597885 751308746 754581146 757320175 759494629 761148148 762381439 763315582
$$ packed form
2316G46280746j735763k181244k533722k670059k540817k199250j788330j478195j386032
2325G27767334j516190j757507j943436j941833j726074j384507j062088q75854q54111
2334G14705734r43222j067581j194839j350785j563415j772690j785355j326980j94168
2343G03506699J573715L606949N289306N980759N300903L310395N04531k381973m665222
2352G22026062n952835o228485n769272m957428m102402l348007k687607k045822j360779
2361F85573425o22406J34201Q61130J525040K108612K605514L010941L324127L555222
2370G02075806L727111L868638M000091M125061M233246M310989M351349M353867M314422
2379G39360580M214402M022903L710861L272400K739029K174454J653519J233291R34143
$$ plain form
2388 763315582 764053802 764658890 765153122 765535278 765803375 765970383 766067581 766134949 766206818 766297607 766397552
2399 766397552 766478348 766507874 766468430 766368027 766240234 766128540 766065292 766053696 766066208 766058578 765995407
2410 765995407 765870743 765713272 765572815 765492477 765486069 765529938 765575562 765574875 765506439 765385666 765255051
2421 765255051 765160599 765126419 765140381 765159454 765131912 765023193 764832611 764593353 764353409 764150925 763994446
2432 763994446 763860626 763709717 763509674 763256760 762980118 762729340 762549973 762461014 762446518 762464828
2442 762464828 762470245 762435379 762363892 762286987 762244797 762265625 762350464 762470932 762583694 762650604 762655945 762612915
2454 762612915 762555389 762518234 762519073 762548370 762575150 762563553 762492523 762367935 762220078 762087021 761994019 761940231
2466 761940231 761897736 761827850 761699982 761508713 761276627 761043015 760843811 760694809 760583801 760478973
$$ packed form
2388G63315582P38220O05088M94232L82156K68097J67008R7198O7368P1869R0789R9945
2399G66397552Q0796K9526l9444j00403j27793j11694o3248j1596J2512p630o3171
2410G65995407j24664j57471j40457q0338o408M3869M5624o87o8436j20773j30615
2421G65255051r4452l4180J3962J9073k7542j08719j90582k39258k39944k02484j56479
2432G63994446j33820j50909k00043k52914k76642k50778j79367q8959j4496J8310
2442G62464828N417l4866p1487p6905m2190K0828Q4839J20468J12762O6910N341m3030
2454G62612915n7526l7155Q39K9297K6780j1597p1030j24588j47857j33057r3002n3788
2466G61940231m2495o9886j27868j91269k32086k33612j99204j49002j11008j04828
$$ plain form
2476 760478973 760345535 760164108 759940720 759703674 759489517 759323349 759206848 759117050 759017410 758877258
2486 758877258 758686676 758462601 758239059 758050690 757914963 757823257 757746506 757649612 757509232 757324295
2496 757324295 757114868 756910706 756734848 756592941 756470795 756343155 756187363 755995941 755779572 755563202
2506 755563202 755372162 755220947 755105591 755006256 754897614 754762039 754598312 754422913 754261093 754134445
2516 754134445 754048843 753991318 753936234 753856583 753738327 753586884 753424454 753280029 753176422 753119812 753099136
2527 753099136 753091660 753075256 753039017 752986984 752936172 752906036 752909012 752941818 752987823 753023148 753027267 752992477
2539 752992477 752927094 752851715 752789307 752755890 752753448 752769928 752785110 752781372 752750473 752696991 752634811 752579346
2551 752579346 752538300 752506638 752469177 752408066 752312393 752186432 752048035 751920776 751822586 751755524 751702957
$$ packed form
2476G60478973j33438j81427k23388k37046k14157j66168j16501q9798r9640j40152
2486G58877258j90582k24075k23542j88369j35727r1706p6751r6894j40380j84937
2496G57324295k09427k04162j75858j41907j22146j27640j55792j91422k16369k16370
2506G55563202j91040j51215j15356r9335j08642j35575j63727j75399j61820j26648
2516G54134445q5602n7525n5084p9651j18256j51443j62430j44425j03607n6610k0676
2527G53099136p476j6404l6239n2033n0812l0136K976L2806M6005L5325M119l4790
2539G52992477o5383p5379o2408l3417k442J6480J5182l738l0899n3482o2180n5465
2551G52579346m1046l1662l7461o1111r5673j25961j38397j27259r8190o7062n2567
$$ plain form
2562 751702957 751636810 751530914 751373596 751173553 750956268 750751419 750578461 750438843 750314178 750178452
2572 750178452 750010605 749805069 749574814 749344482 749136276 748960114 748807526 748656845 748484497 748277435
2582 748277435 748041992 747798691 747574615 747387390 747235870 747099686 746948090 746755371 746513138 746236191
2592 746236191 745955353 745702972 745497208 745332947 745183792 745014954 744799728 744532776 744233017 743935013
2602 743935013 743671341 743458557 743289185 743137054 742971573 742775803 742554169 742331543 742138748 741995773
2612 741995773 741898727 741821365 741726913 741587524 741398697 741183090 740977936 740817261 740713730 740652237 740597382
2623 740597382 740511322 740372543 740187302 739985046 739804611 739673080 739593048 739541245 739479675 739375534 739217072
2634 739217072 739020538 738820953 738655472 738544159 738481216 738437500 738377228 738276901 738137436 737984695
$$ packed form
2562G51702957o6147j05896j57318k00043k17285k04849j72958j39618j24665j35726
2572G50178452j67847k05536k30255k30332k08206j76162j52588j50681j72348k07062
2582G48277435k35443k43301k24076j87225j51520j36184j51596j92719k42233k76947
2592G46236191k80838k52381k05764j64261j49155j68838k15226k66952k99759k98004
2602G43935013k63672k12784j69372j52131j65481j95770k21634k22626j92795j42975
2612G41995773r7046p7362r4452j39389j88827k15607k05154j60675j03531o1493n4855
2623G40597382q6060j38779j85241k02256j80435j31531q0032n1803o1570j04141j58462
2634G39217072j96534j99585j65481j11313o2943m3716o0272j00327j39465j52741
$$ plain form
2644 737984695 737854691 737775040 737750244 737757721 737760010 737723618 737636185 737513123 737388992 737299728 737263107 737269363
2656 737269363 737285767 737273636 737208252 737093430 736958237 736843567 736779861 736771545 736792755 736800690 736756287 736643906
2668 736643906 736478348 736297913 736143799 736041336 735986481 735950470 735893631 735786133 735621643 735419922
2678 735419922 735215912 735041351 734909210 734807358 734704666 734567413 734376831 734138718 733880615 733638077
2688 733638077 733435440 733272705 733124542 732953491 732728958 732443771 732120056 731796417 731510010 731276627
2698 731276627 731083069 730894165 730671844 730393982 730065613 729714661 729375992 729072876 728804932 728548737
2708 728548737 728270569 727943802 727563171 727145920 726723175 726323547 725959091 725619736 725279007 724908371
2718 724908371 724491577 724033051 723555450 723087921 722651672 722249603 721866074 721475372 721056519 720604324
$$ packed form
2644G37984695j30004p9651k4796P477K289l6392q7433j23062j24131q9264l6621O256
2656G37269363J6404j2131o5384j14822j35193j14670o3706q316K1210P935m4403j12381
2668G36643906j65558j80435j54114j02463n4855l6011n6839j07498j64490k01721
2678G35419922k04010j74561j32141j01852j02692j37253j90582k38113k58103k42538
2688G33638077k02637j62735j48163j71051k24533k85187l23715l23639k86407k33383
2698G31276627j93558j88904k22321k77862l28369l50952l38669l03116k67944k56195
2708G28548737k78168l26767l80631m17251m22745l99628l64456l39355l40729l70636
2718G24908371m16794m58526m77601m67529m36249m02069l83529l90702m18853m52195
$$ plain form
2728 720604324 720132065 719664612 719225006 718821030 718441696 718061371 717654800 717209778 716735916 716260605
2738 716260605 715817947 715432892 715110016 714832916 714571838 714298706 713998032 713672485 713337555 713011169
2748 713011169 712702103 712404633 712100525 711768570 711394424 710978546 710535355 710087509 709654617 709244080
2758 709244080 708848953 708451920 708034134 707587128 707116547 706642227 706186447 705764389 705373993 704995041
2768 704995041 704598312 704156723 703657990 703107986 702525711 701931915 701338882 700745010 700138397 699508362
2778 699508362 698854218 698192139 697550659 696960602 696443176 696001358 695620041 695272675 694933014 694584961
2788 694584961 694226913 693867722 693519440 693187943 692867661 692542953 692195663 691813431 691396561 690957031
2798 690957031 690512924 690079422 689660797 689250412 688835449 688405838 687960358 687509003 687067871 686651764
$$ packed form
2728G20604324m72259m67453m39606m03976l79334l80325m06571m45022m73862m75311
2738G16260605m42658l85055l22876k77100k61078k73132l00674l25547l34930l26386
2748G13011169l09066k97470l04108l31955l74146m15878m43191m47846m32892m10537
2758G09244080l95127l97033m17786m47006m70581m74320m55780m22058l90396l78952
2768G04995041l96729m41589m98733n50004n82275n93796n93033n93872o06613o30035
2778F99508362o54144o62079o41480n90057n17426m41818l81317l47366l39661l48053
2788F94584961l58048l59191l48282l31497l20282l24708l47290l82232m16870m39530
2798F90957031m44107m33502m18625m10385m14963m29611m45480m51355m41132m16107
$$ plain form
2808 686651764 686267624 685912476 685576706 685251923 684935455 684632721 684353867 684107742 683895645 683708191
2818 683708191 683527603 683333817 683110886 682851639 682558517 682239380 681901855 681548309 681173935 680769882
2828 680769882 680328903 679849777 679339600 678811340 678278122 677746811 677214584 676670227 676098785 675487823
2838 675487823 674831924 674132919 673397064 672630692 671835403 671008835 670144958 669239273 668290253 667300797
2848 667300797 666275940 665221329 664140930 663036346 661909637 660763397 659601440 658426590 657237549
2857 657237549 656027756 654784698 653492584 652137604 650710068 649207230 647633209 645996704 644310684
2866 644310684 642591095 640857162 639130173 637432098 635781937 634193039 632669334 631205521 629786339
2875 629786339 628388214 626982613 625538254 624025803 622422180 620713120 618893127 616961899 614921265
$$ packed form
2808F86651764l84140l55148l35770l24783l16468l02734k78854k46125k12097j87454
2818F83708191j80588j93786k22931k59247k93122l19137l37525l53546l74374m04053
2828F80769882m40979m79126n10177n28260n33218n31311n32227n44357n71442o10962
2838F75487823o55899o99005p35855p66372p95289q26568q63877r05685r49020r89456
2848F67300797j024857j054611j080399j104584j126709j146240j161957j174850j189041
2857F57237549j209793j243058j292114j354980j427536j502838j574021j636505j686020
2866F44310684j719589j733933j726989j698075j650161j588898j523705j463813j419182
2875F29786339j398125j405601j444359j512451j603623j709060j819993j931228k040634
$$ plain form
2884 614921265 612769814 610504150 608121414 605623550 603020782 600330276 597570038 594751549 591875343
2893 591875343 588932800 585914154 582820740 579674454 576521721 573426743 570458298 567674217 565108032
2902 565108032 562767029 560635681 558687935 556899605 555255890 553751564 552384872 551148643 550023079
2911 550023079 548974876 547961845 546940536 545873451 544733276 543501892 542169075 540730667 539189720
2920 539189720 537558632 535861168 534131584 532410164 530737534 529148178 527668152 526315079 525101700
2929 525101700 524037209 523129463 522383003 521797867 521368370 521086388 520943604 520935173 521059875 521315575
2939 521315575 521692467 522166443 522696152 523226738 523698730 524061012 524280357 524347076 524272003 524080238
2949 524080238 523800278 523457565 523069534 522647171 522199364 521737404 521279106 520847816 520468330 520157776
$$ packed form
2884F14921265k151451k265664k382736k497864k602768k690506k760238k818489k876206
2893E91875343k942543l018646l093414l146286l152733l094978k968445k784081k566185
2902E65108032k341003k131348j947746j788330j643715j504326j366692j236229j125564
2911E50023079j048203j013031j021309j067085j140175j231384j332817j438408j540947
2920E39189720j631088j697464j729584j721420j672630j589356j480026j353073j213379
2929E25101700j064491r07746p46460n85136m29497k81982j42784q431J24702K55700
2939E21315575L76892M73976N29709N30586M71992L62282K19345O6719p5073j91765
2949E24080238k79960l42713l88031m22363m47807m61960m58298m31290l79486l10554
$$ plain form
2959 520157776 519917374 519725838 519537735 519291382 518919907 518365250 517588348 516572571 515320282 513845406
2969 513845406 512167587 510312881 508319855 506252518 504211044 502334290 500790749 499755554 499380302
2978 499380302 499761848 500922813 502808609 505302811 508255310 511512985 514941750 518435745 521913681
2987 521913681 525311203 528576736 531675987 534601021 537378044 540062866 542723312 545413780 548152733
2996 548152733 550913353 553633080 556236191 558660545 560874596 562882233 564711838 566400986 567982407
3005 567982407 569476318 570890808 572225227 573475075 574632416 575685349 576617317 577406654 578030281
3014 578030281 578467789 578707390 578748474 578603096 578292084 577840729 577271614 576600685 575836830 574985619
3024 574985619 574056854 573068886 572049789 571028671 570024109 569031754 568023033 566955032 565792961
$$ packed form
2959E20157776k40402j91536j88103k46353l71475n54657p76902j015777j252289j474876
2969E13845406j677819j854706j993026k067337k041474j876754j543541j035195l75252
2978D99380302L81546J160965J885796K494202K952499L257675L428765L493995L477936
2987E21913681L397522L265533L099251K925034K777023K684822K660446K690468K738953
2996E48152733K760620K719727K603111K424354K214051K007637J829605J689148J581421
3005E67982407J493911J414490J334419J249848J157341J052933R31968P89337O23627
3014E78030281M37508K39601M1084j45378l11012m51355n69115o70929p63855q51211
3024E74985619r28765r87968j019097j021118j004562r92355j008721j068001j162071
$$ plain form
3033 565792961 564534683 563225327 561951866 560817947 559905319 559239235 558773880 558402824 557993431
3042 557993431 557427216 556631393 555587730 554317703 552856064 551225471 549426537 547444954 545270576
3051 545270576 542916298 540425987 537867699 535314026 532821503 530415802 528087959 525803566 523517914
3060 523517914 521190414 518793755 516316566 513759499 511130905 508443604 505715866 502973442 500249748
3069 500249748 497581329 494997902 492509422 490098343 487719345 485311165 482816086 480197563 477450981
3078 477450981 474601250 471688995 468756561 465838165 462961349 460156784 457469635 454960518 452694435
3087 452694435 450719070 449042587 447621498 446365814 445159912 443890953 442472725 440858765 439040298
3096 439040298 437037621 434888573 432641296 430351791 428082466 425897484 423854370 421994171 420334625
$$ packed form
3033E65792961j258278j309356j273461j133919r12628o66084m65355l71056m09393
3042E57993431n66215p95823j043663j270027j461639j630593j798934j981583k174378
3051E45270576k354278k490311k558288k553673k492523k405701k327843k284393k285652
3060E23517914k327500k396659k477189k557067k628594k687301k727738k742424k723694
3069E00249748k668419k583427k488480k411079k378998k408180k495079k618523k746582
3078D77450981k849731k912255k932434k918396k876816k804565k687149k509117k266083
3087D52694435j975365j676483j421089j255684j205902j268959j418228j613960j818467
3096D39040298k002677k149048k247277k289505k269325k184982k043114j860199j659546
$$ plain form
3105 420334625 418870049 417579155 416436882 415425491 414541588 413795509 413206711 412795563 412574997
3114 412574997 412543449 412681694 412955055 413321533 413745041 414208908 414723892 415325470 416060066 416965523
3124 416965523 418054199 419307213 420684204 422142487 423657074 425231819 426893921 428676262 430596504
3133 430596504 432641487 434766922 436911240 439017105 441049156 443001976 444894180 446752052 448594246
3142 448594246 450422020 452221260 453972702 455662994 457290230 458860626 460378647 461836624 463211632
3151 463211632 464471283 465586853 466545334 467354927 468040657 468632126 469149094 469594460 469953651 470202904
3161 470202904 470320930 470298004 470138664 469859200 469479904 469015961 468472099 467841721 467112427 466274147
3171 466274147 465329018 464295197 463204689 462094116 460992737 459913177 458850174 457786789 456706352
$$ packed form
3105D20334625j464576j290894j142273j011391q83903p46079n88798m11148k20566
3114D12574997l1548J38245K73361L66478M23508M63867N14984O01578P34596R05457
3124D16965523J088676J253014J376991J458283J514587J574745J662102J782341J920242
3133D30596504K044983K125435K144318K105865K032051J952820J892204J857872J842194
3142D48594246J827774J799240J751442J690292J627236J570396J518021J457977J375008
3151D63211632J259651J115570R58481Q09593O85730N91469N16968M45366L59191K49253
3161D70202904J18026k2926j59340k79464l79296m63943n43862o30378p29294q38280
3171D66274147r45129j033821j090508j110573j101379j079560j063003j063385j080437
$$ plain form
3180 456706352 455602913 454485092 453371201 452280006 451220284 450186234 449160576 448122063 447054863
3189 447054863 445952263 444816551 443652840 442462616 441238976 439969215 438638840 437238541 435768814
3198 435768814 434238663 432660828 431044197 429387703 427680092 425904236 424045029 422096939 420066910
3207 420066910 417971687 415831184 413660507 411464310 409236641 406965065 404636955 402245560 399793320
3216 399793320 397291908 394758453 392210541 389661140 387116241 384575958 382039795 379512444 377008820
3225 377008820 374553719 372176552 369901428 367739143 365685158 363723145 361836166 360017357 358276329
3234 358276329 356637268 355131111 353784866 352614784 351625862 350817947 350193100 349760780 349537697
3243 349537697 349542160 349788780 350283241 351024208 352007484 353232689 354705734 356438560 358444939 360734787
$$ packed form
3180D56706352j103439j117821j113891j091195j059722j034050j025658j038513j067200
3189D47054863j102600j135712j163711j190224j223640j269761j330375j400299j469727
3198D35768814j530151j577835j616631j656494j707611j775856j859207j948090k030029
3207D20066910k095223k140503k170677k196197k227669k271576k328110k391395k452240
3216C99793320k501412k533455k547912k549401k544899k540283k536163k527351k503624
3225C77008820k455101k377167k275124k162285k053985j962013j886979j818809j741028
3234C58276329j639061j506157j346245j170082r88922q07915o24847m32320k23083
3243C49537697M463K46620M94461P40967R83276J225205J473045J732826K006379K289848
$$ plain form
3253 360734787 363311577 366171532 369306488 372705803 376359062 380255394 384382935 388728409 393276901
3262 393276901 398010979 402910385 407949905 413097954 418318024 423571815 428824120 434047508 439223938
3271 439223938 444342384 449395485 454376450 459277649 464093285 468822250 473469582 478043938 482553520
3280 482553520 487000732 491378975 495674820 499871445 503955231 507920341 511769943 515513496 519161148
3289 519161148 522717934 526179504 529532814 532760506 535848656 538792267 541597023 544274673 546834373
3298 546834373 549275169 551583595 553738556 555722313 557529984 559173965 560678635 562070465 563367386
3307 563367386 564574051 565685997 566698303 567615700 568456001 569246025 570012665 570773659 571531792
3316 571531792 572277489 572994957 573671188 574301338 574888802 575441017 575962296 576448059 576883965 577251434
$$ packed form
3253C60734787K576790K859955L134956L399315L653259L896332M127541M345474M548492
3262C93276901M734078M899406N039520N148049N220070N253791N252305N223388N176430
3271D39223938N118446N053101M980965M901199M815636M728965M647332M574356M509582
3280D82553520M447212M378243M295845M196625M083786L965110L849602L743553L647652
3289E19161148L556786L461570L353310L227692L088150K943611K804756K677650K559700
3298E46834373K440796K308426K154961J983757J807671J643981J504670J391830J296921
3307E63367386J206665J111946J012306R17397Q40301P90024P66640P60994P58133
3316E71531792P45697P17468O76231O30150N87464N52215N21279M85763M35906L67469
$$ plain form
3326 577251434 577535248 577733421 577860413 577944908 578019753 578110809 578228035 578364258 578501282 578620224
3336 578620224 578711052 578775711 578823357 578862305 578892670 578903656 578877792 578798981 578659019 578458366 578200836
3347 578200836 577884178 577493744 577002907 576382217 575613594 574701767 573679390 572599335 571520233
3356 571520233 570491524 569543800 568689728 567934074 567285500 566764069 566399460 566220703 566242027 566451874
3366 566451874 566809807 567254333 567717400 568142014 568493919 568766022 568972778 569135323 569267235 569363708
3376 569363708 569401131 569348335 569182129 568901405 568530922 568113327 567693405 567301826 566947746 566624680
3386 566624680 566323586 566046753 565814438 565657921 565604744 565663452 565816422 566023903 566238823 566423531
3396 566423531 566561127 566657257 566731606 566804504 566885757 566969070 567035866 567064285 567040558 566966515 566860046
$$ packed form
3326E77251434K83814J98173J26992Q4495P4845R1056J17226J36223J37024J18942
3336E78620224R0828O4659M7646L8948L0365J0986k5864p8811j39962k00653k57530
3347E78200836l16658l90434m90837o20690p68623r11827j022377j080055j079102
3356E71520233j028709r47724q54072p55654o48574n21431l64609j78757K1324K09847
3366E66451874L57933M44526M63067M24614L51905K72103K06756J62545J31912R6473
3376E69363708L7423n2796j66206k80724l70483m17595m19922l91579l54080l23066
3386E66624680l01094k76833k32315j56517n3177N8708J52970K07481K14920J84708
3396E66423531J37596R6130P4349P2898Q1253Q3313O6796K8419k3727p4043j06469
$$ plain form
3407 566860046 566748238 566657219 566600685 566573753 566554184 566510506 566413651 566248283 566018639 565746880 565465317
3418 565465317 565206871 564995041 564840698 564742813 564692726 564679070 564690857 564719009 564754868 564792862 564830437
3429 564830437 564871025 564922943 564997139 565102654 565242805 565414352 565609894 565821075 566038551 566251869
3439 566251869 566447449 566611061 566734276 566824379 566909180 567032242 567238235 567554245 567976990 568474808
3449 568474808 569001312 569516830 570001602 570457115 570895157 571323662 571739693 572133293 572497864 572839088
3459 572839088 573175430 573529282 573916321 574338989 574787598 575247841 575707664 576159859 576601448 577032433
3469 577032433 577456703 577882652 578321762 578782730 579262657 579743614 580198708 580605850 580963211 581293907
3479 581293907 581636238 582023811 582469063 582959557 583469391 583979378 584488945 585013084 585567284 586151657
$$ packed form
3407E66860046j11808r1019n6534k6932j9569m3678r6855j65368k29644k71759k81563
3418E65465317k58446k11830j54343r7885n0087j3656J1787K8152L5859L7994L7575
3429E64830437M0588N1918P4196J05515J40151J71547J95542K11181K17476K13318
3439E66251869J95580J63612J23215R0103Q4801J23062K05993L16010M22745M97818
3449E68474808N26504N15518M84772M55513M38042M28505M16031L93600L64571L41224
3459E72839088L36342L53852L87039M22668M48609M60243M59823M52195M41589M30985
3469E77032433M24270M25949M39110M60968M79927M80957M55094M07142L57361L30696
3479E81293907L42331L87573M45252M90494N09834N09987N09567N24139N54200N84373
$$ plain form
3489 586151657 586747704 587329712 587884903 588422813 588968964 589544144 590142441 590727081 591247177 591667366
3499 591667366 591992912 592271919 592574158 592957764 593442230 594006271 594606094 595205154 595795708 596399498
3509 596399498 597051430 597775650 598570633 599409065 600251427 601062965 601822929 602524223 603165970 603745346
3519 603745346 604257164 604698143 605074844 605408287 605734444 606099091 606550369 607128906 607856598 608725815
3529 608725815 609695511 610697632 611660309 612538261 613337784 614116974 614954605 615900917 616933784 617951965
3539 617951965 618815117 619413376 619730759 619862709 619974594 620224800 620694427 621364365 622149277 622963409
3549 622963409 623770828 624594154 625479279 626452179 627501106 628596230 629725533 630904961 632145157
3558 632145157 633387833 634467087 635139694 635192261 634577675 633499641 632383499 631730270 631923218
$$ packed form
3489E86151657N96047N82008N55191N37910N46151N75180N98297N84640N20096M20189
3499E91667366L25546K79007L02239L83606M84466N64041N99823N99060N90554O03790
3509E96399498O51932P24220P94983Q38432Q42362Q11538P59964P01294O41747N79376
3519F03745346N11818M40979L76701L33443L26157L64647M51278N78537P27692Q69217
3529F08725815R69696J002121R62677Q77952P99523P79190Q37631R46312J032867J018181
3539F17951965Q63152N98259L17383J31950J11885K50206M69627O69938P84912Q14132
3549F22963409Q07419Q23326Q85125R72900J048927J095124J129303J179428J240196
3558F32145157J242676J079254O72607N2567o14586j078034j116142o53229J92948
$$ plain form
3567 631923218 633077354 635007629 637324982 639601250 641525269 642983551 644054489 644941025 645879974
3576 645879974 647058945 648550034 650269623 651977692 653337555 654035034 653923416 653124695 652025604
3585 652025604 651147537 650942001 651609192 653029556 654843597 656628876 658081512 659111404 659824677
3594 659824677 660426254 661116409 662030258 663229446 664716415 666437454 668267975 670007401 671411514
3603 671411514 672271576 672508545 672232590 671730957 671378098 671504898 672274628 673612366 675214081 676637650
3613 676637650 677462692 677475204 676810684 675976181 675698929 676624069 678975220 682343903 685753098 688009949
3623 688009949 688214798 686185684 682581635 678651810 675729523 674715652 675790863 678462601 681874619
3632 681874619 685195007 687900848 689870605 691309204 692586899 694070282 695975342 698252029 700527039
$$ packed form
3567F31923218J154136J930275K317353K276268J924019J458282J070938Q86536R38949
3576F45879974J178971J491089J719589J708069J359863O97479j11618p98721j099091
3585F52025604q78067k05536O67191J420364J814041J785279J452636J029892P13273
3594F59824677O01577O90155R13849J199188J486969J721039J830521J739426J404113
3603F71411514Q60062K36969k75955n01633l52859J26800P69730J337738J601715J423569
3613F76637650Q25042J2512o64520q34503k77252R25140K351151L368683L409195K256851
3623F88009949K04849k029114l604049l929825k922287j013871J075211K671738L412018
3632F81874619L320388K705841J969757J438599J277695J483383J905060K276687K275010
$$ plain form
3641 700527039 702154465 702410431 700798645 697344437 692712402 688043442 684548111 683036270 683615341
3650 683615341 685707855 688369217 690727539 692326736 693222046 693830185 694659500 696066589 698138046
3659 698138046 700695419 703375473 705733643 707351227 707940140 707432785 706010590 704031448 701871338
3668 701871338 699749680 697647858 695384293 692815323 690043869 687498398 685819016 685602951 687144699
3677 687144699 690300980 694532242 699070282 703112259 705968857 707151337 706438980 703945389 700163116
3686 700163116 695920486 692206802 689893646 689460373 690848618 693517685 696668015 699517975 701517487
3695 701517487 702433701 702330704 701501389 700391769 699513245 699313965 700010910 701444931 703057632
3704 703057632 704056091 703733444 701810760 698625336 695051346 692174606 690869293 691470337 693684158
$$ packed form
3641G00527039J627426K55966j611786l454208m632035m668960l495331j511841N79071
3650F83615341K092514K661362K358322J599197Q95310O08139Q29315J407089K071457
3659F98138046K557373K680054K358170J617584N88913n07355j422195j979142k160110
3668G01871338k121658k101822k263565k568970k771454k545471j679382k16065J541748
3677F87144699L156281M231262M538040M041977K856598J182480p12357k493591l782273
3686G00163116m242630l713684k313156m33273J388245K669067L150330K849960J999512
3695G01517487R16214j02997q29315j109620q78524j99280O96945J434021J612701
3704G03057632R98459l22647j922684l185424l573990k876740j305313O01044K213821
$$ plain form
3713 693684158 696752243 699766693 701986694 703030624 702904739 701904755 700462723 699014740 697917862
3722 697917862 697413864 697614822 698484573 699812241 701196365 702084656 701901932 700263977 697209778
3731 697209778 693334045 689704056 687526474 687661819 690200577 694330597 698611526 701561966 702289658
3740 702289658 700838852 698074799 695168152 692971497 691638718 690688248 689449463 687599258 685451279
3749 685451279 683821716 683559799 685037308 687907791 691273346 694149170 695945053 696692734 696915436
3758 696915436 697253723 698081512 699328003 700568237 701292877 701183243 700253220 698820572 697362518
3767 697362518 696345520 696092911 696708832 698052979 699767609 701367950 702390594 702562485 701912994
3776 701912994 700760574 699567261 698727264 698406296 698515701 698828354 699151306 699441147 699794312 700337601
$$ packed form
3713F93684158L068085L014450K220001J043930j25885r99984j442032j447983j096878
3722F97917862n03998K00958Q69751J327668J384124Q88291j82724j637955l054199
3731F97209778l875733l629989k177582J35345K538758M130020M280929K950440P27692
3740G02289658j450806k764053k906647k196655j332779r50470j238785j850205k147979
3749F85451279j629563k61917J477509K870483L365555K875824J795883P47681K22702
3758F96915436L38287Q27789J246491J240234P24640j09634r30023j432648j458054
3767F97362518j016998k52609O15921J344147J714630J600341J022644J71891o49491
3776G01912994j152420j193313q39997l20968J09405L12653L22952K89841L53165N43289
$$ plain form
3786 700337601 701106033 702003021 702861862 703553467 704046478 704370804 704517517 704360886 703685455 702315521
3796 702315521 700266571 697803268 695351410 693306427 691861801 690972824 690476913 690285797 690507050
3805 690507050 691395111 693152466 695705566 698611450 701173325 702712173 702846680 701621170 699427338
3814 699427338 696782150 694107437 691638031 689485245 687772064 686716156 686581421 687520828 689426727
3823 689426727 691901550 694393311 696426315 697788086 698558197 698961029 699143524 699026260 698331680
3832 698331680 696777496 694313278 691244736 688159714 685693665 684277878 684020767 684784012 686383972
3841 686383972 688755722 691945190 695903778 700215836 703965302 705896759 704872208 700432816 693183136
3850 693183136 684759750 677340698 672876816 672373505 675548553 681011353 686871719 691489716 694028015
$$ packed form
3786G00337601P68432Q96988Q58841O91605M93011L24326J46713j56631o75431j369934
3796G02315521k048950k463303k451858k044983j444626q88977m95911j91116K21253
3805F90507050Q88061J757355K553100K905884K561875J538848J34507j225510k193832
3814F99427338k645188k674713k469406k152786j713181j055908j34735R39407J905899
3823F89426727K474823K491761K033004J361771P70111M02832J82495j17264o94580
3832F98331680j554184k464218l068542l085022k466049j415787k57111P63245J599960
3841F86383972K371750L189468L958588M312058L749466J931457j024551m439392p249680
3850F93183136q423386p419052m463882n03311L175048N462800N860366M617997K538299
$$ plain form
3859 694028015 694588089 693922348 692919922 692145538 691649628 691101913 690120468 688587875 686775055
3868 686775055 685223465 684477386 684822083 686168060 688117371 690150528 691821060 692869492 693233109
3877 693233109 692989044 692289200 691323090 690297394 689413376 688818588 688555527 688542023 688611603 688610077
3887 688610077 688498459 688400955 688562241 689221344 690460968 692108765 693743057 694814529 694836578 693568954
3897 693568954 691123047 687944946 684683990 682000427 680382462 680039062 680891953 682655487 684948959
3906 684948959 687396469 689680862 691556244 692845917 693448868 693359222 692683029 691626740 690450287
3915 690450287 689396820 688629761 688205338 688086090 688182831 688400803 688667755 688936005 689169998 689327927
3925 689327927 689354706 689192963 688811493 688241501 687598648 687069702 686851349 687062302 687667465 688466873
$$ packed form
3859F94028015N60074o65741j002426p74384m95910n47715r81445j532593j812820
3868F86775055j551590p46079L44697J345977J949311K033157J670532J048432L63617
3877F93233109k44065o99844r66110j025696q84018n94788k63061j3504O9580j526
3887F88610077j11618r7504J61286O59103J239624J647797J634292J071472K2049j267624
3897F93568954k445907l178101l260956k683563j617965l43400Q52891J763534K293472
3906F84948959K447510K284393J875382J289673O02951q9646o76193j056289j176453
3915F90450287j053467p67059m24423j19248R6741K17972K66952K68250K33993J57929
3925F89327927K6779j61743l81470n69992o42853n28946k18353K10953O05163P99408
$$ plain form
3935 688466873 689169159 689520493 689422607 688969498 688380356 687867584 687525635 687307434 687094574 686803741
3945 686803741 686452560 686138916 685962372 685950241 686048584 686175003 686281891 686375732 686476593 686563568 686563568
3956 686563568 686402817 686079712 685691452 685378418 685223236 685186691 685139008 684967346 684670258 684356308
3966 684356308 684138336 684016647 683855972 683494644 682902603 682243652 681770859 681616211 681652145 681559372
3976 681559372 681076431 680236511 679374161 678861084 678759232 678697357 678123932 676780777 675006790 673546143
3986 673546143 672914581 672795639 672039337 669456787 664936523 659953461 656723862 656106796 655379028
3995 655379028 647481995 622803421 573164978 496232758 397991447
4000 397991447
$$ packed form
3935F88466873P02286L51334r7886m53109n89142n12772l41949k18201k12860k90833
3945F86803741l51181l13644j76544j2131R8343J26419J06888R3841J00861Q6975%
3956F86563568j60751l23105l88260l13034j55182l6545m7683j71662k97088l13950
3966F84356308k17972j21689j60675l61328n92041o58951m72793j54648L5934r2773
3976F81559372m82941q39920q62350n13077j01852o1875n73425j343155j773987j460647
3986F73546143o31562j18942p56302k582550m520264m983062l229599o17066p27768
3995F55379028p897033k4678574m9638443p6932220r8241311
4000C97991447
##END=$$ End of the data block
