##TITLE=$$ Begin of the data block
##JCAMP-DX=5.00 $$ ACD/SpecManager v 10.08
##SPECTROMETER/DATA SYSTEM=16PC
##DATE=04 Jun 2013 13:32:20
##DATA TYPE=INFRARED SPECTRUM
##DATA CLASS=XYDATA
##ORIGIN=
##OWNER=
##NPOINTS=3601
##FIRSTX=400.00000000
##LASTX=4000.00000000
##MAXX=4000.00000000
##MINX=400.00000000
##MAXY=77.70699310
##MINY=13.71072292
##XFACTOR=1.0000000000
##YFACTOR=0.000000100000000
##FIRSTY=39.61804962
##DELTAX=1.00000000
##XUNITS=1/CM
##YUNITS=TRANSMITTANCE
##XYDATA=(X++(Y..Y))
400C96180496J00196877P9059791N1851502K7100296J0640640L685837L443451N527038
408F77685928O547928N442200L118896J084214J68152J43432K33002r7885p37839j147537
418F92440491r15222j39161O47889R16824N48706r9945n01404l63083J75705O80771
428F93391571P57141L11127m28620j114578j522140j656952j688385j794052k053986
437F84201126k450333k934036l481293m086914m726562n340653n867385o295853o680679
446F42337418p090302p525597p869796p922249p493744o501236m998207l130760j063156
455E88742371J070404L159523N085716O705360P880020Q530274Q676796Q431053P946281
464F46227798P358399O755676O184464N668869N221557M836579M477615M086075L612594
$$ plain form
400 396180496 496377373 575437164 627288666 654388962 665029602 668715439 672158890 677685928
408 677685928 684233856 689676056 692794952 693879166 694047318 694190750 694423752 694325867 693588028 692440491
418 692440491 691525269 691386108 692033997 692950821 693499527 693399582 692898178 692535095 692710800 693391571
428 693391571 694148712 694459839 694031219 692916641 691394501 689737549 688049164 686255112 684201126
437 684201126 681750793 678816757 675335464 671248550 666521988 661181335 655313950 649018097 642337418
446 642337418 635247116 627721519 619851723 611929474 604435730 597934494 592936287 589805527 588742371
455 588742371 589812775 592972298 598058014 604763374 612643394 621173668 629850464 638281517 646227798
464 646227798 653586197 660341873 666526337 672195206 677416763 682253342 686730957 690817032 694429626
473F94429626L051835K453308J896438J442719J093902P91092M48532O104n34363j111297
483G03967896j640168k069092k416992k771759l247909l916397m747010n597000o259613
492F71301956o549835o382370n785904m853897l660812k217713n06439J416473L330078
501F46091537M848481N539627N098877L466797Q11691k605209o562882j0888138j5299530
510F30501251j9203262k1626053k1434097j7800789j0709572j192970Q876114J7390022
518E64800644K2748146K4373131K2783432J9220657J5063706J1323547Q432159O338883
526F95084305M781341L534851K521210J764984J287689J031495Q66699O61468L53699
535G11887741j8616l51333n40848n45960m14352k58636k02713l21656o08062r73969
$$ plain form
473 694429626 697481461 699934769 701831207 703273926 704367828 705158920 705607452 705613556 705079193 703967896
483 703967896 702327728 700258636 697841644 695069885 691821976 687905579 683158569 677561569 671301956
492 671301956 664752121 658369751 652583847 647729950 644069138 641851425 641344986 642761459 646091537
501 646091537 650940018 656479645 661578522 665045319 665857010 663251801 656688919 645800781 630501251
510 630501251 611297989 589671936 568237839 550437050 539727478 538534508 547410622 564800644
518 564800644 587548790 611921921 634705353 653926010 668989716 680313263 688745422 695084305
526 695084305 699865646 703400497 705921707 707686691 708974380 710005875 710872574 711534042 711887741
535 711887741 711869125 711517792 710976944 710430984 710016632 709757996 709555283 709233627 708625565 707651596
545G07651596j293487j463318j452179j318436j184082j179581j382751j789627k319184
554F94268951k866973l367081l836365m373321n094605o040115p082520p900772q054733
563F45652466p141380m988785j787453J910744N346298P804527Q861237Q511505P132339
572F71301498N299912L558426K242584J418991R50470O25763K81906j31225n59922
581F84988403r03244j083374j091003r96018r13391r51538j158066j497879j875763
590F74518127k199554k447128k696915l087616l722229m563217n397720n905304n817986
599F38680458n080337l914566k728997j905937j578903j534729j317253m88167J088982
608F21220551L110427M930954N861321N513954M004898J909714q698j147537j309585
$$ plain form
545 707651596 706358109 704894791 703442612 702124176 700940094 699760513 698377762 696588135 694268951
554 694268951 691401978 688034897 684198532 679825211 674730606 668690491 661607971 653707199 645652466
563 645652466 638511086 633522301 631734848 633645592 638991890 646796417 655657654 664169159 671301498
572 671301498 676601410 680159836 682402420 683821411 684771881 685397644 685679550 685548325 684988403
581 684988403 684085159 683001785 681910782 680914764 680001373 679049835 677891769 676393890 674518127
590 674518127 672318573 669871445 667174530 664086914 660364685 655801468 650403748 644498444 638680458
599 638680458 633600121 629685555 626956558 625050621 623471718 621936989 620619736 620131569 621220551
608 621220551 624330978 629261932 635123253 640637207 644642105 646551819 646543121 645395584 644085999
617F44085999p28989J03149O96945P59430K40632p42646k018738l415336m734268n700074
627F28546104n969352n239716l422928p69767K141456M586868N969811O049156N011444
636F36903076L352051J639404K85111n71518j032791j313401j599769j974678k423935
645F33263550k897072l363991l837700m355087m944763n614891o361580p188530q105431
654E86594505r093094j0044517j0728264j0809593r952202p965889m936905j264229
662E21799812K432442N508423P507439Q295860Q054962P148933N942231M667434L401184
671E74758720K135086Q77076k93427j244240j862144k117043k076988j871643j640854
680E66664543j503944j557160j878814k515030l452301m611702n895386p274017q847008
$$ plain form
617 644085999 643357010 643460159 644157104 644916534 645157166 644414520 642395782 638980446 634246178 628546104
627 628546104 622576752 617337036 613914108 613144341 615285797 619872665 625842476 631891632 636903076
636 636903076 640255127 641894531 642179642 641608124 640575333 639261932 637662163 635687485 633263550
645 633263550 630366478 627002487 623164787 618809700 613864937 608250046 601888466 594699936 586594505
654 586594505 577501411 567456894 556728630 545919037 535966835 528000946 523064041 521799812
662 521799812 524232254 529740677 537248116 545543976 553598938 560747871 566690102 571357536 574758720
671 574758720 576893806 577770882 577477455 576233215 574371071 572254028 570177040 568305397 566664543
680 566664543 565160599 563603439 561724625 559209595 555757294 551145592 545250206 537976189 529129181
689E29129181j0796890j3221245j5920334j8293686j9474106j8683510j5653610j0851173
697D06234627n339890l00712L543510O271248Q658752J1665955J5796928K0702439
705D67232857K5257454K8073120K8161697K5391922K0513420J4777756R390869N094223
713F23893318K052994K9030j323509k237740k782097k951851k788200k429543k065811
722F09396591j849747j833686j977082k205619k470513k770042l123093l529930l956642
731E85680237m349899m671860m921952n128936n329743n555420n840149o242675o841469
740E36798134p690811q738785r772453j0443230j0401688r492950p911720o204300
748D66142197n079689n090943o337356q350907j0244713j1071014j0222244p680016
$$ plain form
689 529129181 518332291 505111046 489190712 470897026 451422920 432739410 417085800 406234627
697 406234627 400894737 400594025 404137535 410408783 419067535 430733490 446530418 467232857
705 467232857 492490311 520563431 548725128 574117050 594630470 609408226 618799095 623893318
713 623893318 625946312 625975342 624651833 622414093 619631996 616680145 613891945 611462402 609396591
722 609396591 607546844 605713158 603736076 601530457 599059944 596289902 593166809 589636879 585680237
731 585680237 581330338 576658478 571736526 566607590 561277847 555722427 549882278 543639603 536798134
740 536798134 529107323 520368538 510596085 500152855 489751167 480258217 472346497 466142197
748 466142197 461062508 455971565 449634209 441283302 431038589 419967575 409745331 402065315
756D02065315l997841m1084L373642N754242P012978P345466P021294O222343N007897
765D39764252L399887J500549m48227k112694l190727l538208l227348k507591j698838
774D27941055j069297p54891p39326q89664j022377r69925o28777J5831Q96264J891822
784D24670715K872963L744431M471016N075950N613099O125526O611938P013779P232971
793D73432388P171784O781845O099968N257339M450226L882904L699417L934212M501152
802E19211235N228615N926246O448479O733589O799088O704597O507149O233749N874138
811E75666885N397568M768944L959083K947617J727638L19672j204224k706299l983573
820E86893311m799996m938049m253197k716980m34379K361450N335083Q094330J0249519
$$ plain form
756 402065315 398067474 398026390 401400032 407154274 414167252 421512718 428534012 434756355 439764252
765 439764252 443164139 444664688 444216461 442103767 438913040 435374832 432147484 429639893 427941055
774 427941055 426871758 426116867 425377541 424487877 423465500 422495575 421866798 421882629 422778893 424670715
784 424670715 427543678 431288109 435759125 440835075 446448174 452573700 459185638 466199417 473432388
793 473432388 480604172 487386017 493485985 498743324 503193550 507076454 510775871 514710083 519211235
802 519211235 524439850 530366096 536814575 543548164 550347252 557051849 563558998 569792747 575666885
811 575666885 581064453 585833397 589792480 592740097 594467735 594787407 593583183 590876884 586893311
820 586893311 582093315 577155266 572902069 570185089 569750710 572112160 577447243 585541573 595791092
829E95791092J1488380J1650467J0779763R128112P098084N131149L579025K604676
837F57250748K150955J994476J858597J538162R86862L27607k08664l89710q3389O84357
847F66110001J740265K826690L693543M176025M235382L949127L464814K933044K456360
856F95585251K060852J710815J343842R16977M35562m6692m57764p47757r22164j043702
866F98835220j206283j492157j936417k516632l164596l794327m319077m652176m698410
875F71055145m348602l502045k108688k19116J988067M224854O157303P494507Q067855
884F88809280P870407P044220N827027M480972L227310K208405J476288J007003P27616
893G22678528N49621L97263K28806M0054j42288k82593l55835l63464l36533l25623
$$ plain form
829 595791092 607279472 618929939 629709702 638837814 645935898 651067047 654646072 657250748
837 657250748 659401703 661396179 663254776 664792938 665779800 666107407 665898743 665509033 665425644 666110001
847 666110001 667850266 670676956 674370499 678546524 682781906 686731033 690195847 693128891 695585251
856 695585251 697646103 699356918 700700760 701617737 702053299 702006607 701548843 700801086 699878922 698835220
866 698835220 697628937 696136780 694200363 691683731 688519135 684724808 680405731 675753555 671055145
875 671055145 666706543 663204498 661095810 660876694 662864761 667089615 673246918 680741425 688809280
884 688809280 696679687 703723907 709550934 714031906 717259216 719467621 720943909 721950912 722678528
893 722678528 723228149 723625412 723854218 723894272 723751984 723469391 723113556 722750092 722413559 722087936
903G22087936l83148n44510q11996j150131j490403j749878j859588j794739j591263
912G10712280j339798j151275j103897j196671j335525j366044j144561o13251J57165
921G01618423R83506J640472J954956J871414J468125R06753L58124o8741l52936n41458
931G09838638p01065q75396j065293j243057j380539j472626j541290j622620j744461
940F98192291j911316k104416k293319k452622k573318k663803k743302k827148k916260
949F75706787k988968k998123k879105k560348j986237j140365o8817J109314K215728
958F64409866L052368L461609L385392K898025K188797J500244J036911Q90427J014633
967F83838272J257095J439515J436157J216812Q39004L97645k6780l99475p25326j024475
$$ plain form
903 722087936 721704788 721160278 720348282 719198151 717707748 715957870 714098282 712303543 710712280
912 710712280 709372482 708221207 707117310 705920639 704585114 703219070 702074509 701461258 701618423
921 701618423 702601929 704242401 706197357 708068771 709536896 710443649 710801773 710733032 710380096 709838638
931 709838638 709137573 708262177 707196884 705953827 704573288 703100662 701559372 699936752 698192291
940 698192291 696280975 694176559 691883240 689430618 686857300 684193497 681450195 678623047 675706787
949 675706787 672717819 669719696 666840591 664280243 662294006 661153641 661084824 662194138 664409866
958 664409866 667462234 670923843 674309235 677207260 679396057 680896301 681933212 682823639 683838272
967 683838272 685095367 686534882 687971039 689187851 690026855 690424500 690397720 689998245 689272919 688248444
977F88248444j312943j598740j892089k209931k558288k907868l175735l243408l008042
986F66341400k447433j652069q08411j28403K29187K09961j41678p30590j463318k268296
996F57140350l080673l806839m315185m469376m194183l533364k658195j810723j210289
1005F28061523r69886j065865j373863j743508k070388k328606k557602k821197l166809
1014F09963799l605652m115219m655114n184402n673828o109429o488456o796875o977196
1023E60357628o896134o341552n072060k920265Q6288L648148P215309J0127297J1820144
1032E72024803J2020683J0834542Q689461O164360L784675J874161N18761l69683r45167
1041F14596596j335259j606903j783714j883888j944123k015457k142525k341461k598114
$$ plain form
977 688248444 686935501 685336761 683444672 681234741 678676453 675768585 672592850 669349442 666341400
986 666341400 663893967 662241898 661433487 661305084 661534271 661744232 661602554 660871964 659408646 657140350
996 657140350 654059677 650252838 645937653 641468277 637274094 633740730 631082535 629271812 628061523
1005 628061523 627091637 626025772 624651909 622908401 620838013 618509407 615951805 613130608 609963799
1014 609963799 606358147 602242928 597587814 592403412 586729584 580620155 574131699 567334824 560357628
1023 560357628 553461494 547119942 542047882 539127617 539213905 542862053 550077362 560204659 572024803
1032 572024803 584045486 594880028 603569489 609733849 613518524 615392685 615911446 615541763 614596596
1041 614596596 613261337 611654434 609870720 607986832 606042709 604027252 601884727 599543266 596945152
1050E96945152k881355l162079l426819l678322l926506m182777m453049m740905n047493
1059E61445847n373764n720673o089668o483727o909675p376709p893906q468666r104157
1068D98024902r799347j0551643j1354065j2197571j3068695j3950805j4823952j5660401
1076C96618423j6419296j7041397j7448540j7559547j7310352j6674271j5671616j4355468
1084B64137936j2789212j1022205r084988p005138m834843k670269o42814J118221
1092B17206688K542648L666077M645748N729790P186241R212398J1852303J4948883
1100B76990776J8151474K0983982K2961102K3724785K3162918K1463165J9081535J6618119
1108D43137856J4637298J3487206J3185615J3415566J3646850J3334007J2129326J0021134
$$ plain form
1050 596945152 594063797 590901718 587474899 583796577 579870071 575687294 571234245 566493340 561445847
1059 561445847 556072083 550351410 544261742 537778015 530868340 523491631 515597725 507129059 498024902
1068 498024902 488225555 477673912 466319847 454122276 441053581 427102776 412278824 396618423
1076 396618423 380199127 363157730 345709190 328149643 310839291 294165020 278493404 264137936
1084 264137936 251348724 240326519 231241531 224236393 219401550 216731281 216088467 217206688
1092 217206688 219749336 223415413 228061161 233790951 240977192 250189590 262041893 276990776
1100 276990776 295142250 316126232 339087334 362812119 385975037 407438202 426519737 443137856
1108 443137856 457775154 471262360 484447975 497863541 511510391 524844398 536973724 546994858
1116E46994858P349548M690933K658882J702042J970558L295517N270272P390785R194107
1125E90517502J0355644J0727692J0326461R290963P826194O145058M417572K743607
1133F52350693J150818l73154j835022l201447m393310n309525n869560o037025n819245
1142F20663223n246048m353294l186951j830139m27132Q26226J732673K166214K124749
1151F12469521J730728J170082O09436J29967k83661p01027j181908j728935k286759
1160F09927444k776756l145714l396492l582153l768883l987465m203605m326325m261436
1169E76478615l989945l629074l432388l698311m610023o077233p672882q734321q616982
1178E26017456o996918m072914n47142K628708M632645N093460M198761K548141Q40111
$$ plain form
1116 546994858 554344406 559035339 561694221 563396263 565366821 568662338 573932610 581323395 590517502
1125 590517502 600873146 611600838 621927299 631218262 639044456 645189514 649607086 652350693
1133 652350693 653501511 653128357 651293335 648091888 643698578 638389053 632519493 626482468 620663223
1142 620663223 615417175 611063881 607876930 606046791 605619659 606445885 608178558 610344772 612469521
1151 612469521 614200249 615370331 615979767 616109734 615826073 615125046 613943138 612214203 609927444
1160 609927444 607150688 604004974 600608482 597026329 593257446 589269981 585066376 580740051 576478615
1169 576478615 572488670 568859596 565427208 561728897 557118874 551041641 543368759 534634438 526017456
1178 526017456 519020538 514947624 514400482 517029190 521661835 526755295 530954056 533502197 534342308
1187E34342308m36439j157570j517716j840210k377395l201027m219971n278091o252251
1196E08061638p098923p839355q516922r169846r824142j0508499j1255951j2095147
1204D31752853j3033180j4050522j5113830j6195641j7284241j8368148j9407273k0304146
1212B97995872k0900688k1003570k0431137j9060574j6865406j3930645j0448170o692657
1220A68663025k976742M07791L254490N484314P155953Q430500R506721J0551586J1654778
1229B22132416J2818012J3978462J5047016J5943280J6613521J7033291J7198124J7113457
1237C47877579J6791267J6253853J5542030J4726601J3902321J3171997J2614975J2257690
1245D63138313J2059479J1925392J1739502J1402321J0853958J0073776R066391P849999
$$ plain form
1187 534342308 533905869 532748299 531230583 529390373 527012978 523811951 519591980 514313889 508061638
1196 508061638 500962715 493123360 484606438 475436592 465612450 455103951 443848000 431752853
1204 431752853 418719673 404669151 389555321 373359680 356075439 337707291 318300018 297995872
1212 297995872 277095184 256091614 235660477 216599903 199734497 185803852 175355682 168663025
1220 168663025 165686283 166094074 169348564 174832878 181988831 190419331 199926052 210477638 222132416
1229 222132416 234950428 248928890 263975906 279919186 296532707 313565998 330764122 347877579
1237 347877579 364668846 380922699 396464729 411191330 425093651 438265648 450880623 463138313
1245 463138313 475197792 487123184 498862686 510265007 521118965 531192741 540259132 548109131
1253E48109131O457062M940071L364410J776352J62849j569328l556480n884476q483238
1262E45316353j1074333j3223076j4486923j4587746j3516884j1510735q920593o057548
1270D51938515l113823k03247K521782M775543O151085O259689M914894K256279j274872
1279D74225845n091552q663674j1653404j3921051j5424347j6096420j5794182j4345551
1287C73235664j1667938p873001l299751J540985O079368R806328J2362404J3587456
1295C93771515J3535385J2458916J0754280Q864021P147408N762367M610481L376198
1303D60280571J661339q33283m149284p988396j1738739j4600525j5777549j4686699
1311C92167435j1132584n398788J775589R342575J6179542K1343308K4272117K4871064
$$ plain form
1253 548109131 554566193 559506264 562870674 564647026 564809875 563240547 559684067 553799591 545316353
1262 545316353 534242020 521018944 506532021 491944275 478427391 466916656 457996063 451938515
1270 451938515 448824692 448621445 451143227 455918770 462069855 468329544 473244438 475500717 474225845
1279 474225845 469134293 460470619 448817215 434896164 419471817 403375397 387581215 373235664
1287 373235664 361567726 353694725 350394974 351935959 358015327 367821655 380184059 393771515
1295 393771515 407306900 419765816 430520096 439384117 446531525 452293892 456904373 460280571
1303 460280571 461941910 461108627 456959343 448970947 437232208 422631683 406854134 392167435
1311 392167435 381034851 375636063 377411652 386754227 402933769 424277077 448549194 473420258
1319D73420258K3472900K0695763J7264709J3840790J0903702Q694725P218856O294594
1327E81806297N631295M916725L883857K345276K04659k536316n742416r087067j2016029
1336E69406281j3790284j3656959j1115990o181679M90761P716141J4107513J8506432
1344E65482216K0328636J9684753J7237893J3885688J0425263P341080M776458K643891
1352F61805878P82547r34143k576142m199371n890884p771607r936981j2361946j4821129
1361F04096222j6875839j7953339j7510414j5234833j1209640n969887m09851M443435
1369E23375854P716790Q933334Q119431N742950K517395q35190l767509n982247p399444
1378E38421364q069000q087502p559318o597329n335846l930740k530556j242256j07536
$$ plain form
1319 473420258 496893158 517588921 534853630 548694420 559598122 568292847 575511703 581806297
1327 581806297 587437592 592354317 596238174 598583450 598788109 596251793 590509377 581422310 569406281
1336 569406281 555615997 541959038 530843048 524661369 525152130 532868271 546975784 565482216
1344 565482216 585810852 605495605 622733498 636619186 647044449 654385529 659161987 661805878
1352 661805878 662588425 661654282 659078140 654878769 648987885 641216278 631279297 618917351 604096222
1361 604096222 587220383 569267044 551756630 536521797 525312157 519342270 518932419 523375854
1369 523375854 531092644 540025978 548145409 553888359 556405754 555570564 551803055 545820808 538421364
1378 538421364 530352364 522264862 514705544 508108215 502772369 498841629 496311073 495068817 494961281
1387D94961281Q87222J777649K581520L276138L803254M093895M096870L796387L213310
1396E22487526K392845J395416K89383q50639j949501k938690l774109m444351m972344
1405E07635536n400810n772438o111412o417504o674804o866226o984330p029037o992951
1414D49386024o841011o501693n878029m880943l477135j723786K22435K140084L807640
1423D26253586N075493N909881O386032O633416O757698O785202O658516O286850N619278
1432D82365952M699211L656997K654839J808128J136704N72700J3886o13976j329460
1441D94964981k113647k953263l864555m874268n965919p033768p889404q331566q243332
1450D43695259p657280o744804n732231m797135m005432l330574k726212k195549j801490
$$ plain form
1387 494961281 495848503 497626152 500207672 503483810 507287064 511380959 515477829 519274216 522487526
1396 522487526 524880371 526275787 526565170 525714531 523765030 520826340 517052231 512607880 507635536
1405 507635536 502234726 496462288 490350876 483933372 477258568 470392342 463408012 456378975 449386024
1414 449386024 442545013 436043320 430165291 425284348 421807213 420083427 420305862 422445946 426253586
1423 426253586 431329079 437238960 443624992 450258408 457016106 463801308 470459824 476746674 482365952
1432 482365952 487065163 490722160 493376999 495185127 496321831 496894531 496908417 496294441 494964981
1441 494964981 492851334 489898071 486033516 481159248 475193329 468159561 460270157 451938591 443695259
1450 443695259 436037979 429293175 423560944 418763809 414758377 411427803 408701591 406506042 404704552
1459D04704552j603585j573982j558037j323890o85387L79562J691933K947350L870124
1468D06848640M348412M475403M470711M535408M731102M954719N017281M769935M196129
1477D48347740L420983K642746K038002J701240J641655J820030K184639K678452L224106
1486D69699593L716278M048881M173050M152298M175491M505501N381127O916084R034538
1495E15802841J1464310J3787765J5527764J6258812J5722274J3926507J1188545Q085403
1503F21764221N299416L399238K643700K895393L701096M494095M833298M553451L772812
1512F57356720K770615J821518J078033N51834J75552j12762l18604l96194k90146
1521F62636566J9531M94233J039428J525116J819687J829376J540909J046524N23987
$$ plain form
1459 404704552 403100967 401526985 399968948 398645058 397959671 398339233 400031166 402978516 406848640
1468 406848640 411197052 415672455 420143166 424678574 429409676 434364395 439381676 444151611 448347740
1477 448347740 451768723 454411469 456449471 458150711 459792366 461612396 463797035 466475487 469699593
1486 469699593 473415871 477464752 481637802 485790100 489965591 494471092 499852219 506768303 515802841
1495 515802841 527267151 541054916 556582680 572841492 588563766 602490273 613678818 621764221
1503 621764221 627063637 630462875 633106575 636001968 639703064 644197159 649030457 653583908 657356720
1512 657356720 660127335 661948853 663026886 663578720 663754272 663641510 663322906 662926712 662636566
1521 662636566 662656097 663150330 664189758 665714874 667534561 669363937 670904846 671951370 672475357
1530F72475357J63956P0419J82571K85187J11466m96064j466217k490692l154144l134384
1540F62547455k369690j101761K33536J203003J561737J336212P75452K06985j23596
1549F64269333j59683m3183l6468l88108j201782k355041l511429m231262m150620
1558F48191757l160705j499329L04184J626358K013092J384201O9504j347046k309418
1567F45272598k549820k192382j651078j380615j622353k293281l068848l603439l745690
1576F23165092l614425l491326l606910l960686m299889m276657l682098k612190j450653
1585E92170258o78482o28548j329460k536545l903732n184746o317368p349586q269081
1594E55972710q874970q795509p673874n408173k306480R53827L556289M859009M638024
$$ plain form
1530 672475357 672639313 672709732 672892303 673177490 673288956 672792892 671326675 668835983 665681839 662547455
1540 662547455 660177765 659076004 659309540 660512543 662074280 663410492 664185944 664392929 664269333
1549 664269333 664109650 664066467 664029999 663641891 662440109 660085068 656573639 652342377 648191757
1558 648191757 645031052 643531723 643835907 645462265 647475357 648859558 648929062 647582016 645272598
1567 645272598 642722778 640530396 638879318 637498703 635876350 633583069 630514221 626910782 623165092
1576 623165092 619550667 616059341 612452431 608491745 604191856 599915199 596233101 593620911 592170258
1585 592170258 591491776 590863228 589533768 586997223 583093491 577908745 571591377 564241791 555972710
1594 555972710 547097740 538302231 530628357 525220184 522913704 523867531 527423820 532282829 536920853
1603E36920853L151168J002617j116867k691841l538894l809090l852120m022560m511604
1612E17531662n278473o098213o697884o906128o737404o380043o092796o076393o387978
1621D60876350o937370p557182q094368q473244q709259q882446r102326r482269j0118065
1630C83519821j1058197j2263489j3578033j4747353j5494957j5632095j5146198j4206848
1638B71392651j3084488j2021256j1122379j0328350r469872q359546o864434m923381
1646A95218945k517319L62758L716679P496376J1555100J5622100J9328213K2279663
1654B73062515K4153977K4784088K4204216K2640152K0440559J7973290J5513038J3175545
1662D35947380J0928116Q675003O374817M114876K095184N23109n13763j110764j495781
$$ plain form
1603 536920853 540072021 541074638 539957771 537265930 533727036 529917946 526065826 522043266 517531662
1612 517531662 512253189 506154976 499457092 492550964 485813560 479433517 473340721 467264328 460876350
1621 460876350 453938980 446381798 438287430 429814186 421104927 412222481 403120155 393637886 383519821
1630 383519821 372461624 360198135 346620102 331872749 316377792 300745697 285599499 271392651
1638 271392651 258308163 246286907 235164528 224836178 215366306 207006760 200142326 195218945
1646 195218945 192701626 193064384 196781063 204277439 215832539 231454639 250782852 273062515
1654 273062515 297216492 322000580 346204796 368844948 389285507 407258797 422771835 435947380
1662 435947380 446875496 455550499 461925316 466040192 468135376 468658485 468144722 467033958 465538177
1671D65538177j895904k406731k960357l416405l714485l976441m475441n480690p072563
1680D30139160r056091j1034851j2611656j3593026j4078216j4385452j4870301j5745926
1688C24763641j7002105j8443299j9790802k0771942k1155701k0747356j9395904j7049160
1696A70407372j3828002j0068302o260833k891426k51580J682778L225355M809713
1704A46825075O758356R104233J1550827J3580303J4648724J4373474J2641277R612046
1712B39094315N648822J217251l203487p184391j0386715j2582417j3656902j3596077
1720A85350399j2456207j0339413p384043l775072K37713M343844Q212156J1561508
1728A75750885J4229126J6198711J7567921J8471432J9001331J9171791J8945961J8303642
$$ plain form
1671 465538177 463642273 461235542 458275185 454858780 451144295 447167854 442692413 437211723 430139160
1680 430139160 421083069 410048218 397436562 383843536 369765320 355379868 340509567 324763641
1688 324763641 307761536 289318237 269527435 248755493 227599792 206852436 187456532 170407372
1696 170407372 156579370 146511068 140250235 137358809 137107229 138790007 142015362 146825075
1704 146825075 153583431 162687664 174238491 187818794 202467518 216840992 229482269 239094315
1712 239094315 244743137 245960388 242756901 235572510 225185795 212603378 198946476 185350399
1720 185350399 172894192 162554779 155170736 151395664 151633377 155977221 164189377 175750885
1728 175750885 189980011 206178722 223746643 242218075 261219406 280391197 299337158 317640800
1736C17640800J7304116J6102600J4903679J3880348J3102035J2516022J1987000J1377067
1744D28813667J0619889R756164Q910942Q234673P832870P720833P822075Q002624
1752D97713737Q128777Q114700P944031P659149P330895P024040O782989O626244O554794
1761E63879356O551552O573029O545791O378212N999909N409584M703522M056511L655853
1770F13753319L612022L901520M370079M801559N013237M927292M584503M103470L614579
1779F52681580L214950K953262K838898K854462K951431L046570L033524K825088K409287
1788F78809052J881942J424866J224136J370545J797790K300492K629089K611847K241592
1797F96291351J675110J152191Q77457R27048J229324J614990J910401K016754J941757
$$ plain form
1736 317640800 334944916 351047516 365951195 379831543 392933578 405449600 417436600 428813667
1744 428813667 439433556 449189720 458100662 466335335 474168205 481889038 489711113 497713737
1752 497713737 505842514 513957214 521901245 529560394 536891289 543915329 550698318 557324562 563879356
1761 563879356 570430908 577003937 583549728 589927940 595927849 601337433 606040955 610097466 613753319
1770 613753319 617365341 621266861 625636940 630438499 635451736 640379028 644963531 649067001 652681580
1779 652681580 655896530 658849792 661688690 664543152 667494583 670541153 673574677 676399765 678809052
1788 678809052 680690994 682115860 683339996 684710541 686508331 688808823 691437912 694049759 696291351
1797 696291351 697966461 699118652 699996109 700923157 702152481 703767471 705677872 707694626 709636383
1806G09636383J773224J618271J545715J560516J619950J673050J695709J700211J715774
1815G24538803J756897J804581J815872J753311J612549J428146J251297J116638J023102
1824G38101196R47037Q72040Q15582Q23822R36737J148606J395874J588668J664048
1833G48293610J628341J544800J481171J448288J379318J176224P90252K88849j51825
1842G57879028l31497j38245L74833J005630J502838J690216J548996J205979Q49304
1851G65587082O22635N58090N88913O11038N61295M52881L58505L51333M48761N90439
1861G70730972O64139N68924K75116j48315n54047p83539p39975m38766m654L83682
1871G69953537N73349M99954K09732j76391n22232p34101p83920p01828n43137l65524
$$ plain form
1806 709636383 711409607 713027878 714573593 716134109 717754059 719427109 721122818 722823029 724538803
1815 724538803 726295700 728100281 729916153 731669464 733282013 734710159 735961456 737078094 738101196
1824 738101196 739048233 739920273 740735855 741559677 742496414 743645020 745040894 746629562 748293610
1833 748293610 749921951 751466751 752947922 754396210 755775528 756951752 757742004 758030853 757879028
1842 757879028 757547531 757409286 757784119 758789749 760292587 761982803 763531799 764737778 765587082
1851 765587082 766209717 766767807 767356720 767967758 768529053 768981934 769340439 769691772 770140533 770730972
1861 770730972 771395111 771964035 772239151 772090836 771536789 770753250 770013275 769574509 769569855 769953537
1871 769953537 770526886 771026840 771236572 771060181 770537949 769803848 769019928 768318100 767774963 767409439
1881G67409439k15759j29090j28097k12250l49960m79889n34897m74396l07922r3308
1891G64483871R6360K08587K35672K07825J67084J36719J18026R8114P1793M7073L5324
1902G65906448L4790K8000n874o4011j09329q5297M5700K69776N15213O84814P08618
1913G67928848N83954L76587J84555Q2398R0179J70059K61536L18146L30276L15704
1923G70642242K98462K85263K62452K08740J15127m882j19553j94855k11792j76315
1933G71104889j15585o9733p2174j40152k62756m04969n17807n59311n14450m07104
1943G68040848k93122k37121k82135m26331o20956p90863q66699q15125o48193m12903
1953G62647400j65176N4397K33917L83606N18036O39420P31201P65381P21359O00204
$$ plain form
1881 767409439 767193680 767064590 766936493 766724243 766374283 765894394 765359497 764885101 764577179 764483871
1891 764483871 764580231 764788818 765024490 765232315 765399399 765536118 765654144 765752258 765824051 765871124 765906448
1902 765906448 765941238 765969238 765963364 765899353 765790024 765704727 765750427 766020203 766535416 767220230 767928848
1913 767928848 768512802 768889389 769073944 769156342 769246521 769416580 769678116 769996262 770326538 770642242
1923 770642242 770940704 771225967 771488419 771697159 771812286 771807404 771687851 771492996 771281204 771104889
1933 771104889 770989304 770919571 770847397 770707245 770444489 770039520 769521713 768962402 768447952 768040848
1943 768040848 767747726 767510605 767228470 766802139 766181183 765390320 764523621 763708496 763060303 762647400
1953 762647400 762482224 762536621 762770538 763154144 763672180 764311600 765042801 765808182 766529541 767129745
1963G67129745M30222K56729J21384M5471K0676J7395N340l0060p5454r9411o8360
1974G67753677L4714J96381L79944N38635O37207O63299O30951N68695N05524M56085
1984G72365112M18701L78800L22800K50091J75324J23748J19095J69144K60239L61938
1994G74944992M37164M60434M24500L42254K39182J40686O4468J6251q240j8081k3346
2005G77020264l2578n1193q2092j23597j70822k15835k50473k68936k70920k60315
2015G75293503k42157k22473k03553j85165j64566j38855j07574p3243m2190k2431
2025G73891296j9912l4256n7144p4769p3623m7226j831M5090P2708O5918K4032l9596
2037G73750687j01166j39313j41830j12763o8359l0975j7472l4714p5378j22681j57852
$$ plain form
1963 767129745 767559967 767816696 767938080 767983551 768004227 768021622 768026962 767996902 767921448 767822037 767753677
1974 767753677 767788391 767984772 768364716 768903351 769540558 770203857 770834808 771403503 771909027 772365112
1984 772365112 772783813 773162613 773485413 773735504 773910828 774034576 774153671 774322815 774583054 774944992
1994 774944992 775382156 775842590 776267090 776609344 776848526 776989212 777053680 777069931 777061691 777043610 777020264
2005 777020264 776987686 776936493 776854401 776730804 776559982 776344147 776093674 775824738 775553818 775293503
2015 775293503 775051346 774828873 774625320 774440155 774275589 774136734 774029160 773955917 773913727 773891296
2025 773891296 773871384 773837128 773779984 773705215 773631592 773584366 773582535 773627625 773700333 773766251 773790283 773750687
2037 773750687 773649521 773510208 773368378 773255615 773187256 773156281 773138809 773104095 773028717 772906036 772748184
2048G72748184j69525j58310j37329j25504j37863j77231k34451k91214l30887l46298
2058G70639572l42789l34014l33024l45993l67507l85056l85590l62396l17459k62070
2068G67203674k09503j70975j51290j48240j52053j51062j34736r7885m3106J9684
2078G65964508P6981J15966J29776J20163R4376O4926M1809L0136K9602L3951L5401
2089G66737595K8305J0376j5030m1046o0044o7291o3095n2414m3335m2419n0812o4240
2101G66276550p5149p6142o4773m5700k8000k1362l1052n5618q6365j12839j26114
2112G65553436j21994j02539p5607m9591l1967k6856l4408n0660p0648q8119r8877
2123G64802170j01929j00250r9182j04676j20468j44119j69220j86844j89133j74407
$$ plain form
2048 772748184 772578659 772420349 772283020 772157516 772019653 771842422 771607971 771316757 770985870 770639572
2058 770639572 770296783 769962769 769629745 769283752 768916245 768531189 768145599 767783203 767465744 767203674
2068 767203674 766994171 766823196 766671906 766523666 766371613 766220551 766085815 765987930 765944824 765964508
2078 765964508 766041489 766157455 766287231 766407394 766501770 766566696 766608505 766638641 766668243 766702194 766737595
2089 766737595 766765900 766776276 766761246 766720200 766660156 766592865 766529770 766477356 766434021 766391602 766340790 766276550
2101 766276550 766201401 766125259 766060486 766014786 765986786 765965424 765934372 765878754 765792389 765679550 765553436
2112 765553436 765431442 765328903 765253296 765203705 765171738 765144882 765110474 765059814 764989166 764901047 764802170
2123 764802170 764700241 764599991 764500809 764396133 764275665 764131546 763962326 763775482 763586349 763411942
2133G63411942j46943j15127q8272o9809n8823m9133l3951j0605J9074M8217O9657
2144G62976227P7286O9732M9134K0751r765l6392n5161o4545o7138o7673p2708q7204
2156G62732544j11313j40533j66550j82190j86310j85394j89667k10113k48108k95716
2166G60816650l36532l53775l38822k95410k39334j90353j63880j64718j86234k13852
2176G58333740k33688k36511k22855j99432j76392j62353j60294j68457j80206j87073
2186G56406479j83487j67770j45417j24359j14136j19781j39771j66473j88751j98517
2196G54858017j92108j73187j51368j37100j39847j63040k04620k57034l10059l54843
2206G52774811l85742m03595m11988m14734m11071l93906l50723k71988j55106j1291
$$ plain form
2133 763411942 763264999 763149872 763061600 762991791 762932968 762883835 762849884 762839279 762858353 762906570 762976227
2144 762976227 763053513 763123245 763172379 763193130 763183365 763146973 763091812 763027267 762960129 762892456 762819748 762732544
2156 762732544 762621231 762480698 762314148 762131958 761945648 761760254 761570587 761360474 761112366 760816650
2166 760816650 760480118 760126343 759787521 759492111 759252777 759062424 758898544 758733826 758547592 758333740
2176 758333740 758100052 757863541 757640686 757441254 757264862 757102509 756942215 756773758 756593552 756406479
2186 756406479 756222992 756055222 755909805 755785446 755671310 755551529 755411758 755245285 755056534 754858017
2196 754858017 754665909 754492722 754341354 754204254 754064407 753901367 753696747 753439713 753129654 752774811
2206 752774811 752389069 751985474 751573486 751158752 750747681 750353775 750003052 749731064 749575958 749564667
2216G49564667J36261K60315L35998L51639L10440K28577J28555L2196m5700r9792
2226G51203156j33057j53427j69297j85165k00729k11106k10113j94702j66703j32675
2236G49446182j01318q0490p2937p6447q5220r2163r1706q0719n9509l2272m730J5793
2248G48684464K3193J5182o485l5629o3324q3160r2163r2316r0637r5215j11847j40610
2260G47911453j76391k07825k22778k13776j80664j32828q4381n0735l8147m5243o1874
2271G46496811p6141p9270o9275m9820k6245l433J5488K9831L8452L9138L1357J4038
2283G46360931j0681m2038p9269j21918j69372k17057k58560k86102k93808k82135
2293G44599991k54517k20184j88141j65710j55335j55258j57394j53122j35727j07575
$$ plain form
2216 749564667 749700928 749961243 750297241 750648880 750959320 751187897 751316452 751348648 751302948 751203156
2226 751203156 751070099 750916672 750747375 750562210 750361481 750150375 749940262 749745560 749578857 749446182
2236 749446182 749344864 749264374 749191437 749114990 749029770 748937607 748845901 748765182 748705673 748673401 748668671 748684464
2248 748684464 748707657 748722839 748716354 748680725 748617401 748534241 748442078 748349762 748259125 748163910 748052063 747911453
2260 747911453 747735062 747527237 747304459 747090683 746910019 746777191 746692810 746642075 746603928 746558685 746496811
2271 746496811 746420670 746341400 746272125 746222305 746196060 746192627 746208115 746237946 746276398 746315536 746346893 746360931
2283 746360931 746350250 746308212 746228943 746107025 745937653 745720596 745462036 745175934 744882126 744599991
2293 744599991 744345474 744125290 743937149 743771439 743616104 743460846 743303452 743150330 743014603 742907028
2303G42907028q1863p9193j16120j94702k94342l75442l95813l28141j79824O942J66016
2314G41034546K29797J56250n2261l43170o27060q07495q20160o64444m12369j82495
2324G37511139q7662j77688m11759o75812q42971q41217o91071m85840l33328k93961
2334G32669830l59268m84543o42852q56400j167450j562042j908264j962204j474228
2343G22252579l42942J269761K946395M159394M495544L836975K410279O72912q92868
2352G40808029j970138k490921k589875k476883k316436k172318k029419j856155j650315
2361G21255569j443481j273575j148529j041641r09805p26548m98047k57873m2725
2370G13913345J28937K64664L86505N17120O67725Q35953J011352J176987J311874
$$ plain form
2303 742907028 742825165 742745972 742629852 742435150 742140808 741765366 741369553 741041412 740861588 740868530 741034546
2314 741034546 741264343 741420593 741368332 741025162 740398102 739590607 738770447 738106003 737693634 737511139
2324 737511139 737423477 737245789 736834030 736158218 735315247 734474030 733782959 733297119 732963791 732669830
2334 732669830 732310562 731826019 731183167 730326767 729159317 727597275 725689011 723726807 722252579
2343 722252579 721909637 723179398 726125793 730285187 734780731 738617706 741027985 741700897 740808029
2352 740808029 738837891 736346970 733757095 731280212 728963776 726791458 724762039 722905884 721255569
2361 721255569 719812088 718538513 717389984 716348343 715438538 714711990 714213943 713956070 713913345
2370 713913345 714042282 714306946 714693451 715210571 715878296 716714249 717725601 718902588 720214462
2379G20214462J391068J392593J307068J146088R42077P37534N68390M50287L75900
2388G28525467L24249K73743K14233J48239Q6365M0436J5640J0987J8615K7161K4567
2399G29709702J678m4174j06125j69907k18048k37808k28577k00195j70059j52435
2409G28184052j52665j65558j79290j82724j70746j46713j19553r9182r2392j00098
2419G26775131j18027j38854j55488j64032j65634j66549j74485j97448k36283k86560
2429G24971771l37677l77350l95507l88718l58658l14407k66495k23694j92413j71433
2439G21945419j56555j40152j16577q4152m6921j2817J0528J7166Q469j0223l0976
2450G21383209m6539n3330n3176n0660n2566o4316q7204j18332j50070j72577j77689
$$ plain form
2379 720214462 721605530 722998123 724305191 725451279 726393356 727130890 727699280 728149567 728525467
2388 728525467 728849716 729123459 729337692 729485931 729572296 729612732 729628372 729639359 729657974 729685135 729709702
2399 729709702 729711380 729667206 729561081 729391174 729173126 728935318 728706741 728506546 728336487 728184052
2409 728184052 728031387 727865829 727686539 727503815 727333069 727186356 727066803 726967621 726875229 726775131
2419 726775131 726657104 726518250 726362762 726198730 726033096 725866547 725692062 725494614 725258331 724971771
2429 724971771 724634094 724256744 723861237 723472519 723113861 722799454 722532959 722309265 722116852 721945419
2439 721945419 721788864 721648712 721532135 721447983 721401062 721388245 721398773 721415939 721424408 721414185 721383209
2450 721383209 721336670 721283340 721230164 721179504 721126938 721062622 720975418 720857086 720707016 720534439 720356750
2461G20356750j62734j31684r5291o6910n6915o9962j01165j39771j73035j91574j92718
2472G18974991j81046j66626j59378j65558j84707k09503k29416k36206k27051k05917
2482G17009583j82572j67541j66169j79138j99356k18811k29874k29263k18429k01569
2492G15016861j85700j76239j77764j91498k14386k40326k60544k67944k59934k40478
2502G12802048k18964k05383k06757k21939k43988k62070k68173k58941k38877k15835
2512G10461121j97754j89820j91269j98211k03858k03018j93100j76086j55945j39389
2522G08612671j30692j30539j34277j35040j25275j02310o9885l7689j7396j6937l6545
2533G07676086o8512r8648j13983j08261q4076n2566k7542j9761l1738n7525q4916
$$ plain form
2461 720356750 720194016 720062332 719967041 719900131 719843216 719773254 719672089 719532318 719359283 719167709 718974991
2472 718974991 718793945 718627319 718467941 718302383 718117676 717908173 717678757 717442551 717215500 717009583
2482 717009583 716827011 716659470 716493301 716314163 716114807 715895996 715666122 715436859 715218430 715016861
2492 715016861 714831161 714654922 714477158 714285660 714071274 713830948 713570404 713302460 713042526 712802048
2502 712802048 712583084 712377701 712170944 711949005 711705017 711442947 711174774 710915833 710676956 710461121
2512 710461121 710263367 710073547 709882278 709684067 709480209 709277191 709084091 708908005 708752060 708612671
2522 708612671 708481979 708351440 708217163 708082123 707956848 707854538 707784653 707746964 707729568 707712631 707676086
2533 707676086 707607574 707508926 707394943 707286682 707202606 707150040 707122498 707102737 707070999 707013474 706928558
2544G06928558j02768j03988q9722o7444m8904m3411n5390q2855j18027j50757j73263
2555G05892029j80512j75781j65100j58463j62887j82266k12784k47574k76718k92435
2565G03837509k92816k80609k64588k53601k54669k68554k90757l12195l24020l21350
2575G00974350l05710k85110k70310k69623k85263l10592l33710l42789l32412l05024
2585F97933807k71911k45438k36359k46582k71301l01361l27988l45535l53470l54767
2595F94979095l53241l52630l55835l63007l72696l81012l82995l73840l52402l21579
2605F91369858k88697k62756k50091k51770k62680k74964k80075k74887k60773k43301
2615F88719864k28577k20337k18887k22397k26745k29569k29340k25753k18964k09274
$$ plain form
2544 706928558 706825790 706721802 706632080 706564636 706515732 706472321 706416931 706334076 706216049 706065292 705892029
2555 705892029 705711517 705535736 705370636 705212173 705049286 704867020 704654236 704406662 704129944 703837509
2565 703837509 703544693 703264084 702999496 702745895 702491226 702222672 701931915 701619720 701295700 700974350
2575 700974350 700668640 700383530 700113220 699843597 699558334 699247742 698914032 698571243 698238831 697933807
2585 697933807 697661896 697416458 697180099 696933517 696662216 696360855 696032867 695687332 695333862 694979095
2595 694979095 694625854 694273224 693917389 693554382 693181686 692800674 692417679 692043839 691691437 691369858
2605 691369858 691081161 690818405 690568314 690316544 690053864 689778900 689498825 689223938 688963165 688719864
2615 688719864 688491287 688270950 688052063 687829666 687602921 687373352 687144012 686918259 686699295 686490021
2625F86490021j98441j87912j81732j81198j87225j96610k04315k06070j99432j86234
2635F84560852j71814j61896j59454j62735j67236j66397j56861j39389j18255j00251
2645F83056564q8958q5373q7281q9798Tq5830p9651p4387p3089p8202q8882j03378
2657F82031937j17798j28861j33819j33362j29623j26114j26801j34735j49002j68381
2667F80683441j89590k08817k24457k34909k41012k43759k44828k45971k48108k51389
2677F78350601k54669k55966k54135k49710k44751k43760k50015k64816k86636l11432
2687F75734711l33405l49045l56140l56674l53470l50952l52631l59573l71399l85895
2697F72165527l99170m08172m11453m09928m06875m06571m12979m27093m46702m68215
$$ plain form
2625 686490021 686291580 686103668 685921936 685740738 685553513 685356903 685152588 684946518 684747086 684560852
2635 684560852 684389038 684227142 684067688 683904953 683737717 683571320 683414459 683275070 683156815 683056564
2645 683056564 682967606 682882233 682794952 682705154 682615356 682529526 682449875 682375488 682302399 682224197 682135315 682031937
2657 682031937 681914139 681785278 681651459 681518097 681388474 681262360 681135559 681000824 680851822 680683441
2667 680683441 680493851 680285034 680060577 679825668 679584656 679340897 679096069 678850098 678601990 678350601
2677 678350601 678095932 677839966 677585831 677336121 677091370 676847610 676597595 676332779 676046143 675734711
2687 675734711 675401306 675052261 674696121 674339447 673985977 673635025 673282394 672922821 672551422 672165527
2697 672165527 671766357 671358185 670946732 670536804 670129929 669723358 669310379 668883286 668436584 667968369
2707F67968369m87137n01709n12162n21850n32990n47256n63126n78537n89828n96161
2717F62537613n97763n96390n94406n93262n93872n96542o00434o04782o08444o09207
2727F56542511o05850n98145n87387n77011n70526n69382n73196n77698n78766n71747
2737F50732803n55420n30319m99801m67530m37011m11377l92456l82157l81241l89251
2747F46286240m04892m26255m51126m78286n06363n33982n59082n79376n92651n98679
2757F41155548n98907n96810n95855n99099o06498o16303o24618o27861o24428o15425
2767F35049744o06156o03103o12717o38619o79206p27349p73239q06846q23136q21228
2777F27958145q06007p83654p58476p31544p00608o62384o16264n65071n14565m71496
$$ plain form
2707 667968369 667481232 666979523 666467361 665945511 665412521 664865265 664302139 663723602 663133774 662537613
2717 662537613 661939850 661343460 660749054 660155792 659561920 658965378 658364944 657760162 657151718 656542511
2727 656542511 655936661 655338516 654751129 654174118 653603592 653034210 652461014 651883316 651304550 650732803
2737 650732803 650177383 649647064 649147263 648679733 648242722 647831345 647438889 647056732 646675491 646286240
2747 646286240 645881348 645455093 645003967 644525681 644019318 643485336 642926254 642346878 641754227 641155548
2757 641155548 640556641 639959831 639363976 638764877 638158379 637542076 636917458 636289597 635665169 635049744
2767 635049744 634443588 633840485 633227768 632589149 631909943 631182594 630409355 629602509 628779373 627958145
2777 627958145 627152138 626368484 625610008 624878464 624177856 623515472 622899208 622334137 621819572 621348076
2787F21348076m40292m23394m18472m22058m30527m41246m52881m66079m81568m99458
2797F16872101n19982n42068n63126n80291n89829n88379n74684n50232n19409m88510
2807F11355591m64668m50860m45632m43802m37050m19617l89862l52592l16163k89344
2817F07346001k77520k81524k97203l19481l44696l71323m01497m37393m79431n26161
2827F03609772n73998o17790o54335o80542o96678p04460p08008p12319p21893p39441
2837E96800308p64045p91893q18444q40301q58651q78791r08089r52911j014367j087493
2847E87885323j163063j230050j280937j313820j332206j343918j356888j376686j404877
2856E76082878j440010j478538j518441j559257j603317j654282j714211j781883j851463
$$ plain form
2787 621348076 620907784 620484390 620065918 619643860 619213333 618772087 618319206 617853127 617371559 616872101
2797 616872101 616352119 615810051 615246925 614666634 614076805 613488426 612913742 612363510 611844101 611355591
2807 611355591 610890923 610440063 609994431 609550629 609113579 608693962 608304100 607951508 607635345 607346001
2817 607346001 607068481 606786957 606489754 606170273 605825577 605454254 605052757 604615364 604135933 603609772
2827 603609772 603035774 602417984 601763649 601083107 600386429 599681969 598973961 598261642 597539749 596800308
2837 596800308 596036263 595244370 594425926 593585625 592726974 591848183 590940094 589987183 588972816 587885323
2847 587885323 586722260 585492210 584211273 582897453 581565247 580221329 578864441 577487755 576082878
2856 576082878 574642868 573164330 571645889 570086632 568483315 566829033 565114822 563332939 561481476
2865E61481476j912689j954804j967964j947784j896248j821099j734886j650314j579476
2874E45016212j532020j513138j525879j569290j640244j732444j838684j951485k064438
2883E29648590k173271k276039k371483k458572k535706k601509k655563k700844k742043
2892E07133560k784881k833291k884712k929115k950745k930030k852898k713966k521668
2901D81732254k294846k058715j835823j641121j478463j342773j225929j121140j027832
2910D67705612r50317q96301q72803q83599r28459j002426j097984j204949j312179
2919D58556595j408615j486359j539535j566124j565209j534614j471367j372261j236725
2928D45375786j072464q93250p17315n60112m28772l18375k16141j07689J4878J47705
$$ plain form
2865 561481476 559568787 557613983 555646019 553698235 551801987 549980888 548246002 546595688 545016212
2874 545016212 543484192 541971054 540445175 538875885 537235641 535503197 533664513 531713028 529648590
2883 529648590 527475319 525199280 522827797 520369225 517833519 515232010 512576447 509875603 507133560
2892 507133560 504348679 501515388 498630676 495701561 492750816 489820786 486967888 484253922 481732254
2901 481732254 479437408 477378693 475542870 473901749 472423286 471080513 469854584 468733444 467705612
2910 467705612 466755295 465858994 464986191 464102592 463174133 462171707 461073723 459868774 458556595
2919 458556595 457147980 455661621 454122086 452555962 450990753 449456139 447984772 446612511 445375786
2928 445375786 444303322 443410072 442692757 442132645 441703873 441385498 441169357 441061668 441076546 441224251
2938D41224251K75650L78609M38003M44717M00162L16277K08740R3384j8578j21841
2948D43639374k15607l00751l77235m42467m90722n14908n09682m73824m12712l38134
2958D39563332k65923k12860j93024k15416k83584l95851n47028p29485r33342j147193
2968D34639626j357537j549721j707000j809845j837044j764030j568184j233597p59926
2977D21052742j68762M95338J171875J795693K314758K699509K947197L076171L114510
2986D38499031L088532L018913K921066K809944K706299K632370K607346K636642K706680
2995D63626823K787209K839584K830696K744637K585602K375335K144166J920318J723213
3004D85577583J560593J431007J325913J233978J142960J041832R21745P79495O16188
$$ plain form
2938 441224251 441499901 441878510 442316513 442761230 443161392 443477669 443686409 443779793 443761215 443639374
2948 443639374 443423767 443123016 442745781 442303314 441812592 441297684 440788002 440314178 439901466 439563332
2958 439563332 439297409 439084549 438891525 438676109 438392525 437996674 437449646 436720161 435786819 434639626
2968 434639626 433282089 431732368 430025368 428215523 426378479 424614449 423046265 421812668 421052742
2977 421052742 420883980 421379318 422551193 424346886 426661644 429361153 432308350 435384521 438499031
2986 438499031 441587563 444606476 447527542 450337486 453043785 455676155 458283501 460920143 463626823
2995 463626823 466414032 469253616 472084312 474828949 477414551 479789886 481934052 483854370 485577583
3004 485577583 487138176 488569183 489895096 491129074 492272034 493313866 494235611 495015106 495631294
3013D95631294M37737K53410P1335j02692k66151m18244n59463o89125q05397r05914
3023D92646790r89266j053467j099090j128502j148911j171951j211815j279716j376648
3032D82187424j486092j575737j604729j539650j369857j117211q32824n82505m25644
3041D71653175l96042m93965o89125r36126j191369j425590j627846j802406j956749
3050D61133957k096787k218055k309723k359047k357483k308655k228088k141304k077370
3059D41037445k059517k098274k188072k308731k432900k533912k593270k604256k570686
3068D19647827k503433k417297k327729k249794k196960k178650k197723k247696k314568
3077C99013977k381477k433663k465439k476844k469941k441673k380638k269745k098236
$$ plain form
3013 495631294 496069031 496322441 496393776 496291084 496024933 495606689 495047226 494358101 493552704 492646790
3023 492646790 491657524 490604057 489504967 488376465 487227554 486055603 484843788 483564072 482187424
3032 482187424 480701332 479125595 477520866 475981216 474611359 473494148 472661324 472078819 471653175
3041 471653175 471257133 470763168 470074043 469137917 467946548 466520958 464893112 463090706 461133957
3050 461133957 459037170 456819115 454509392 452150345 449792862 447484207 445256119 443114815 441037445
3059 441037445 438977928 436879654 434691582 432382851 429949951 427416039 424822769 422218513 419647827
3068 419647827 417144394 414727097 412399368 410149574 407952614 405773964 403576241 401328545 399013977
3077 399013977 396632500 394198837 391733398 389256554 386786613 384344940 381964302 379694557 377596321
3086C77596321j869888j609955j360016j165695j060181j054306j135216j275024j442680
3095C65623360j613465j770515j901512j993065k029457j996651j890259j720810j514053
3104C49193573j302376j114387r64508q49343p52716o54259n38597m00848k46620q7776
3114C42282143O3247J96991L09334M00200M75197N41572O09055O87065P80869Q90731
3124C47236404J009179J124916J226883J309318J375084J433868J496201J569328J650200
3133C59431381J727791J786881J814918J807747J770325J714515J653939J599426J555672
3142C74862595J522255J494979J467896J435432J391602J332321J254425J158295J048164
3151C86967964R30329Q13369P03202O02722N10216M22401L35541K48871J62277P8697
$$ plain form
3086 377596321 375726433 374116478 372756462 371590767 370530586 369476280 368341064 367066040 365623360
3095 365623360 364009895 362239380 360337868 358344803 356315346 354318695 352428436 350707626 349193573
3104 349193573 347891197 346776810 345812302 344962959 344210243 343555984 343017387 342616539 342369919 342282143
3114 342282143 342345390 342542381 342851715 343251915 343727112 344268684 344877739 345564804 346345673 347236404
3124 347236404 348245583 349370499 350597382 351906700 353281784 354715652 356211853 357781181 359431381
3133 359431381 361159172 362946053 364760971 366568718 368339043 370053558 371707497 373306923 374862595
3142 374862595 376384850 377879829 379347725 380783157 382174759 383507080 384761505 385919800 386967964
3151 386967964 387898293 388711662 389414864 390017586 390527802 390950203 391285744 391534615 391696892 391775589
3161C91775589j602p9842j59645k44064l34473m28696n22995o12487o94237p67899
3171C87929649q33282q90885r39025r75800r99908j012764j017723j019707j022453
3180C79218102j026383j030464j031418j028519j021919j015167j011543j014328j025010
3189C70013351j043357j068116j097335j129189j161308j192131j220513j246071j270256
3198C59585075j294326j320267j349297j382484j420784j464424j512413j562844j611633
3207C46666603j655807j694298j728707j763572j804123j853028j909256j967239k020302
3216C30270271k062683k092056k109680k119332k124385k125855k122250k110176k085323
3225C11318531k045116j989098j920471j844940j770001j700821j639538j581726j518840
$$ plain form
3161 391775589 391773987 391694145 391534500 391290436 390955963 390527267 390004272 389391785 388697548 387929649
3171 387929649 387096367 386205482 385266457 384290657 383290749 382277985 381260262 380240555 379218102
3180 379218102 378191719 377161255 376129837 375101318 374079399 373064232 372052689 371038361 370013351
3189 370013351 368969994 367901878 366804543 365675354 364514046 363321915 362101402 360855331 359585075
3198 359585075 358290749 356970482 355621185 354238701 352817917 351353493 349841080 348278236 346666603
3207 346666603 345010796 343316498 341587791 339824219 338020096 336167068 334257812 332290573 330270271
3216 330270271 328207588 326115532 324005852 321886520 319762135 317636280 315514030 313403854 311318531
3225 311318531 309273415 307284317 305363846 303518906 301748905 300048084 298408546 296826820 295307980
3234B95307980j440373j339264j213760j070328r17797p65209o16398m68388l14655
3243B87161808j47934L6049K36111M49123O70605Q99963J139088J391239J658249J939087
3253B95433388K228279K520084K808190L089561L362942L627472L881073M118728M333153
3262C25402870M516754M664650M775925M853973M903984M931298M938545M925537M892731
3271C68806267M841003M775429M703979M633675M569016M509658M450913M387283M315682
3280D09992905M236679M153137M067993L981476L891487L794594L689842L578682L465767
3289D44852562L354149L244743L134117L017998K892189K757225K615166K469520K322083
3298D70659752K171135K013435J846924J672058J493340J317062J149216R95140Q56666
$$ plain form
3234 295307980 293867607 292528343 291314583 290244255 289326458 288561249 287944851 287476463 287161808
3243 287161808 287013874 287049923 287286034 287735157 288405762 289305725 290444813 291836052 293494301 295433388
3253 295433388 297661667 300181751 302989941 306079502 309442444 313069916 316950989 321069717 325402870
3262 325402870 329919624 334584274 339360199 344214172 349118156 354049454 358987999 363913536 368806267
3271 368806267 373647270 378422699 383126678 387760353 392329369 396839027 401289940 405677223 409992905
3280 409992905 414229584 418382721 422450714 426432190 430323677 434118271 437808113 441386795 444852562
3289 444852562 448206711 451451454 454585571 457603569 460495758 463252983 465868149 468337669 470659752
3298 470659752 472830887 474844322 476691246 478363304 479856644 481173706 482322922 483318062 484174728
3307D84174728P34673O29158N38979M62760L98674L45803L03612K73590K56652K52953
3317D88371582K59552K70844K80494K83852K80647K74010K69584K72027K82135K97432
3327D91142159L12843L25126L35122L47595L69873M08592M65508N37376O14624O87180
3337D95545998P47528P92732Q25691Q53081Q80051R07745R30443R37881R18007Q62427
3347E04201584P69577O46286N05829L63426K31171J16996K2431n2414j06316j33743
3357E06564827j25351p1640L2425J83678L69072N69038P63893R36699J077652J182709
3367E11483002J250915J281929J275025J230583J151504J046067R25216Q01010O81305
3376E21126556N69344M63409L60222K59094J64376Q3656K6398j755J450L2959Q7928
$$ plain form
3307 484174728 484909401 485538559 486077538 486540298 486938972 487284775 487588387 487861977 488118629 488371582
3317 488371582 488631134 488901978 489182472 489466324 489746971 490020981 490290565 490562592 490844727 491142159
3327 491142159 491455002 491780128 492115250 492462845 492832718 493241310 493706818 494244194 494858818 495545998
3337 495545998 496293526 497086258 497911949 498765030 499645081 500552826 501483269 502421150 503339157 504201584
3347 504201584 504971161 505617447 506123276 506486702 506717873 506834869 506857300 506804886 506698570 506564827
3357 506564827 506439476 506367836 506400261 506583939 506953011 507522049 508285942 509222641 510300293 511483002
3367 511483002 512733917 514015846 515290871 516521454 517672958 518719025 519644241 520445251 521126556
3376 521126556 521695900 522159309 522519531 522778625 522943001 523026657 523053055 523051300 523052750 523085709 523173637
3387E23173637J62354K51655L50991M52385N44891O16875O59981O71691O56853O24657
3397E28165970N83382N38978M92668M44107L94173L45650L01857K65007K34031K06452
3407E31972275J80549J58387J43966J40381J44959J48544J39046J07994N7297p7m5089
3418E33148232o2180m6043m654M5433Q7471J11503J17264J11771J04217J02272J09635
3429E33824921J26495J51596J82114K14309K44255K68441K85454K95257K98309K93580
3439E36184731K77786K49634K13165J81236J72844K04201K79045L83377M88510N63622
3449E39198151N90820N71632N26734M81720M54712M48150M51126M50402M39224M20608
3459E44033279M04053L98941M07639M28543M56085M86183N14946N37644N48973N46264
$$ plain form
3387 523173637 523335991 523587646 523938637 524391022 524935913 525552788 526212769 526884460 527541313 528165970
3397 528165970 528749352 529288330 529780998 530225105 530619278 530964928 531266785 531531792 531765823 531972275
3407 531972275 532152824 532311211 532455177 532595558 532740517 532889061 533028107 533136101 533193398 533193321 533148232
3418 533148232 533086052 533040009 533035355 533080788 533168259 533279762 533397026 533508797 533613014 533715286 533824921
3429 533824921 533951416 534103012 534285126 534499435 534743690 535012131 535297585 535592842 535891151 536184731
3439 536184731 536462517 536712151 536925316 537106552 537279396 537483597 537762642 538146019 538634529 539198151
3449 539198151 539788971 540360603 540887337 541369057 541823769 542271919 542723045 543173447 543612671 544033279
3459 544033279 544437332 544836273 545243912 545672455 546128540 546614723 547129669 547667313 548216286 548762550
3469E48762550N33028N19524N18112N32684N54581N64537N45502M95987M34989L93448
3479E53854942L95050M42658N14259N78423O12983O18401O13365O18172O39191O63681
3489E59551125O72569O56776O27976O10046O20613O53839O80275O65474N95436M90647
3499E65824776L97529L63121M04930N01214O02798O62689O63414O23474N85251N86624
3509E71215820O39534P26052Q10470Q60253Q62426Q24776P67059P07093O52313N99708
3519E78665504N43137M79546M14924L62091L37944L56751M26330N43061O88400Q29849
3529E83647537R29375R57107R08547Q13332P27119P05872P73811R01413J012611J021385
3539E92398109Q81348O18515L28255J29127J00937K42233M73900O85997Q01506Q14591
$$ plain form
3469 548762550 549295578 549815102 550333214 550865898 551420479 551985016 552530518 553026505 553461494 553854942
3479 553854942 554249992 554692650 555206909 555785332 556398315 557016716 557630081 558248253 558887444 559551125
3489 559551125 560223694 560880470 561508446 562118492 562739105 563392944 564073219 564738693 565334129 565824776
3499 565824776 566222305 566585426 566990356 567491570 568094368 568757057 569420471 570043945 570629196 571215820
3509 571215820 571855354 572581406 573391876 574252129 575114555 575939331 576706390 577413483 578065796 578665504
3519 578665504 579208641 579688187 580103111 580465202 580803146 581159897 581586227 582129288 582817688 583647537
3529 583647537 584576912 585534019 586442566 587255898 587983017 588688889 589462700 590364113 591376724 592398109
3539 592398109 593279457 593897972 594226227 594355354 594456291 594698524 595172424 595858421 596659927 597474518
3549E97474518P80525P70950Q22487R18617J014328J077309J116181J160545J217041
3558F06352501J232490J104088P44553J63994m92096r81484j076660o83594R8725J015701
3568F07478218J772652K163925K146072J828118J397934J035385Q54988Q91495J108970
3577F20677757J414261J670303J723519J459350Q70018R4986o05087r53522p89566
3586F25562019j62353O82106J417160J790962J739693J391296R73091O83251O07757
3595F34684982P17392R28650J167488J393662J580009J676331J609344J321411Q27103
3604F45906372K39792k59247m95529l79334N2033O47888J195984J490402J398468R14231
3614F50711060J92184m69208p15790k93502P87506K176132L269958L468781K484207
$$ plain form
3549 597474518 598255043 599025993 599848480 600767097 601781425 602858734 603974915 605135460 606352501
3558 606352501 607584991 608689079 609433632 609597626 609105530 608124046 607047386 606363792 606462517 607478218
3568 607478218 609250870 611414795 613560867 615388985 616786919 617822304 618677292 619568787 620677757
3577 620677757 622092018 623762321 625485840 626945190 627815208 627910194 627305107 626351585 625562019
3586 625562019 625399666 626081772 627498932 629289894 631029587 632420883 633393974 634077225 634684982
3595 634684982 635402374 636331024 637498512 638892174 640472183 642148514 643757858 645079269 645906372
3604 645906372 646146164 645886917 645391388 645012054 645064087 645711975 646907959 648398361 649796829 650711060
3614 650711060 650903244 650434036 649718246 649424744 650212250 652388382 655658340 659127121 661611328
3623F61611328N34134j702118l371887l841934k985153j209565P68662K276230K959213
3632F55038910K856979K283325J620179J156921J029129J233292J654587K075500K196655
3641F71145477J722412N12619j268692l129119m407044m571915l504867j588669M57993
3650F55368195J924820K435379K080688J302185O21719L84522O47278J236038J886063
3659F67886887K365722K525482K294770J676254P60422k62833j148147j697846j872101
3668F72528610j824035j809617k015151k409058k726517k610092j825256m14582J301270
3677F58195572K870331L904419M205627L772583K726364J237259m84466k159958l434449
3686F70833282l958206l531799k236404m45786J301422K520828K959671K653199J842880
$$ plain form
3623 661611328 662145462 660443344 657071457 653229523 650244370 649034805 649803467 652079697 655038910
3632 655038910 657895889 660179214 661799393 662956314 663985443 665218735 666873322 668948822 671145477
3641 671145477 672867889 673380508 672111816 668982697 664575653 660003738 656498871 654910202 655368195
3650 655368195 657293015 659728394 661809082 663111267 663732986 664117508 664764786 666000824 667886887
3659 667886887 670252609 672778091 675072861 676749115 677509537 677246704 676098557 674400711 672528610
3668 672528610 670704575 668894958 666879807 664470749 661744232 659134140 657308884 656894302 658195572
3677 658195572 661065903 664970322 669175949 672948532 675674896 676912155 676427689 674267731 670833282
3686 670833282 666875076 663343277 661106873 660661087 661962509 664483337 667443008 670096207 671939087
3695F71939087Q36944j00402p79801j069183q91647k71836N99976J366730J614379
3704F73244247J070939k12784j824494l141021l606644k994995j511078L13797J869049
3713F63207016K719116K741089K103272J133499J61361n80673r86404j044617q00247
3722F68653412l28980K67945Q57162J272659J332779Q90503r2086j464081k855301
3731F68534012l748398l665924k414856k64206K075272L709716L969422K751160O01348
3740F71547546j544571k835006k934647k159805j240997q54035j208343j938095k362061
3749F54469986j933899o00967J147842K567825L086472K612915J549530N26581L3722
3758F63460007J80816O95343J135483J155396O74820j22986r21097j430740j492920
$$ plain form
3695 671939087 672776031 672675629 671895828 670826645 669934998 669663162 670263138 671629868 673244247
3704 673244247 674315186 674102402 672277908 669136887 665530243 662535248 661024170 661337967 663207016
3713 663207016 665926132 668667221 670770493 671903992 672065353 671484680 670498276 669453659 668653412
3722 668653412 668324432 668592377 669449539 670722198 672054977 672945480 672853394 671389313 668534012
3731 668534012 664785614 661119690 658704834 658440628 660515900 664225616 668195038 670946198 671547546
3740 671547546 670002975 667167969 664233322 662073517 660832520 659978485 658770142 656832047 654469986
3749 654469986 652536087 651935120 653082962 655650787 658737259 661350174 662899704 663426285 663460007
3758 663460007 663640823 664336166 665471649 666627045 667301865 667178879 666257782 664827042 663334122
3767F63334122j104126l83759M67911J211319J619568J547775J002579J67541o53457
3776F67209473j162186j207504q52814l29514J00022K88391K68402J99432K39182M32510
3786F65185394O88858Q61130Q56323O98777M94842L31650J93100l7079m77753j129684
3796F67665558j828690k317123k396469k057038j484527r34296n57632k99759M5090
3805F55835114O57272J515961K350387K769089K489548J516800J59225j138840k028198
3814F64126358k409897k418899k266770k065277j758880j203461l29743P41043J716309
3823F54130783K283707K291107J837234J206589O92673M21753K90222N4169m88739
3832F62719498j341248k269440k920227l007278k468796j489563l83453N93185J372528
$$ plain form
3767 663334122 662229996 661846237 662314148 663525467 665145035 666692810 667695389 667862930 667209473
3776 667209473 666047287 664839783 663986969 663657455 663757477 664045868 664314270 664513702 664752884 665185394
3786 665185394 665874252 666735382 667591705 668290482 668785324 669116974 669310074 669272995 668795242 667665558
3796 667665558 665836868 663519745 661123276 659066238 657581711 656647415 656089783 655790024 655835114
3805 655835114 656492386 658008347 660358734 663127823 665617371 667134171 667293396 666154556 664126358
3814 664126358 661716461 659297562 657030792 654965515 653206635 652003174 651673431 652414474 654130783
3823 654130783 656414490 658705597 660542831 661749420 662442093 662863846 663154068 663208237 662719498
3832 662719498 661378250 659108810 656188583 653181305 650712509 649222946 648839493 649432678 650805206
3841F50805206K064133K800903L542710L976135L614654K073136o23551l889389o706466
3850F57657471q025513p241058m508934p24831K843323N089721N512162M353409K396469
3859F57352219N43899n92346q96683o83822m35105n03464r37347j495819j818542j638413
3869F48894577r26743R9183J090011J731415J872864J560974R78393L34092k23160
3878F55411606o29273q75702r63211q85772o56586l41110n7678P5683K0523j33285
3888F50965195k00959q163M84619J125794J622772J680755J153641J22147j136246
3897F55809555k262726k954635l054810k577515j669616n51606N47104J433869J987991
3906F46707611K174301K032929J649170J117401N17883q0872o07223r80072j129227
$$ plain form
3841 650805206 652869339 655670242 659212952 663189087 666803741 668876877 668253326 664363937 657657471
3850 657657471 649631958 642390900 637881966 637157135 640000458 645090179 650602341 654955750 657352219
3859 657352219 657896118 657303772 656407089 655723267 655288162 654784698 653847351 652351532 650532990 648894577
3869 648894577 647967834 648067017 649157028 650888443 652761307 654322281 655300674 655634766 655411606
3878 655411606 654782333 653906631 652943420 652057648 651401062 651059952 651002274 651077957 651098480 650965195
3888 650965195 650764236 650756073 651240692 652366486 653989258 655670013 656823654 656945801 655809555
3897 655809555 653546829 650592194 647537384 644959869 643290253 642738647 643285751 644719620 646707611
3906 646707611 648881912 650914841 652564011 653681412 654199295 654118423 653511200 652531128 651401901
3915F51401901j032257p44476l85056q5983P4616J04446P6370O6300R7274J23139P0724
3926F49766998j00784l56674n94635o94199n80826k66571J50681N22537P08847O35071
3936F49190445L24631j03760m84085o77643o42242m51355k48337j59836k18353l48740
3946F46180725m29611l80554k17896l5019P2480P3471J1291m9667q3771j20316k00653
3957F44820480l18451m07333l92761k66800j12610m8676j28784k91366m04206l80554
3967F42068939k60467j84632k65731m73023o37512n93033l39203p1106l3073k96440
3977F38914719o66962q25539o11458k07443l1090l77769j106491j673393j567116q27484
3987F31019974j73188n12008k107315m083214m852066l425903q11768l70293o492538
$$ plain form
3915 651401901 650369644 649625168 649240112 649154129 649228745 649333191 649409561 649475861 649573135 649696274 649766998
3926 649766998 649666214 649309540 648714905 648020706 647439880 647173309 647323990 647846527 648555374 649190445
3936 649190445 649515076 649411316 648927231 648249588 647607346 647155991 646907654 646747818 646529465 646180725
3946 646180725 645751114 645370560 645152664 645117645 645190125 645263596 645274887 645225220 645141449 645021133 644820480
3957 644820480 644502029 644094696 643701935 643435135 643322525 643273849 643145065 642853699 642449493 642068939
3967 642068939 641808472 641623840 641358109 640885086 640247574 639654541 639315338 639244232 639211159 638914719
3977 638914719 638247757 637422218 636810760 636603317 636572227 636194458 635087967 633414574 631847458 631019974
3987 631019974 630846786 630334778 628227463 624144249 619292183 615866280 615054512 614684219 608191681
3996F08191681k2033997m5915908p2503968r3477897
4000C74259911
$$ plain form
3996 608191681 586157684 540241776 467737808 374259911
4000 374259911
##END=$$ End of the data block
