##TITLE=$$ Begin of the data block
##JCAMP-DX=5.00 $$ ACD/SpecManager v 10.08
##SPECTROMETER/DATA SYSTEM=16PC
##DATE=04 Jun 2013 14:13:04
##DATA TYPE=INFRARED SPECTRUM
##DATA CLASS=XYDATA
##ORIGIN=
##OWNER=
##NPOINTS=3601
##FIRSTX=400.00000000
##LASTX=4000.00000000
##MAXX=4000.00000000
##MINX=400.00000000
##MAXY=78.05484772
##MINY=8.89698410
##XFACTOR=1.0000000000
##YFACTOR=0.000000100000000
##FIRSTY=39.76576614
##DELTAX=1.00000000
##XUNITS=1/CM
##YUNITS=TRANSMITTANCE
##XYDATA=(X++(Y..Y))
400C97657661J01944199P9780617N1458282K6127777R875412L679428M227753O692810
$$ 397657661 499601860 579382477 630840759 656968536 666843948 670523376 674751129 681443939
408F81443939P581253O060791L387375J279984N41153P55310R70535O07681j42135
$$ 681443939 689025192 695085983 698473358 699753342 700294495 701049805 702020340 702628021 702485886
417G02485886o26908l79333M81491J365585J686707J280365M55017k99607o75201p00226
$$ 702485886 701858978 701479645 701961136 703326721 705013428 706293793 706748810 706449203 705774002 705073776
427G05073776o22101o68029q99277j238480j598129j964111k365113k787628l139190
$$ 705073776 704451675 703783646 702884369 701645889 700047760 698083649 695718536 692930908 689791718
436F89791718l313065l299103l232040l327027l740463m471207n373764o264267p031326
$$ 689791718 686478653 683179550 679947510 676620483 672880020 668408813 663035049 656770782 649739456
445F49739456p666397q203163q635597q880081q813515q338890p419091o063118m290809
$$ 649739456 642073059 633869896 625234299 616354218 607540703 599201813 591782722 585719604 581428795
454E81428795k130699L37448K935905N389481P398949Q749618R384995R406776R005394
$$ 581428795 579298096 579635544 582571449 587960930 595359879 604109497 613494492 622901268 631906662
463F31906662Q376617P677002P020874O492768O138992N939484N789947N533447N036545
$$ 631906662 640283279 647960281 654981155 661473923 667612915 673552399 679342346 684875793 689912338
472F89912338M271546L345413K453918J782608J412735J283493J224976J037674N79376
$$ 689912338 694183884 697529297 699983215 701765823 703178558 704462051 705687027 706724701 707304077
481G07304077j77917j136170k108917k894287l365936l538285l570862l698043m105912
$$ 707304077 707126160 705989990 703881073 700986786 697620850 694082565 690511703 686813660 682707748
490F82707748m828796n715179o493836o889953o720353n923080m528351k621422l53088
$$ 682707748 677878952 672163773 665669937 658779984 652059631 646136551 641608200 638986778 638633690
499F38633690K014732M091492N428772N678024M739380K796097J71356k898941o408691
$$ 638633690 640648422 644739914 650168686 655846710 660586090 663382187 663553543 660654602 654245911
508F54245911j0498276j5139694j9788361k3263206k4036980k0864067j3465576k882271
$$ 654245911 643747635 628607941 608819580 585556374 561519394 540655327 527189751 524307480
516E24307480Q729324J8815270K5330276K7418251K5573883K1260300J6220016J1821900
$$ 524307480 533036804 551852074 577182350 604600601 630174484 651434784 667654800 679476700
524F79476700Q711777O840362N755234M947510M088516L092499K050171J113586M11835
$$ 679476700 688188477 695028839 700784073 705731583 709820099 712912598 714962769 716076355 716488190
533G16488190R079j01776O485K12860L74450L71933J57242k24457o51779r83581j126175
$$ 716488190 716497269 716395493 716401978 716614838 716989288 717361221 717518463 717294006 716642227 715658646 714532471
544G14532471j075287r14078p67975p44705q90808j183472j554718j929092k258454
$$ 714532471 713457184 712543106 711775131 711030426 710139618 708956146 707401428 705472336 703213882
553G03213882k538070k810440l152695l661118m419479n452423o675873p862015q648986
$$ 703213882 700675812 697865372 694712677 691051559 686632080 681179657 674503784 666641769 657992783
562F57992783q622284p448807n028343j590844K314377N956192Q640595R929046R763260
$$ 657992783 649370499 641921692 636893349 635302505 637616882 643573074 652213669 662142715 671905975
571F71905975Q448410O510163M496231K808533J626358R29718N79910M07333K72141
$$ 671905975 680354385 686864548 691360779 694169312 695795670 696725388 697305298 697712631 697984772
580F97984772Q6975j82495n20706q74939j173020j354751j403504j356430j298370
$$ 697984772 698071747 697889252 697368546 696493607 695320587 693965836 692562332 691205902 689907532
589F89907532j328430j531907j966247k653809l571243m622498n621185o305847o424789
$$ 689907532 688579102 687047195 685080948 682427139 678855896 674233398 668612213 662306366 655881577
598F55881577n863724m751053l455963k439919k014732k132683k350922k029266o79092
$$ 655881577 650017853 645266800 641810837 639370918 637356186 635223503 632872581 630843315 630164223
607F30164223J708832M562187O930999P917328P117997M841995J985702l74374j464691
$$ 630164223 631873055 636435242 643366241 651283569 658401566 663243561 665229263 664854889 663390198
616F63390198j127625J75858J640701K514801K396240J317597l78266k254562l945312
$$ 663390198 662262573 662438431 664079132 666593933 668990173 670307770 669929504 667674942 663729630
625F63729630n198975n832443n680237m621048k677155j10817K574501M773713O000900
$$ 663729630 658530655 652698212 647017975 642396927 639719772 639608955 642183456 646957169 652958069
634F52958069O079635N192261L760071K226791Q71888k50245j229934k156143l011704
$$ 652958069 659037704 664229965 667990036 670216827 671088715 670838470 669608536 667452393 664440689
643F64440689l678436m036713m081955l969879l957748m275437n011635o084709p307396
$$ 664440689 660762253 656725540 652643585 648673706 644715958 640440521 635428886 629344177 622036781
652F22036781q498916r562607j0478821j1222954j1670494j1567268j0606651q584824
$$ 622036781 613537865 603975258 593496437 582273483 570602989 559035721 548429070 539844246
660E39844246n550690j860847J909713N161095P475357Q725510R040947Q664245P795906
$$ 539844246 534293556 532432709 534342422 539503517 546978874 555704384 564745331 573409576 581205482
669E81205482O526833M891052K979241J016922o66466j776238k200698k073975j700554
$$ 581205482 587732315 592623367 595602608 596619530 595953064 594176826 591976128 589902153 588201599
678E88201599j393165j327515j507378j841202k263031k794952l520775m514122n802536
$$ 588201599 586808434 585480919 583973541 582132339 579869308 577074356 573553581 569039459 563236923
687E63236923p413139r444466j2059021j5333748j9022369k2408676k4419289k4033584
$$ 563236923 555823784 546379318 534320297 518986549 499964180 477555504 453136215 429102631
695D29102631k0809060j5209770q495826k163849K780533O301460R265785J2846146
$$ 429102631 408293571 393083801 384587975 382424126 385204659 391506119 400771904 413618050
703D13618050J7724266K3564300K9061508L2546845L2800369K9630547K3924331J7192994
$$ 413618050 431342316 454906616 483968124 516514969 549315338 578945885 602870216 620063210
711F20063210J0896835N924988K450370J45646j441117k599869l387908l745079l660622
$$ 620063210 630960045 636885033 639335403 639481049 638039932 635440063 632052155 628307076 624646454
720F24646454l261109k773399k415275k301522k419472k681465k992324l296929l581123
$$ 624646454 621385345 618611946 616196671 613895149 611475677 608794212 605801888 602504959 598923836
729E98923836l851700m119377m395294m696732n040550n422592n808182o147308o423417
$$ 598923836 595072136 590952759 586557465 581860733 576820183 571397591 565589409 559442101 553018684
738E53018684o703682p138328p889290r001884j0297966j1377716j1767388j1168518
$$ 553018684 546315002 539176674 531287384 522285500 511987534 500609818 488842430 477673912
746D77673912r679985p851982o503410o355935p659416j0004310j2439690j3853951
$$ 477673912 467993927 460141945 453638535 447282600 439623184 429618874 417179184 403325233
754D03325233j3442230j1031761p117729k613411J538544M689483O611595P407837
$$ 403325233 389883003 378851242 371733513 369120102 370658646 375348129 381959724 389367561
762C89367561P318077O551323N238648L489647J483612n00145k139855l184127l550454
$$ 389367561 396685638 403236961 408475609 411965256 413448868 412948723 410808868 407624741 404074287
771D04074287l348236k819099k228127j767463j507798j408424j363144j256752j003151
$$ 404074287 400726051 397906952 395678825 393911362 392403564 390995140 389631996 388375244 387372093
780C87372093n64995N0850Q08907J665382K584076L543625M528236N512886O447602
$$ 387372093 386807098 386857948 387666855 389332237 391916313 395459938 399988174 405501060 411948662
789D11948662P253494P837410Q116608Q050918P661324P034798O308708N637283N151825
$$ 411948662 419202156 427039566 435156174 443207092 450868416 457903214 464211922 469849205 475001030
798D75001030M925079M955254N177116N499153N847817O197014O562462O962661P372589
$$ 475001030 479926109 484881363 490058479 495557632 501405449 507602463 514164925 521127586 528500175
807E28500175P699738P805786P568703O946144O004639M888458L741722K633629J525268
$$ 528500175 536199913 544005699 551574402 558520546 564525185 569413643 573155365 575788994 577314262
816E77314262L10173j094055k652359m164848n299111n686988n047150l285141n36270
$$ 577314262 577624435 576530380 573878021 569713173 564414062 558727074 553679924 550394783 549858513
825E49858513K854767O403465R583626J1927871J3119469J3057404J1878509R927407
$$ 549858513 552713280 559116745 568700371 580628242 593747711 606805115 618683624 628611031
833F28611031P670822N569114L953019K938156K422256K156830J872482J398621P32803
$$ 628611031 636281853 641850967 645803986 648742142 651164398 653321228 655193710 656592331 657325134
842F57325134K9068m75692n71366j58920P09534J851730L018036L968658M538269M668579
$$ 657325134 657354202 656878510 656307144 656148224 656857758 658709488 661727524 665696182 670234451 674903030
852F74903030M407196L875657L222885K576980K013779J550217J157989P93533M23661
$$ 674903030 679310226 683185883 686408768 688985748 690999527 692549744 693707733 694501266 694924927
861F94924927L6468l60641p56836j146622j531296j915969k301331k690048l093567
$$ 694924927 694961395 694600754 693843918 692697296 691166000 689250031 686948700 684258652 681165085
870F81165085l535538m038849m592514n113754n431976n309601m515686k922211n87921
$$ 681165085 677629547 673590698 668998184 663884430 658452454 653142853 648627167 645704956 645117035
879F45117035K211838N033569P385941Q872146R310227Q776245P562027O060486M635314
$$ 645117035 647328873 652362442 659748383 668620529 677930756 686707001 694269028 700329514 704964828
888G04964828L514863K754364K264633J886825J478653R75266M09317j14060m70504
$$ 704964828 708479691 711234055 713498688 715385513 716864166 717839432 718248749 718134689 717664185
897G17664185n76020m30450j26572J78681L22494J97601k04467p90253j401444j874084
$$ 717664185 717088165 716657715 716531143 716709824 717032318 717229919 717025452 716235199 714833755 712959671
907G12959671k097626k047577j788101j443710j157990j046295j156387j442490j764984
$$ 712959671 710862045 708814468 707026367 705582657 704424667 703378372 702221985 700779495 699014511
916F99014511j927872j747131j134415j58462R55505J896820K390442K316590J761856
$$ 699014511 697086639 695339508 694205093 694046631 695002136 696898956 699289398 701605988 703367844
925G03367844R80529K78244j25351j86538l6926R4909R537l71552r70916j602860k063064
$$ 703367844 704348373 704626617 704501266 704314728 704277802 704372711 704382248 704010696 703039780 701436920 699373856
936F99373856k223740k086487j777954j491470j404877j611252k082443k688751l252945
$$ 699373856 697150116 695063629 693285675 691794205 690389328 688778076 686695633 684006882 680753937
945F80753937l621521l723221l587341l321839l057632k884369k804031k718125k460937
$$ 680753937 677132416 673409195 669821854 666500015 663442383 660558014 657753983 655035858 652574921
954F52574921j866303q49914N29327K053299L396072M228745M347229L763122K714920
$$ 652574921 650708618 649858704 650388031 652441330 655837402 660066147 664413376 668176498 670891418
963F70891418J586991P61032M69971P12967J276016J838836K116013J966095J425095
$$ 670891418 672478409 673239441 673709412 674422379 675698395 677537231 679653244 681619339 683044434
972F83044434O61163j14517p30667j108780j266327j295090j323776j478577j840744
$$ 683044434 683705597 683591080 682860413 681751633 680485306 679190216 677866440 676387863 674547119
981F74547119k408295l073196l637924l876801l628769k882843j805191o89773J54953
$$ 674547119 672138824 669065628 665427704 661550903 657922134 655039291 653234100 652544327 652699280
990F52699280N23758L79791j63269r24454j748428k551727l302765l965073m452515
$$ 652699280 653223038 653602829 653439560 652515106 650766678 648214951 644912186 640947113 636494598
999F36494598m639434m427453l820686k958526k076531j411323j104546j154938j445083
$$ 636494598 631855164 627427711 623607025 620648499 618571968 617160645 616056099 614901161 613456078
1008F13456078j818085k155876k422409k656937k931137l308449l816070m441643n140763
$$ 613456078 611637993 609482117 607059708 604402771 601471634 598163185 594347115 589905472 584764709
1017E84764709n851516o509743p066803p497292p791366p917671p776261p172355n851212
$$ 584764709 578913193 572403450 565336647 557839355 550047989 542130318 534354057 527181702 521330490
1026E21330490l602524m03442L475304P469024J0853195J2969399J3451271J2343864
$$ 521330490 517727966 517324524 520799828 528268852 539122047 552091446 565542717 577886581
1034E77886581J0069962P260056M531898K315178P80411j24054n76401p79228q97560
$$ 577886581 587956543 595216599 599748497 602063675 602844086 602720032 602143631 601364403 600466843
1043F00466843j036454j243476j518250j822891k098541k289429k375031k389259k413559
$$ 600466843 599430389 598186913 596668663 594845772 592747231 590457802 588082771 585693512 583279953
1052E83279953k544136k847099l323555l907204m491768m978905n321540n542603n725441
$$ 583279953 580735817 577888718 574565163 570657959 566166191 561187286 555865746 550323143 544597702
1061E44597702n978279o391983p004280p790261q674011r567184j0406342j1180916
$$ 544597702 538619423 532227440 525223160 517432899 508758888 499191704 488785362 477604446
1069D77604446j1934051j2737007j3650856j4696007j5839348j7008781j8114281j9068985
$$ 477604446 465670395 452933388 439282532 424586525 408747177 391738396 373624115 354555130
1077C54555130j9795456k0222893k0286750j9935914j9149723j7950153j6398468j4575634
$$ 354555130 334759674 314536781 294250031 274314117 255164394 237214241 220815773 206240139
1085B06240139j2555695j0392665q129445n821228l558445j463337L42122J791706
$$ 206240139 193684444 183291779 175162334 169341106 165782661 164319324 164661446 166453152
1093A66453152K920894L889122M952393O400928Q470059J1251144J4630223J8271617
$$ 166453152 169374046 173263168 178215561 184616489 193086548 204337692 218967915 237239532
1101B37239532K1667595K4254418K5566902K5394363K3874398K1480560J8890228J6769066
$$ 237239532 258907127 283161545 308728447 334122810 357997208 379477768 398367996 415137062
1109D15137062J5542259J5246201J5517959J5738755J5279846J3756370J1194077Q036385
$$ 415137062 430679321 445925522 461443481 477182236 492462082 506218452 517412529 525448914
1117E25448914M994278K797622J945000K550201M333611O744804R157753J1052704
$$ 525448914 530443192 533240814 535185814 537736015 542069626 548814430 557972183 569024887
1125E69024887J2125282J2305870J1704598J0527496Q993683P280045N493621L676720
$$ 569024887 581150169 593456039 605160637 615688133 624681816 631961861 637455482 641132202
1133F41132202J834183k3270j839142l500137m857902n784989o224251o205101n815353
$$ 641132202 642966385 642943115 641103973 637603836 632745934 626960945 620736694 614531593 608716240
1142F08716240n140724m224816l073082j707191k24915J179009K262688K833709K836304
$$ 608716240 603575516 599350700 596277618 594570427 594345512 595524521 597787209 600620918 603457222
1151F03457222K378273J675339R48486L33023j53236n76172j015778j509018k037162
$$ 603457222 605835495 607510834 608459320 608792343 608639107 608062935 607047157 605538139 603500977
1160F03500977k548752l001175l385544l725204m049111m358597m607010m706153m571152
$$ 603500977 600952225 597951050 594565506 590840302 586791191 582432594 577825584 573119431 568548279
1169E68548279m188843l683662l327485l461227m327469n883179p700195r044990r149247
$$ 568548279 564359436 560675774 557348289 553887062 549559593 543676414 535976219 526931229 517781982
1178E17781982p565536m431076m85726L195649N637970O355667N501594L717537J782303
$$ 517781982 510216446 505785370 505299644 508495293 514133263 520488930 525990524 529708061 531490364
1187E31490364K60582o78177j207657j640396k218780l014603l963509m966774n973281
$$ 531490364 531750946 531072769 529865112 528224716 526005936 522991333 519027824 514061050 508087769
1196E08087769o987420q024711r066658j0059509j0958329j1773224j2581482j3488807
$$ 508087769 501100349 493075638 484008980 473949471 462991142 451217918 438636436 425147629
1204D25147629j4573517j5847588j7259521j8729820k0181923k1550579k2759419k3694038
$$ 425147629 410574112 394726524 377467003 358737183 338555260 317004681 294245262 270551224
1212B70551224k4195957k4086876k3215771k1505222j8980894j5777159j2120447q294773
$$ 270551224 246355267 222268391 199052620 177547398 158566504 142789345 130668898 122374125
1220A22374125m594889j269627J531115L783846N587253P117014Q560953J0063601
$$ 122374125 117779236 116509609 118040724 121824570 127411823 134528837 143089790 153153391
1228A53153391J1696100J3458233J5299454J7141704J8889962K0436172K1664009K2461605
$$ 153153391 164849491 178307724 193607178 210748882 229638844 250075016 271739025 294200630
1236B94200630K2746735K2490997K1740456K0617561J9304466J8005257J6892433J6056137
$$ 294200630 316947365 339438362 361178818 381796379 401100845 419106102 435998535 452054672
1244D52054672J5474930J5027924J4551353J3912544J3066559J2059517J0977631R877777
$$ 452054672 467529602 482557526 497108879 511021423 524087982 536147499 547125130 557002907
1252E57002907Q744125P502403O077042M443054K626496O50062j529999m029083o949577
$$ 557002907 565747032 573249435 579326477 583769531 586396027 587046089 585516090 581487007 574537430
1261E74537430j0243225j3613282j6536064j8427581j8865624j7754669j5332375j2028274
$$ 574537430 564294205 550680923 534144859 515717278 496851654 479096985 463764610 451736336
1269D51736336q272248m375953n58701K932778N718574P309456P270279N435905K039223
$$ 451736336 443464088 439088135 438529434 441462212 447180786 454490242 461760521 467196426 469235649
1278D69235649k339935o979523j1262207j4821396j7525139j9335060k0159950j9805336
$$ 469235649 466895714 459916191 448653984 433832588 416307449 396972389 376812439 357007103
1286C57007103j8055153j4822388j0271873m841881Q44650O124192J0429725J3379441
$$ 357007103 338951950 324129562 313857689 309015808 309860458 315984650 326414375 339793816
1294C39793816J4816589J4818115J3674126J1831398R784965P933159O442757N188446
$$ 339793816 354610405 369428520 383102646 394934044 404719009 412652168 419094925 424283371
1302D24283371L806839J855202r81522m719620r000663j3135529j6250267j7492752
$$ 424283371 428090210 429945412 428963890 424244270 415243607 402108078 385857811 368365059
1310C68365059j6247521j2314033o003380J885758J0214119J7751464K3454247K6691513
$$ 368365059 352117538 339803505 333800125 335685883 345900002 363651466 387105713 413797226
1318D13797226K7346764K5780181K2676545J8846779J5039901J1806908R429397P909852
$$ 413797226 441143990 466924171 489600716 508447495 523487396 535294304 544723701 552633553
1326E52633553P021026O399613N659675M493523K724075L07007k690620o090775r562683
$$ 552633553 559654579 566054192 571713867 576207390 578931465 579238472 576547852 570457077 560894394
1335E60894394j2573242j4401055j4280204j1668358o537323M66308Q112107J4931564
$$ 560894394 548321152 533920097 519639893 507971535 501434212 501900520 510012627 524944191
1343E24944191J9685593K1745109K1219902J8793526J5376549J1757087Q405686N476684
$$ 524944191 544629784 566374893 587594795 606388321 621764870 633521957 641927643 647404327
1351F47404327K939988P25479j212998k922134m511109o180191q171997j0657501j3610649
$$ 647404327 650344315 651069794 649856796 646934662 642423553 636243362 628071365 617413864 603803215
1360F03803215j6726456j9432068k1000938k0753975j8295517j3705597p609787j069984
$$ 603803215 587076759 567644691 546643753 525889778 507594261 493888664 486278877 485208893
1368D85208893M686622Q618851J0165596R373474O805725L293572l53546l555336o021424
$$ 485208893 489895515 498514366 508679962 518053436 524859161 528152733 527799187 524243851 518222427
1377E18222427p686500q594017q805618q377648p385826n959930m285050k567139r79461
$$ 518222427 510535927 501941910 493136292 484758644 477372818 471412888 467127838 464560699 463581238
1386D63581238L78227J487656K389450L141937L784218M316673M698372M863930M744529
$$ 463581238 463959465 465447121 467836571 470978508 474762726 479079399 483777771 488641701 493386230
1395D93386230M291611L493653K383956J042557m15077j853409l144913m198913m986992
$$ 493386230 497677841 501171494 503555450 504598007 504182930 502329521 499184608 494985695 489998703
1404D89998703n550232n979881o379090o815109p294540p764969q148651q381157q434181
$$ 489998703 484448471 478468590 472089500 465274391 457979851 450214882 442066231 433685074 425250893
1413D25250893q306961p997246p473374o669502n515785l984146k127495q7242J936493
$$ 425250893 416943932 408946686 401473312 394803810 389288025 385303879 383176384 383089142 385025635
1422C85025635L742523N187073O218376O873321P237740P391281P364502P131844O644554
$$ 385025635 388768158 393955231 400173607 407046928 414284668 421675949 429040451 436172295 442816849
1431D42816849N885582M910011L842239K826386J957321J236420N81512j13220r09386
$$ 442816849 448702431 453612442 457454681 460281067 462238388 463474808 464056320 463943100 463033714
1440D63033714j795845k714386l623123m536819n512390o582642p683868q642159r234924
$$ 463033714 461237869 458523483 454900360 450363541 444851151 438268509 430584641 421942482 412707558
1449D12707558r299393q819046p931786o855659n784378m819145l974800l241539k640343
$$ 412707558 403408165 394589119 386657333 379801674 374017296 369198151 365223351 361981812 359341469
1458C59341469k225876k026062j974335j890602j545067p77397M04778J809768L147889
$$ 359341469 357115593 355089531 353115196 351224594 349679527 348902130 349306908 351116676 354264565
1467C54264565M171333M786377N076256N223388N384178N595093N761986N732079N401878
$$ 354264565 358435898 363222275 368298531 373521919 378906097 384501190 390263176 395995255 401397133
1476D01397133M787331M020843L283958K721329K395477K296715K390366K655640L082885
$$ 401397133 406184464 410205307 413489265 416210594 418606071 420902786 423293152 425948792 429031677
1485D29031677L635254M218598M695854M959373N021019N057564N371056O270446P924462
$$ 429031677 432666931 436885529 441581383 446540756 451561775 456619339 461990395 468260841 476185303
1494D76185303J0265465J2976417J5566750J7495727J8304787J7731209J5790329J2809486
$$ 476185303 486450768 499427185 514993935 532489662 550794449 568525658 584315987 597125473
1502E97125473R385681O248131M040222L099022L328972M248733N202904N640450N322838
$$ 597125473 606511154 612759285 616799507 619898529 623227501 627476234 632679138 638319588 643642426
1511F43642426M364929L106918J913757J013337M52652J59225L4637J8235R1781K48642
$$ 643642426 648007355 651114273 653028030 654041367 654494019 654653244 654687881 654706116 654797897 655046539
1521F55046539M75922P52716J059418J371155J638107J782608J725159J447219J027298
$$ 655046539 655522461 656275177 657334595 658705750 660343857 662126465 663851624 665298843 666326141
1530F66326141O18897L59649K66114K00729n5008o46210j514053k379989k872162k725373
$$ 666326141 666945038 667304687 667570801 667771530 667716522 667070312 665556259 663176270 660304108 657578735
1540F57578735j934204p66296L69339J119003J337357J119156P12738L77349K57187
$$ 657578735 655644531 654878235 655247574 656366577 657703934 658823090 659535828 659913177 660170364
1549F60170364L28751M21448L01208k21023j185303k421722l568955m188156l943024
$$ 660170364 660499115 660920563 661221771 661000748 659815445 657393723 653824768 649636612 645693588
1558F45693588k779007j002273Q03375K002411K184448J352844p4768j468353k284317
$$ 645693588 642914581 641912308 642715683 644718094 646902542 648255386 648180618 646712265 644427948
1567F44427948k319183j782837j157685r25560j305351k153549l069992l649635l726044
$$ 644427948 642108765 640325928 639168243 638242683 636937332 634783783 631713791 628064156 624338112
1576F24338112l460426l216820l308144l763923m283600m411278l830490k593956j139641
$$ 624338112 620877686 617660866 614352722 610588799 606305199 601893921 598063431 595469475 594329834
1585E94329834p2403J50070n62019j937180l552055n086899o454697p719345q883056
$$ 594329834 594257431 594407501 593845482 591908302 588356247 583269348 576814651 569095306 560212250
1594E60212250r715500r769096q599968o067505k521630J245919M282379N841789N661011
$$ 560212250 550496750 540727654 532127686 526060181 523538551 524784470 529066849 534908638 540569649
1603E40569649M023323J596756q54836k753143l873291m347420m530792m802551n381127
$$ 540569649 544592972 546189728 545334892 542581749 538708458 534361038 529830246 525027695 519646568
1612E19646568o243324p162285p848129q113480p974930p639160p386093p425270p802544
$$ 519646568 513403244 506240959 498392830 490279350 482304420 474665260 467279167 459853897 452051353
1621D52051353q412094r082107r676590j0146675j0519524j0856171j1220359j1678849
$$ 452051353 443639259 434557152 424880562 414733887 404214363 393358192 382137833 370458984
1629C70458984j2309761j3181572j4297485j5539017j6662426j7377891j7476712j6936302
$$ 370458984 358149223 344967651 330670166 315131149 298468723 281090832 263614120 246677818
1637B46677818j5929603j4730759j3572864j2544709j1580753j0536137r278068p731228
$$ 246677818 230748215 216017456 202444592 189899883 178319130 167782993 158504925 150773697
1645A50773697n855055l590918q37345K507468O459159J0867091J5397186J9593048
$$ 150773697 144918642 141327724 140490379 142997847 149457006 160324097 175721283 195314331
1653A95314331K2987900K5224075K6130181K5751018K4317246K2174434J9682732J7114410
$$ 195314331 218302231 243526306 269656487 295407505 319724751 341899185 361581917 378696327
1661C78696327J4591370J2093391R541245O915741M335212K038346K68745q69179j485176
$$ 378696327 393287697 405381088 414922333 421838074 426173286 428211632 428480377 427611198 426126022
1670D26126022j853599k260704k846909l551216m195290m651756m974632n398369o198959
$$ 426126022 424272423 422011719 419164810 415613594 411418304 406766548 401791916 396393547 390194588
1679C90194588p505760r196511j0944519j2395096j3359756j3906632j4305572j4863911
$$ 390194588 382688828 373492317 362547798 350152702 336792946 322886314 308580742 293716831
1687B93716831j5767422j7003002j8392410j9680614k0612946k0966053k0548344j9216652
$$ 293716831 277949409 260946407 242553997 222873383 202260437 181294384 160746040 141529388
1695A41529388j6932706j3836108j0269174o708479l605309j207771N41668J970329
$$ 141529388 124596682 110760574 100491400 93782921 90177612 88969841 89511509 91481838
1703I1481838L506813N468436P898006J0525131J2859402J4357653J4589672J3349113
$$ 91481838 94988651 100457087 108355093 118880224 131739626 146097279 160686951 174036064
1711A74036064J0683632O866665K334652k391567o782894j0380784j2858944j4056730
$$ 174036064 184719696 191586361 193921013 191529446 184746552 174365768 161506824 147450094
1719A47450094j3978319j2751579j0576859p680130m288349o22663L105030O706857
$$ 147450094 133471775 120720196 110143337 102463207 98174858 97552195 100657225 107364082
1727A07364082J0040636J3027249J5641851J7879505J9712086K1064625K1834392K1948719
$$ 107364082 117404718 130431967 146073818 163953323 183665409 204730034 226564426 248513145
1735B48513145K1425782K0406513J9126072J7835884J6714935J5813866J5060425J4321365
$$ 248513145 269938927 290345440 309471512 327307396 344022331 359836197 374896622 389217987
1743C89217987J3483315J2515182J1483345J0518799R756546R279823R088784R105491
$$ 389217987 402701302 415216484 426699829 437218628 446975174 456254997 465343781 474449272
1751D74449272R205856R267083R206390R000931Q682937Q312569P950058P636032P389641
$$ 474449272 483655128 492922211 502128601 511129532 519812469 528125038 536075096 543711128 551100769
1760E51100769P213783P101250P025795O933136O742172O374932N804557N095787M403572
$$ 551100769 558314552 565415802 572441597 579374733 586116905 592491837 598296394 603392181 607795753
1769F07795753L918877L778572L992615M430084M876213N129433N085335M759750M256973
$$ 607795753 611714630 615493202 619485817 623915901 628792114 633921547 639006882 643766632 648023605
1778F48023605L706437L216323K859803K679748K691116K858963L081208L200073L064728
$$ 648023605 651730042 654946365 657806168 660485916 663177032 666035995 669117203 672317276 675382004
1787F75382004K619018J962204J327973R80758J076508J567612K214203K698669K782745
$$ 675382004 678001022 679963226 681291199 682271957 683348465 684916077 687130280 689828949 692611694
1796F92611694K420426J771469J111526O97937O58875R57336J431580J883316K161484
$$ 692611694 695032120 696803589 697915115 698613052 699271927 700229263 701660843 703544159 705705643
1805G05705643K211914K073745J844941J626892J489944J455841J511231J628036J778717
$$ 705705643 707917557 709991302 711836243 713463135 714953079 716408920 717920151 719548187 721326904
1814G21326904J936264K064133K114258K041015J830979J528854J227570J027527R80377
$$ 721326904 723263168 725327301 727441559 729482574 731313553 732842407 734069977 735097504 736077881
1823G36077881J057205J165772J211776J160126J058350R99984J056824J230393J454391
$$ 736077881 737135086 738300858 739512634 740672760 741731110 742731094 743787918 745018311 746472702
1832G46472702J646881J763992J814423J823120J777497J611633J252975P02744Q8730
$$ 746472702 748119583 749883575 751697998 753521118 755298615 756910248 758163223 758865967 758954697
1841G58954697l62473m36935o0654O36444J369553J840133J884308J548157J043472
$$ 758954697 758592224 758155289 758094635 758731079 760100632 761940765 763825073 765373230 766416702
1850G66416702O23627M50058N26352P24792Q79212Q78982P22580N00260L31878K96708
$$ 766416702 767040329 767490387 768016739 768741531 769620743 770499725 771222305 771722565 772054443 772351151
1860G72351151L87573N16281N59845M26788J14670k80762o03866p15409n65567k22854
$$ 772351151 772738724 773255005 773814850 774241638 774356308 774075546 773471680 772756271 772190704 771967850
1870G71967850J57928M10385M33960K32239j05972m61045p36312q84552q99125p95364
$$ 771967850 772125778 772536163 772970123 773202362 773096390 772635345 771899033 771014481 770115356 769319992
1880G69319992o01654l62625j45950k7619n5847k18887m34876n88379n88836m19999
$$ 769319992 768718338 768355713 768209763 768182144 768126297 767907410 767472534 766884155 766295319 765875320
1890G65875320j45645J29929L18375L87954L62625K91291K12631J43509Q5373M4021
$$ 765875320 765729675 765859604 766177979 766565933 766928558 767219849 767432480 767575989 767661362 767705383
1900G67705383L0365M8447Q0795R2087N4474k1973q1939n1957J09635L73840O44379
$$ 767705383 767735748 767784195 767864990 767957077 768011551 767989578 767907639 767855682 767965317 768339157 768983536
1911G68983536Q05130P85827O03943L56293J64185J07879J87226L32031M49295M76074
$$ 768983536 769788666 770574493 771178436 771534729 771698914 771806793 771994019 772326050 772775345 773251419
1921G73251419M09393K96631K00806J62811J82343K22168K33154J79443N6458j08032
$$ 773251419 773660812 773957443 774158249 774321060 774503403 774725571 774958725 775138168 775194626 775086594
1931G75086594k64969l65448l81470l18756k17743j37558j29929k14996l69720n38025
$$ 775086594 774821625 774456177 774074707 773755951 773538208 773400650 773270721 773055725 772686005 772147980
1941G72147980o56815o86722o32629n39017m68216m70123n57556p01294q44803r25522
$$ 772147980 771491165 770804443 770171814 769632797 769164581 768694458 768136902 767435608 766590805 765665283
1951G65665283q99505p51038m92554j58539K05689N48630Q19702R75036R90601Q71353
$$ 765665283 764765778 764014740 763522186 763363647 763569336 764117966 764937668 765912704 766903305 767774658
1961G67774658O58493M20075K30636J41526J58462K38953L07617K94876J70441l6774
$$ 767774658 768433151 768853226 769083862 769225388 769383850 769622803 769930420 770225296 770395737 770358963
1971G70358963k47421l65677l21961j05667K26670N74188Q30841R28574Q60977O82296
$$ 770358963 770111542 769745865 769423904 769318237 769544907 770119095 770949936 771878510 772739487 773421783
1981G73421783M79889L36228K95868L50494M48990N24368N25360M40598L00140J61591
$$ 773421783 773901672 774237900 774533768 774884262 775333252 775857620 776382980 776823578 777123718 777285309
1991G77285309Q2702R7428K02179L58200N08118N95321N84870M73022K86331P4997
$$ 777285309 777368011 777465439 777667618 778025818 778533936 779129257 779714127 780187149 780473480 780548477
2001G80548477j05209k08893k15530j37024j6022R1248J31988P7896o3095k49710m22211
$$ 780548477 780443268 780234375 780018845 779881821 779865799 779957047 780089035 780166931 780103836 779854126 779431915
2012G79431915n24673n25818m30145k75650j19629j5335O027n1727j53046k45056k80152
$$ 779431915 778907242 778381424 777951279 777675629 777556000 777540665 777546692 777494965 777341919 777096863 776816711
2023G76816711k35519j23444J5717J29700J77917J48239O0807m2191j16577j34506
$$ 776816711 776581192 776457748 776473465 776603165 776781082 776929321 776990128 776947937 776831360 776696854
2033G76696854r4452k0447N1346Q8959P6217J8845o1035j32904j73493j71738j34353
$$ 776696854 776602402 776581955 776633301 776722260 776798477 776817322 776756287 776623383 776449890 776278152 776143799
2044G76143799p9422l0441o104j5564n7602j22223j95846k64664l16772l45231l47442
$$ 776143799 776064377 776033936 776027832 776012268 775954666 775832443 775636597 775371933 775055161 774709930 774362488
2055G74362488l29590l03497k84729k87857l18146l70712m29612m75616m92096m73251
$$ 774362488 774032898 773729401 773444672 773156815 772838669 772467957 772038345 771562729 771070633 770597382
2065G70597382m22745l52020k75727k07214j56479j29776j27716j44272j65558j73340
$$ 770597382 770174637 769822617 769546890 769339676 769183197 769053421 768925705 768781433 768615875 768442535
2075G68442535j49841q6288J0528J18866K08054K50168K31094J57623N6076l7079q8272
$$ 768442535 768292694 768206406 768216934 768335800 768543854 768794022 769025116 769182739 769238815 769201736 769113464
2086G69113464q0261j7624P1564J49536J79443J42823M7607p4768j79138k25067j95313
$$ 769113464 769033203 769015579 769087143 769236679 769416122 769558945 769606552 769531784 769352646 769127579 768932266
2097G68932266j01623J7395J12686J43890R6360j2589j41067k38114k64206k07977
$$ 768932266 768830643 768848038 768960724 769104614 769200974 769188385 769047318 768809204 768544998 768337021
2107G68337021q9111M6310J44348J64490R5062m0054j89133k93121l08380k25602p4844
$$ 768337021 768247910 768294220 768438568 768603058 768698120 768658066 768468933 768175812 767867432 767641830 767566986
2118G67566986Q5754J92032K00348J05515n7068k24609l34473l47061k62451j20392
$$ 767566986 767652740 767844772 768045120 768150635 768093567 767868958 767534485 767187424 766924973 766804581
2128G66804581J8005R3689P4387l3646j86310l21503l81622l36914j97601r461J62583
$$ 766804581 766822586 766916275 766990662 766957016 766770706 766449203 766067581 765730667 765533066 765523605 765686188
2139G65686188K61307K57949J62888K2659j00860j54801j16730m119J34887K39792
$$ 765686188 765947495 766205444 766368332 766390991 766290131 766135330 766018600 766014481 766149368 766389160
2149G66389160K64282J92795M8905j17493k47727k98614k57950j48163j6937Q0948
$$ 766389160 766653442 766846237 766895142 766777649 766529922 766231308 765973358 765825195 765808258 765889206
2159G65889206J05972M5471p9345k25144l41797l91540l63388k76032j69296q7280
$$ 765889206 765995178 766040649 765961304 765736160 765394363 765002823 764639435 764363403 764194107 764106827
2169G64106827o1875j00097j82495k71912l29895l31268k75574j83640r1171l1891
$$ 764106827 764044952 763944855 763762360 763490448 763160553 762829285 762553711 762370071 762278900 762247009
2179G62247009k4185o4316j29165j85776k06452j78070j07574j7929O1874J07880J10321
$$ 762247009 762222824 762158508 762029343 761843567 761637115 761459045 761351471 761333542 761395416 761503296 761613617
2190G61613617P4844J9608l1967o2256o4011m4021j7548l204j3276n0201j05286j63040
$$ 761613617 761688461 761708069 761676102 761613846 761549835 761505814 761488266 761485062 761471786 761421585 761316299 761153259
2202G61153259k08740k34222k38572k28958k13470j98212j84936j72654j59988j47018
$$ 761153259 760944519 760710297 760471725 760242767 760029297 759831085 759646149 759473495 759313507 759166489
2212G59166489j36490j31989j36642j49765j68839j87988k02637k09655k09427k06833
$$ 759166489 759029999 758898010 758761368 758611603 758442764 758254776 758052139 757842484 757633057 757426224
2222G57426224k08969k22321k50320k89612l30429l59650l65829l44391k99149k44217
$$ 757426224 757217255 756994934 756744614 756455002 756124573 755764923 755399094 755054703 754755554 754511337
2232G54511337j96609j71204j74789k01416k35520k56195k46048j99661j25656m5624
$$ 754511337 754314728 754143524 753968735 753767319 753531799 753275604 753029556 752829895 752704239 752658615
2242G52658615J3733L2578O103n2719j16882j57319j54953j08566l7155K8076N5390
$$ 752658615 752672348 752704926 752711029 752658310 752541428 752384109 752229156 752120590 752083435 752111511 752166901
2253G52166901K6550n5313j64871k64512l19366l10669k47040j56936q1635n3024q3313
$$ 752166901 752193451 752138138 751973267 751708755 751389389 751078720 750831680 750674744 750593109 750540085 750456772
2264G50456772j58386k43912l01666l02430k38266j26342j221R5596J31912R7352Q468
$$ 750456772 750298386 750054474 749752808 749450378 749212112 749085770 749084549 749180145 749312057 749409409 749417877
2275G49417877r4223j62506j59454p9499M7837J66855K19802J71280K5864j76849l75748
$$ 749417877 749323654 749161148 749001694 748922195 748970032 749136887 749356689 749527969 749553833 749376984 749001236
2286G49001236n15976n67398n34821m52118l66897l23029l44467m27093n41230o43615
$$ 749001236 748485260 747917862 747383041 746930923 746564026 746240997 745896530 745469437 744928207 744284592
2296G44284592o93665o71463n86700m74015l80249l44772l87039n00641o59103q24967
$$ 744284592 743590927 742919464 742332764 741858749 741478500 741133728 740746689 740246048 739586945 738761978
2306G38761978r58557j026993j008453r00421p25174n29099l75366l24173m12292o36673
$$ 738761978 737803421 736776428 735767975 734867554 734142380 733613281 733237915 732913742 732501450 731864777
2316G31864777r50241j271286j509095j591797j496734j263809r89457p90557p53708
$$ 731864777 730914536 729643250 728134155 726542358 725045624 723781815 722792358 722001801 721248093
2325G21248093q90198j122131j319504j364441j220551r53903o94427n58091n80749
$$ 721248093 720357895 719235764 717916260 716551819 715331268 714377365 713682938 713124847 712544098
2334G12544098p09839q59146r86633j127549j350708j654434j887817j767807j019058
$$ 712544098 711834259 710975113 709988480 708860931 707510223 705855789 703967972 702200165 701181107
2343G01181107M33349K334290M134521N196076N076446L739548J572952p83844k722015
$$ 701181107 701614456 703948746 708083267 713279343 718355789 722095337 723668289 722884445 720162430
2352G20162430l890763m275207m106979l688050l238144k836685k460251k061844j627502
$$ 720162430 716271667 711996460 707889481 704201431 700963287 698126602 695666351 693604507 691977005
2361F91977005j180725p54318l59421J6708L88260P51114J077728J338730J526642
$$ 691977005 690796280 690041962 689682541 689699249 690087509 690838623 691916351 693255081 694781723
2370F94781723J662674J787720J934814K112122K302551K474289K599487K662812K659225
$$ 694781723 696444397 698232117 700166931 702279053 704581604 707055893 709655380 712318192 714977417
2379G14977417K590485K460022K275390K049027J796188J531067J262054R94339P35703
$$ 714977417 717567902 720027924 722303314 724352341 726148529 727679596 728941650 729935989 730671692
2388G30671692N01709L15170J95847J50528J64032K03781K31552K19040J57547N8975
$$ 730671692 731173401 731488571 731684418 731834946 731998978 732202759 732434311 732653351 732810898 732869873
2398G32869873n0125j41525j92871j96686j61515j08947o7139n8975r3918j61591k34298
$$ 732869873 732819748 732678223 732485352 732288666 732127151 732018204 731951065 731892090 731798172 731636581 731402283
2409G31402283k80075k73819k11945j13525j3657M9210N1346r156j07651k05688k63290
$$ 731402283 731122208 730848389 730636444 730522919 730509262 730558472 730609818 730600662 730493011 730287323 730024033
2420G30024033k58255j94245j00632k2201K518m3946j50680k81754l94287m54025m49295
$$ 730024033 729765778 729571533 729470901 729448700 729451218 729407272 729256592 728974838 728580551 728126526 727677231
2431G27677231l92761l13111k42538k05384k08435k42233k84118l06321k88162k21100
$$ 727677231 727284470 726971359 726728821 726523437 726315002 726072769 725788651 725482330 725194168 724973068
2441G24973068j15967J297R7428J45721J36109Q1253J0528m1656n1041j3428N4245
$$ 724973068 724857101 724858398 724955826 725101547 725237656 725318909 725329437 725287781 725236740 725223312 725277557
2452G25277557J20316J53274J33820O2714l8224j36413k00043k10190j68380r6131
$$ 725277557 725397873 725551147 725684967 725747681 725709457 725573044 725373001 725162811 724994431 724898300
2462G24898300k6245J0147m883o8435j59150k45056k97393l02811k66724k12326j68915
$$ 724898300 724872055 724882202 724877319 724808884 724649734 724404678 724107285 723804474 723537750 723325424 723156509
2473G23156509j58615j87530k43149l00827l35617l32871k93960k36054j81121j49842
$$ 723156509 722997894 722810364 722567215 722266388 721930771 721597900 721303940 721067886 720886765 720736923
2483G20736923j49765j77231k17590k53601k70920k64282k36054j97982j64337j47706
$$ 720736923 720587158 720409927 720192337 719938736 719667816 719403534 719167480 718969498 718805161 718657455
2493G18657455j54876j83335k22854k58637k78473k77938k60621k39105k25220k27355
$$ 718657455 718502579 718319244 718096390 717837753 717559280 717281342 717020721 716781616 716556396 716329041
2503G16329041k44599k69241k88849k93198k78625k50321k19040j96304j89819j99051
$$ 716329041 716084442 715815201 715526352 715233154 714954529 714704208 714485168 714288864 714099045 713899994
2513G13899994k15607k27661k25449k06222j75934j47018j31073j33896j51215j71432
$$ 713899994 713684387 713456726 713231277 713025055 712849121 712702103 712571030 712437134 712285919 712114487
2523G12114487j78986j64184j25809p2785k1667J1902J7929l052l9902p5225r1248
$$ 712114487 711935501 711771317 711645508 711572723 711551056 711562958 711580887 711577835 711537933 711462708 711371460
2534G11371460p8659l9520J1062N1499O2256L4484k3574r0409j38244j45951j09253
$$ 711371460 711292801 711253281 711264343 711315842 711378098 711412582 711389008 711298599 711160355 711014404 710905151
2545G10905151m1961K8381P2556P2479K7771m3183j14669j61591j71814j50757j15661
$$ 710905151 710863190 710891571 710964127 711036606 711064377 711021194 710906525 710744934 710573120 710422363 710306702
2556G10306702q9646r1095j26495j87988k58713l15628l41644l28522k82135k20185
$$ 710306702 710217056 710125961 709999466 709811478 709552765 709237137 708895493 708566971 708284836 708064651
2566G08064651j67465j46637j70288k33612l16315l88031m21600m03442l41339k61460
$$ 708064651 707897186 707750549 707580261 707346649 707030334 706642303 706220703 705817261 705475922 705214462
2576G05214462j98288j78833k11792k83432l63388m17328m22973l78113l01361k24075
$$ 705214462 705016174 704837341 704625549 704342117 703978729 703561401 703138428 702760315 702458954 702234879
2586G02234879j77689j79520k27966l03497l76587m21067m22134l83835l25393k73285
$$ 702234879 702057190 701877670 701649704 701346207 700969620 700548553 700126419 699742584 699417191 699143906
2596F99143906k51847k71911l28446m00390m60739m83704m58984l92151l05405k27661
$$ 699143906 698892059 698620148 698291702 697891312 697430573 696946869 696487885 696095734 695790329 695562668
2606F95562668j84174j85089k23236k76642l17917l26385k96555k39334j78070j36795
$$ 695562668 695378494 695193405 694970169 694693527 694375610 694049225 693752670 693513336 693335266 693198471
2616F93198471j32523j65863k22854k80686l15475l13644k74201k11105j46408j01548
$$ 693198471 693065948 692900085 692677231 692396545 692081070 691767426 691493225 691282120 691135712 691034164
2626F91034164r1018j15204j62583k13546k47422k51922k25678j79138j31607j00250
$$ 691034164 690943146 690827942 690665359 690451813 690204391 689952469 689726791 689547653 689416046 689315796
2636F89315796r7351j21994j61743j96610k08893j89132j42746q6136m0665k2659l6164
$$ 689315796 689218445 689096451 688934708 688738098 688529205 688340073 688197327 688111191 688070526 688047867 688011703
2647F88011703p0877j08184j29395j25275r9105o3782l6240k8381m2191p1029j02234
$$ 688011703 687940826 687832642 687703247 687577972 687478867 687415085 687378845 687350464 687308273 687237244 687135010
2658F87135010j24359j30539j21918j05133r0180q5449r5443j18561j48621j76468
$$ 687135010 687010651 686880112 686758194 686653061 686562881 686477432 686381989 686263428 686114807 685938339
2668F85938339j95160k01263j97983j91955j90583j98135k13776k31094k42615k43835
$$ 685938339 685743179 685541916 685343933 685151978 684961395 684763260 684549484 684318390 684075775 683831940
2678F83831940k34375k21253k12784k16598k34833k63061k92740l14102l21885l16848
$$ 683831940 683597565 683376312 683163528 682946930 682712097 682449036 682156296 681842194 681520309 681203461
2688F81203461l06244l00141l06243l26920l57132l86963m05655m07562l93677l72238
$$ 681203461 680897217 680597076 680290833 679963913 679606781 679219818 678814163 678406601 678012924 677640686
2698F77640686l54843l51029l65982l97262m37241m75616n03540n16281n13611n02014
$$ 677640686 677285843 676934814 676568832 676171570 675734329 675258713 674755173 674238892 673725281 673223267
2708F73223267m89655m86755m99497n29098n68619o06690o31561o35452o20575n97382
$$ 673223267 672733612 672246857 671747360 671218262 670649643 670042953 669411392 668775940 668155365 667557983
2718F67557983n80978n82962o07834o48193o89392p15332p14951o86493o38656n86243
$$ 667557983 666977005 666394043 665786209 665138016 664448624 663733292 663018341 662331848 661693192 661106949
2728F61106949n46341n30853n45197n84259o34155o77185o96488o83517o40488n80597
$$ 661106949 660560608 660029755 659484558 658900299 658266144 657588959 656892471 656208954 655568466 654987869
2738F54987869n23834m84924m71192m76684m86985m86907m68216m33503l95813l72009
$$ 654987869 654464035 653979111 653507919 653031235 652544250 652057343 651589127 651155624 650759811 650387802
2748F50387802l74069m05350m57840n16586n65033n92575n97229n85327n69916n63965
$$ 650387802 650013733 649608383 649150543 648633957 648068924 647476349 646879120 646293793 645723877 645159912
2758F45159912n75104o04324o43997o81076p03202p03735o83136o50902o20613o04858
$$ 645159912 644584808 643980484 643336487 642655411 641952209 641248474 640565338 639914436 639293823 638688965
2768F38688965o12183o42509o89087p41310p87354q20274q37822q42896q41102q37708
$$ 638688965 638076782 637434273 636745186 636003876 635216522 634396248 633558426 632715530 631874428 631036720
2778F31036720q35495q31680q20961p96127p52755o91223o19201n47867m90494m55284
$$ 631036720 630201225 629369545 628548584 627752457 626999702 626308479 625689278 625141411 624650917 624195633
2788F24195633m43726m49562m62761m73671m78668m79851m83818m97551n22956n56984
$$ 624195633 623751907 623302345 622839584 622365913 621887245 621407394 620923576 620426025 619903069 619346085
2798F19346085n92385o19888o34308o33354o20270o00471n79567n62859n51491n44891
$$ 619346085 618753700 618133812 617499504 616866150 616245880 615645409 615065842 614502983 613951492 613406601
2808F13406601n37911n24597n00259m63562m18129l71475l32566l06587k95181k94647
$$ 613406601 612868690 612344093 611843834 611380272 610962143 610590668 610258102 609951515 609656334 609361687
2818F09361687l00370l08456l18832l34015l57361l91731m36860m89768n46189o00014
$$ 609361687 609061317 608752861 608434029 608100014 607742653 607350922 606914062 606424294 605878105 605278091
2828F05278091o46019o80007p01561p13006p21359p33642p55349p86857q23136q56781
$$ 605278091 604632072 603952065 603250504 602537498 601816139 601082497 600327148 599540291 598717155 597860374
2838E97860374q81500q96835r07631r22699r51424r97047j057968j127472j197281
$$ 597860374 596978874 596082039 595174408 594251709 593300285 592303238 591245270 590117798 588920517
2847E88920517j260071j313095j356125j392937j426467j460724j497689j538086j580543
$$ 588920517 587660446 586347351 584991226 583598289 582171822 580711098 579213409 577675323 576094780
2856E76094780j623764j665878j705933j746674j791915j847725j918106k001038k089386
$$ 576094780 574471016 572805138 571099205 569352531 567560616 565712891 563794785 561793747 559704361
2865E59704361k167892k220383k232704k199211k125321k024727j917648j821709j749534
$$ 559704361 557536469 555316086 553083382 550884171 548758850 546734123 544816475 542994766 541245232
2874E41245232j707344j694947j709861j750451j815376j904106k015152k144547k286605
$$ 541245232 539537888 537842941 536133080 534382629 532567253 530663147 528647995 526503448 524216843
2883E24216843k433129k577018k711029k830430k932853l018723l091469l157386l222771
$$ 524216843 521783714 519206696 516495667 513665237 510732384 507713661 504622192 501464806 498242035
2892D98242035l293228l369751l445702l507271l535537l511200l420067l260307l042450
$$ 498242035 494948807 491579056 488133354 484626083 481090546 477579346 474159279 470898972 467856522
2901D67856522k789078k526665k278213k056542j862144j688195j525878j372300j234359
$$ 467856522 465067444 462540779 460262566 458206024 456343880 454655685 453129807 451757507 450523148
2910D50523148j124382j057015j040764j074791j150016j251526j364670j478386j585541
$$ 450523148 449398766 448341751 447300987 446226196 445076180 443824654 442459984 440981598 439396057
2919D39396057j682434j766281j832848j876487j890374j867599j803131j695137j546059
$$ 439396057 437713623 435947342 434114494 432238007 430347633 428480034 426676903 424981766 423435707
2928D23435707j364517j163330r59206p67288n96542m48265l14217j82190m1580J09253
$$ 423435707 422071190 420907860 419948654 419181366 418584824 418136559 417822342 417640152 417598572 417707825
2938D17707825K61116L94783M88167N23834M95453M10003K83928J37596j0757j49269
$$ 417707825 417968941 418363724 418851891 419375725 419871178 420281181 420565109 420702705 420691948 420542679
2948D20542679k71912l77502m65584n35545n84870o10809o10428n83076n30358m59404
$$ 420542679 420270767 419893265 419427681 418892136 418307266 417696457 417086029 416502953 415972595 415513191
2958D15513191l81508l12805k72255k77595l41225m66728o49338q75778j128578j389656
$$ 415513191 415131683 414818878 414546623 414269028 413927803 413461075 412811737 411935959 410807381 409417725
2968D09417725j640549j864166k042847k156792k182655k095223j869468j486588r43756
$$ 409417725 407777176 405913010 403870163 401713371 399530716 397435493 395566025 394079437 393135681
2977C93135681k58179N25208J341248K113151K771111L268585L591041L755303L799019
$$ 393135681 392877502 393402710 394743958 396857109 399628220 402896805 406487846 410243149 414042168
2986D14042168L763733L683776L582192L473396L370896L290329L246917L247261L282357
$$ 414042168 417805901 421489677 425071869 428545265 431916161 435206490 438453407 441700668 444983025
2995D44983025L327331L347626L312149L205604L031159K809906K569351K334938K123566
$$ 444983025 448310356 451657982 454970131 458175735 461206894 464016800 466586151 468921089 471044655
3004D71044655J942825J793709J672440J571617J480140J384240J268997J124344R46846
$$ 471044655 472987480 474781189 476453629 478025246 479505386 480889626 482158623 483282967 484229813
3013D84229813P41768N20057K93350P0801j41487l40042n21202o80733q16116r26323
$$ 484229813 484971581 485491638 485784988 485855789 485714302 485374260 484853058 484172325 483356209 482429886
3023D82429886j014481j084137j138191j176681j200600j213989j229287j262550j326179
$$ 482429886 481415405 480331268 479193077 478016396 476815796 475601807 474372520 473109970 471783791
3032D71783791j416741j509056j559906j525078j380195j137619q47359n82848m15306
$$ 471783791 470367050 468857994 467298088 465773010 464392815 463255196 462407837 461824989 461409683
3041D61409683l87459n03273p30705j019440j321792j606064j860390k086029k287483
$$ 461409683 461022224 460518951 459788246 458768806 457447014 455840950 453980560 451894531 449607048
3050D49607048k464676k611847k718773k777519k785301k746964k676124k592163k518769
$$ 449607048 447142372 444530525 441811752 439034233 436248932 433501968 430825844 428233681 425714912
3059D25714912k477951k485046k544060k644882k766838k882423k966500l002052k983131
$$ 425714912 423236961 420751915 418207855 415562973 412796135 409913712 406947212 403945160 400962029
3068D00962029k916909k819900k714615k624970k571029k564202k603988k678490k767372
$$ 400962029 398045120 395225220 392510605 389885635 387314606 384750404 382146416 379467926 376700554
3077C76700554k849655k911034k947235k962341k961197k940407k885628k775421k593155
$$ 376700554 373850899 370939865 367992630 365030289 362069092 359128685 356243057 353467636 350874481
3086C50874481k339477k038956j737061j485862j326065j275826j327629j456032j629753
$$ 350874481 348535004 346496048 344758987 343273125 341947060 340671234 339343605 337887573 336257820
3095C36257820j821709k009201k172355k289543k339135k304878k186317k001381j783047
$$ 336257820 334436111 332426910 330254555 327965012 325625877 323320999 321134682 319133301 317350254
3104C17350254j568050j382447j234207j112079r94378q61301p02362n20287l27701
$$ 317350254 315782204 314399757 313165550 312053471 311059093 310197792 309495430 308975143 308647442
3113C08647442j39580L1033J77116K97928L97415M83971N67913O59942P69062Q97847
$$ 308647442 308507862 308538895 308716011 309013939 309411354 309895325 310463238 311123180 311892242 312790089
3123C12790089J042938J193581J336517J461487J564979J652584J736756J829185J935501
$$ 312790089 313833027 315026608 316363125 317824612 319389591 321042175 322778931 324608116 326543617
3132C26543617K050438K159195K243309K287293K286071K246399K182999K113419K051315
$$ 326543617 328594055 330753250 332996559 335283852 337569923 339816322 341999321 344112740 346164055
3141C46164055K002525J966667J938019J909599J875725J830902J771508J693153J593704
$$ 346164055 348166580 350133247 352071266 353980865 355856590 357687492 359459000 361152153 362745857
3150C62745857J475067J342163J204682J071739R50050Q39997P37533O35491N27496
$$ 362745857 364220924 365563087 366767769 367839508 368789558 369629555 370367088 371002579 371530075
3159C71530075M11034K87246J59493L0174r9144k28042l56217m80499n97496p03163
$$ 371530075 371941109 372228355 372387848 372418022 372318878 372090836 371734619 371254120 370656624 369953461
3169C69953461p95555q74672r41391r95140j034470j057777j066132j064568j060257
$$ 369953461 369157906 368283234 367341843 366346703 365312233 364254456 363188324 362123756 361063499
3178C61063499j060180j066818j077080j083946j081620j068229j048546j029930j020851
$$ 361063499 360003319 358936501 357859421 356775475 355693855 354625626 353577080 352547150 351526299
3187C51526299j025696j044770j075782j114464j158257j204643j252403j300469j348533
$$ 351526299 350500603 349455833 348380051 347265587 346107330 344902687 343650284 342349815 341001282
3196C41001282j396218j444625j494751j548043j604347j664543j727677j792831j858025
$$ 341001282 339605064 338160439 336665688 335117645 333513298 331848755 330121078 328328247 326470222
3205C26470222j920166j975898k023697k064114k100124k136650k176762k221546k268906
$$ 326470222 324550056 322574158 320550461 318486347 316386223 314249573 312072811 309851265 307582359
3214C07582359k315254k357254k392979k421989k444019k458020k462024k454281k433491
$$ 307582359 305267105 302909851 300516872 298094883 295650864 293192844 290730820 288276539 285843048
3223B85843048k399521k352657k293129k221813k139473k049332j956196j864109j774292
$$ 285843048 283443527 281090870 278797741 276575928 274436455 272387123 270430927 268566818 266792526
3232B66792526j684398j587964j478500j352024j208820j053410q89988p20234n41897
$$ 266792526 265108128 263520164 262041664 260689640 259480820 258427410 257537422 256817188 256275291
3241B56275291l50513j43375P7972L07941N39303P69234R99546J236916J488819J758060
$$ 256275291 255924778 255781403 255859375 256167316 256706619 257475853 258475399 259712315 261201134 262959194
3251B62959194K041302K329941K614937K890872L157864L420525L684139L950710M217625
$$ 262959194 265000496 267330437 269945374 272836246 275994110 279414635 283098774 287049484 291267109
3260B91267109M478187M723378M946251N140762N305366N440178N546456N624847N675774
$$ 291267109 295745296 300468674 305414925 310555687 315861053 321301231 326847687 332472534 338148308
3269C38148308N698967N695991N670014N628242N579529N531426N488357N448990N407944
$$ 338148308 343847275 349543266 355213280 360841522 366421051 371952477 377440834 382889824 388297768
3278C88297768N360069N302124N235023N162163N086365N007286M923134M830856M731102
$$ 388297768 393657837 398959961 404194984 409357147 414443512 419450798 424373932 429204788 433935890
3287D33935890M627190M524154M425774M330025M231872M123917M000320L861618L711129
$$ 433935890 438563080 443087234 447513008 451843033 456074905 460198822 464199142 468060760 471771889
3296D71771889L555526L398934L241119L078995K908325K727852K541390K357139K185249
$$ 471771889 475327415 478726349 481967468 485046463 487954788 490682640 493224030 495581169 497766418
3305D97766418K033234J903992J794433J697197J605568J515923J429443J350479J285324
$$ 497766418 499799652 501703644 503498077 505195274 506800842 508316765 509746208 511096687 512382011
3314E12382011J238442J210823J200104J199531J200218J190758J162453J109581J034622
$$ 512382011 513620453 514831276 516031380 517230911 518431129 519621887 520784340 521893921 522928543
3323E22928543R46465Q59031P84378P28875O90345O60553O30570N95779N58396N25169
$$ 522928543 523875008 524734039 525518417 526247292 526937637 527598190 528228760 528824539 529382935 529908104
3333E29908104N04951N01519N13267N32913N49851N54314N40847N08805M63905M14619
$$ 529908104 530413055 530914574 531427841 531960754 532510605 533064919 533605766 534114571 534578476 534993095
3343E34993095L68348L25851K79999K15988J19171j8082j89857l77503n55305o98967
$$ 534993095 535361443 535687294 535967293 536183281 536302452 536284370 536094513 535717010 535161705 534462738
3353E34462738p94640q40148q41294q05626p37114o33850m90875l06435q3084J68000
$$ 534462738 533668098 532827950 531986656 531181030 530443916 529810066 529319191 529012756 528929672 529097672
3363E29097672M29954O82640R05876J082459J200218J254463J248551J193466J106186
$$ 529097672 529527626 530210266 531116142 532198601 533398819 534653282 535901833 537095299 538201485
3372E38201485J003761Q98819P97996O98243N92308M74052L43170K07672Q2589j7167
$$ 538201485 539205246 540104065 540902061 541600304 542192612 542666664 543009834 543217506 543300095 543282928
3382E43282928q1405j08185j02539p1068j8272N5618J52283K69317L98293N24025O29539
$$ 543282928 543201523 543093338 542990799 542919731 542901459 542957077 543109360 543378677 543776970 544300995 544930534
3393E44930534P02935P40051P45506P28302O97289O57882O12145N60913N06096M50668
$$ 544930534 545633469 546373520 547119026 547847328 548544617 549202499 549814644 550375557 550881653 551332321
3403E51332321L98483L50266L05519K64359K27012J98403J82876J81732J88866J91231
$$ 551332321 551730804 552081070 552386589 552650948 552877960 553076363 553259239 553440971 553629837 553821068
3413E53821068J73492J27182N7106j8234p2861q6822n4512J0605Q2664J36261J56098
$$ 553821068 553994560 554121742 554178848 554160614 554087753 554000931 553946419 553957024 554039688 554175949 554332047
3424E54332047J43890J13754Q3580O7749P1678R3041J25046J60064J91346K14347K27700
$$ 554332047 554475937 554589691 554673271 554741020 554812698 554905739 555030785 555190849 555382195 555596542 555824242
3435E55824242K33955K37503K42577K48527K48985K35711K06070J67732J40190J44539
$$ 555824242 556058197 556295700 556538277 556786804 557035789 557271500 557477570 557645302 557785492 557930031
3445E57930031J92451K78130L78075M63943N14374N25131N07011M75922M43764M13551
$$ 557930031 558122482 558400612 558778687 559242630 559757004 560282135 560789146 561265068 561708832 562122383
3455E62122383L83453L53470L29285L18565L24822L42827L60870L68004L62244L52096
$$ 562122383 562505836 562859306 563188591 563507156 563831978 564174805 564535675 564903679 565265923 565618019
3465E65618019L50571L65104L93410M24118M45976M55208M55857M54101M49600M35257
$$ 565618019 565968590 566333694 566727104 567151222 567597198 568052406 568508263 568962364 569411964 569847221
3475E69847221M01802L49617K93541K57683K61574L06778L73764M33617M65889M71649
$$ 569847221 570249023 570598640 570892181 571149864 571411438 571718216 572091980 572525597 572991486 573463135
3485E73463135M68826M79202N08423N41763N55993N37338M95682M59213M52652M78439
$$ 573463135 573931961 574411163 574919586 575461349 576017342 576554680 577050362 577509575 577962227 578440666
3495E78440666N10445N11894M62685L76968K98538K72827L15438M02984M84696N17387
$$ 578440666 578951111 579463005 579925690 580302658 580601196 580874023 581189461 581592445 582077141 582594528
3505E82594528M92821M41322M11835M38347N20706O26030P10335P45010P28417O80542
$$ 582594528 583087349 583528671 583940506 584378853 584899559 585525589 586235924 586980934 587709351 588389893
3515E88389893O26297N80177N42488N03998M55818L95966L30696K72903K40135K51656
$$ 588389893 589016190 589596367 590138855 590642853 591098671 591494637 591825333 592098236 592338371 592590027
3525E92590027L22075M53109O24047P93152R11026R40704Q80890P70416O73599O49872
$$ 592590027 592912102 593365211 593989258 594782410 595693436 596634140 597515030 598285446 598959045 599608917
3535E99608917P17736Q40873R40132R32961P80296N15747K35520N5122M8637K09122
$$ 599608917 600326653 601167526 602107658 603040619 603820915 604336662 604572182 604627304 604675941 604885063
3545F04885063M52957O66237P70798P63435P08885O89621P48711Q65746R82017J050987
$$ 604885063 605338020 606004257 606775055 607538490 608247375 608936996 609685707 610551453 611533470 612584457
3555F12584457J074753J091881J125450J134987J017418O73103R8915n62324j058464
$$ 612584457 613659210 614751091 615876541 617011528 618028946 618702049 618800964 618238640 617180176
3564F17180176j147270p29561Q4915J022148J773262K135162K082749J745720J319504
$$ 617180176 616032906 615303345 615388260 616410408 618183670 620318832 622401581 624147301 625466805
3573F25466805R73854Q05931Q38012J037827J325645J574021J627540J357727P45049
$$ 625466805 626440659 627246590 628084602 629122429 630448074 632022095 633649635 635007362 635752411
3582F35752411o8436q03604j161499r71718k93808O01197J361923J730537J655121
$$ 635752411 635683975 634880371 633718872 632747154 632453346 633054543 634416466 636147003 637802124
3591F37802124J284523Q60672N81322N19409O32934Q34580J059875J284180J488953
$$ 637802124 639086647 639947319 640528641 641048050 641680984 642515564 643575439 644859619 646348572
3600F46348572J620483J590347J323472Q25271K12860l17154n71975m53186O10O25381
$$ 646348572 647969055 649559402 650882874 651708145 651921005 651603851 651031876 650578690 650579300 651204681
3610F51204681J193695J489335J378555Q61206J01013n96619q71200m63257O20346
$$ 651204681 652398376 653887711 655266266 656127472 656228485 655631866 654760666 654297409 654917755
3619F54917755K026901L143006L350906K347717L54386j926270l605423m025116l063049
$$ 654917755 656944656 660087662 663438568 665786285 666140671 664214401 660608978 656583862 653520813
3628F53520813j165314R01490K433776L084183K930145K326355J668091J222382J089401
$$ 653520813 652355499 653256989 655690765 658774948 661705093 664031448 665699539 666921921 668011322
3637F68011322J247330J599273J968537K088318J659393N03311j259842l151397m482651
$$ 668011322 669258652 670857925 672826462 674914780 676574173 677077484 675817642 672666245 668183594
3646F68183594m676514l586426j610489M87366J956406K419052K004852J204453N60226
$$ 668183594 663507080 659920654 658310165 658797531 660753937 663172989 665177841 666382294 666942520
3655F66942520L92990P12052J309662J926651K369766K524414K322769J735382Q14285
$$ 666942520 667335510 668047562 669357224 671283875 673653641 676178055 678500824 680236206 681050491
3664F81050491k61612j219177j813049j975861j871795j799012j980972k391357k736740
$$ 681050491 680788879 679569702 677756653 675780792 673908997 672109985 670129013 667737656 665000916
3673F65000916k624283j808396l55377J375275K909851L875198M113693L660431K641068
$$ 665000916 662376633 660568237 660212860 661588135 664497986 668373184 672486877 676147308 678788376
3682F78788376J196136n02777k195663l513870m072800l646240k315064m79126J292267
$$ 678788376 679984512 679481735 677286072 673772202 669699402 666053162 663738098 663258972 664551239
3691F64551239K500229K904205K565079J746445P58743j48697q05054j087265r12704
$$ 664551239 667051468 669955673 672520752 674267197 675025940 674877243 674072189 672984924 672072220
3700F72072220k93121N90286J377487J641083J099395j98516j827088l144531l583298
$$ 672072220 671779099 672369385 673746872 675387955 676487350 676288834 674461746 671317215 667733917
3709F67733917k920990j383362M71802K015991K814103K760849K048950J022568J4648
$$ 667733917 664812927 663429565 663901367 665917358 668731461 671492310 673541260 674563828 674578476
3718F74578476p48444j165237j221848r54132m31900K35825Q95614J359253J434327
$$ 674578476 673830032 672664795 671442947 670488815 670056915 670292740 671188354 672547607 673981934
3727F73981934R78622l0289j426391k833023l730851l638382k355651j46027K266922
$$ 673981934 674960556 674930267 673503876 670670853 666940002 663301620 660945969 660799942 663066864
3736F63066864L959274M223938K941666O81915j564636k891312k944870k077560j088257
$$ 663066864 667026138 671250076 674191742 674873657 673309021 670417709 667472839 665395279 664307022
3745F64307022p08237j149597j994247k487030k036820o04629J259765K745896L253250
$$ 664307022 663598785 662449188 660454941 657967911 655931091 655326462 656586227 659332123 662585373
3754F62585373K711792J573868N08728J2665J71203O85043J104966J103363O23016
$$ 662585373 665297165 666871033 667379761 667392426 667563629 668248672 669353638 670457001 671080017
3763F71080017j42059q90122j359482j412506j047668l67432M47998J170731J573715
$$ 671080017 670937958 670047836 668688354 667275848 666228180 665860748 666308746 667479477 669053192
3772F69053192J505280R67788J45188o56891j144257j174316q19397l13721Q6975K48719
$$ 669053192 670558472 671526260 671671448 671014557 669870300 668695984 667876587 667562866 667649841 667898560
3782F67898560K16064J51978K10723M27247P00225Q74558Q56857O78940M60358L02429
$$ 667898560 668114624 668266602 668477325 668904572 669604797 670479355 671336212 672015152 672475510 672777939
3792F72777939J93329R079l88184j020050j728897k248612k360229k036057j459121
$$ 672777939 672971268 672980347 672592163 671572113 669843216 667594604 665234375 663198318 661739197
3801F61739197q97598n19333k76108M5318O40564J496735K336197K752609K453537
$$ 661739197 660841599 660322266 660046158 660091476 660732040 662228775 664564972 667317581 669771118
3810F69771118J454544Q8501j178055j997604k300796k263642k124863j988906j761399
$$ 669771118 671225662 671314163 670136108 668138504 665837708 663574066 661449203 659460297 657698898
3819F57698898j254577l76664P38297J759949K341385K318878J809616J129608N97305
$$ 657698898 656444321 656067657 656805954 658565903 660907288 663226166 665035782 666165390 666762695
3828F66762695L43323K49634N1803m66613j310883k245102k909469l014527k493133
$$ 666762695 667106018 667355652 667407455 666940842 665629959 663384857 660475388 657460861 654967728
3837F54967728j523514m14276N80902J388321K109222K869415L625794M066315L702621
$$ 654967728 653444214 653029938 653610840 654999161 657108383 659977798 663603592 667669907 671372528
3846F71372528K142181n96008l919754o790619q127136p303619m484330o05011L013916
$$ 671372528 673514709 672918701 668998947 662208328 654081192 646777573 642293243 641688232 644702148
3855F44702148N233536N559616M282532K244186L82538o97098r20715o48498l84369
$$ 644702148 649935684 655495300 659777832 662022018 662404556 661707458 660786743 660138245 659753876
3864F59753876m70505r27200j490250j794357j585694q51822J83487J173249J807022
$$ 659753876 659283371 658356171 656865921 655071564 653485870 652634048 652817535 653990784 655797806
3873F55797806J933365J594925R76409K99607k68250o55136q60443r09195q18100o05316
$$ 655797806 657731171 659326096 660302505 660602112 660333862 659678726 658818283 657909088 657090988 656485672
3883F56485672l22342o5765N6839K746j53045k31934n1422M43115J106186J632919
$$ 656485672 656163330 656097565 656154404 656157150 656004105 655772171 655720749 656163864 657270050 658902969
3893F58902969J707154J169433J11313j161499k268600k909851k958451k463302j584702
$$ 658902969 660610123 661779556 661890869 660729370 658460770 655550919 652592468 650129166 648544464
3902F48544464n23605N25741J394654J959533K160950K019577J622696J084595N01022
$$ 648544464 648020859 648546600 649941254 651900787 654061737 656081314 657704010 658788605 659289627
3911F59289627o7520n75714r62296j149444j080323p76672l57132R918J96762J90888
$$ 659289627 659222107 658646393 657684097 656534653 655454330 654677658 654320526 654330444 654527206 654718094
3921F54718094Q9950K3346N1957J23443J19629m3106l35617o18897p28912n78918k12098
$$ 654718094 654808044 654831390 654883347 655006790 655126419 655083313 654747696 654128799 653399887 652820969 652608871
3932F52608871K27967N73730P13883O22482L50037q698l45383n64498o14319n10941
$$ 652608871 652836838 653410568 654124451 654746933 655096970 655088272 654742889 654178391 653564072 653053131
3942F53053131l39432k10113j94168k72904l52020l31955j86539J1750J47552J51367
$$ 653053131 652713699 652503586 652309418 652036514 651684494 651352539 651166000 651177750 651325302 651476669
3952F51476669N0507n9967j05057r1400r3765j72959l05252l93066l51639j96686m5929
$$ 651476669 651527176 651467209 651362152 651270752 651176987 651004028 650698776 650305710 649954071 649757385 649711456
3963F49711456k4566j53122l22876l91541l13721j91802j83716l46451n60837o22330
$$ 649711456 649686890 649533768 649210892 648819351 648505630 648313828 648130112 647783661 647222824 646600494
3973F46600494m33731j23596L5248j35193n32532q27331p47147l54614m9057k37045
$$ 646600494 646166763 646043167 646078415 645943222 645410690 644583359 643836212 643481598 643432541 643195496
3983F43195496r25904j625747j724854j085777l30506m49905j914253l998337n054131
$$ 643195496 642269592 640643845 638918991 637833214 637502708 637052803 635138550 631140213 626086082
3992F26086082l837318j105995k15721n869904k1368179m5880737p3592263r5631981
$$ 626086082 622248764 621142769 620927048 615057144 593688965 547808228 474215965 378583984
4000C78583984
$$ 378583984
##END=$$ End of the data block
