##TITLE=$$ Begin of the data block
##JCAMP-DX=5.00 $$ ACD/SpecManager v 10.08
##SPECTROMETER/DATA SYSTEM=16PC
##DATE=04 Jun 2013 13:52:26
##DATA TYPE=INFRARED SPECTRUM
##DATA CLASS=XYDATA
##ORIGIN=
##OWNER=
##NPOINTS=3601
##FIRSTX=400.00000000
##LASTX=4000.00000000
##MAXX=4000.00000000
##MINX=400.00000000
##MAXY=77.60260773
##MINY=9.88962746
##XFACTOR=1.0000000000
##YFACTOR=0.000000100000000
##FIRSTY=38.96951294
##DELTAX=1.00000000
##XUNITS=1/CM
##YUNITS=TRANSMITTANCE
##XYDATA=(X++(Y..Y))
400 389695129 487575912 565097733 616268845 643322372 654265442 658473740 662713852 669393234
408 669393234 677370300 684236603 688441238 690122604 690556793 691003036 691892624 692836838 693242645
417 693242645 692942123 692353516 692135239 692673187 693815002 695014038 695721970 695713501 695133591 694288788
427 694288788 693389969 692436981 691293411 689841995 688077545 686075668 683895645 681517258 678864212
436 678864212 675876389 672550812 668908310 664918137 660458221 655362701 649523697 642970123 635854149
445 635854149 628351593 620556679 612460823 604044762 595428047 586977615 579297295 573101311 569034843
454 569034843 567528229 568731880 572526665 578578262 586400986 595427818 605083961 614865150 624396057
463 624396057 633447456 641909103 649739380 656926041 663474884 669416122 674801941 679679184 684049835
472 684049835 687853470 690996933 693420715 695159454 696347046 697151642 697678757 697907028 697704239
481 697704239 696920853 695499268 693521500 691157837 688541946 685654221 682294540 678173447 673076401
490 673076401 667004929 660214920 653134308 646219025 639845734 634307060 629896584 626995430 626057739
499 626057739 627447472 631193771 636796494 643217468 649086685 653027115 653927765 651034393 643870087
508 643870087 632132339 615756607 595221443 571964607 548621140 528793755 516273460 513931160
516 513931160 522730179 541315575 566399231 593794861 619664917 641475754 658334732 670698166
524 670698166 679712601 686551743 692016068 696466827 699989471 702608185 704420242 705613937 706409607
533 706409607 706988449 707450409 707811050 708022766 708013763 707729950 707175903 706429749 705622101 704877548
543 704877548 704246521 703669815 703001099 702081223 700822296 699250031 697478104 695628204 693745880
552 693745880 691758728 689500275 686771164 683397293 679246063 674207077 668174667 661081314 653004379
561 653004379 644306946 635734673 628379784 623474388 622055168 624616165 630896072 639900475 650168457
570 650168457 660183792 668773880 675347748 679905624 682850876 684716187 685932007 686721573 687127457
579 687127457 687119980 686705322 685973892 685075989 684150162 683252792 682331543 681258240 679901428 678200073
589 678200073 676190109 673960724 671555099 668874207 665652390 661554260 656367569 650202560 643570557
598 643570557 637262573 632049332 628342628 626007423 624456940 623016167 621371422 619853020 619359741
607 619359741 620928345 625148849 631740150 639525833 646852417 652252197 655023422 655449600 654568863
616 654568863 653639221 653580933 654653854 656476898 658305893 659378967 659153671 657377014 654042969
625 654042969 649352264 643732910 637893906 632810860 629561615 629017639 631510391 636638107 643333740
634 643333740 650188446 655899582 659649734 661262970 661101837 659787903 657897644 655766907 653459778
643 653459778 650863037 647825317 644252548 640131302 635490456 630345039 624656982 618324356 611191940
652 611191940 603072586 593786583 583231277 571488266 558944817 546373329 534902992 525845566
660 525845566 520399055 519321098 522694092 529880943 539693146 550703506 561575470 571297112
668 571297112 579258766 585202827 589117622 591148758 591553535 590678940 588927345 586695023 584304810
677 584304810 581964340 579770470 577739029 575823708 573903885 571759186 569074020 565497322 560727501
686 560727501 554552917 546789169 537141151 525106926 510071030 491641884 470114212 446796837
694 446796837 423937073 404165192 389654465 381409454 379073067 381392479 387110558 395788956
702 395788956 408084526 425295486 448410873 477182236 509735298 542941170 573365250 598322830
710 598322830 616559525 628308716 634814072 637638435 638109055 637086716 635034904 632221489 628882027
719 628882027 625262146 621573524 617939491 614384460 610868111 607325134 603682480 599856110 595755615
728 595755615 591312790 586521339 581451759 576217957 570907326 565519867 559962578 554103699 547843552
737 547843552 541141624 533970718 526234283 517727661 508216705 497624550 486229820 474728622
745 474728622 464061699 455034828 447900887 442131500 436540947 429758034 420851135 409814491
753 409814491 397678947 386183777 377161179 371912880 370845184 373479462 378768082 385517159
761 385517159 392704697 399590302 405646744 410438004 413567390 414742355 413908157 411345749 407650452
770 407650452 403580399 399831390 396843987 394716721 393254395 392110634 390958366 389617767 388110046
779 388110046 386631088 385476913 384951096 385292015 386632767 389003868 392364502 396647110 401791954
788 401791954 407754402 414482117 421873398 429740334 437798920 445703049 453114166 459787178 465639038
797 465639038 470771980 475441513 479981003 484712029 489873123 495589027 501880150 508692703 515926971
806 515926971 523447685 531080666 538612213 545807190 552444572 558352165 563415642 567547913 570633011
815 570633011 572481842 572840004 571467171 568269691 563435555 557511406 551378860 546125946 542850113
824 542850113 542444496 545425949 551838951 561251450 572834778 585512581 598147469 609733582
832 609733582 619555931 627281265 632959404 636935806 639705162 641747742 643403244 644813461 645947876
841 645947876 646694794 646978912 646860962 646577988 646509857 647081299 648632736 651309586 655010300 659411621
851 659411621 664064102 668518219 672438126 675659180 678180771 680104599 681554184 682612839 683303146
860 683303146 683605194 683496475 682982330 682101669 680904770 679421310 677636490 675490646 672898178
869 672898178 669776382 666066895 661751709 656870728 651554871 646070709 640860748 636540108 633822823
878 633822823 633374786 635629349 640632019 647977982 656880493 666350708 675430756 683397598 689874802
887 689874802 694826279 698457031 701074142 702963181 704320755 705250244 705799789 706013107 705961838
896 705961838 705746765 705471573 705208130 704971466 704721680 704386978 703897705 703210831 702313766 701210861
906 701210861 699905243 698395844 696691666 694835587 692916565 691051407 689341507 687825089 686459732
915 686459732 685154724 683844452 682565155 681487427 680875931 680983200 681927109 683609695 685723495
924 685723495 687844620 689572601 690654297 691038666 690847931 690289078 689550095 688733826 687845001 686826782
934 686826782 685615997 684184952 682552261 680764618 678863602 676861572 674736328 672445679 669953232
943 669953232 667248306 664351883 661306000 658152161 654914398 651596756 648202667 644771729 641421127
952 641421127 638370285 635930939 634453888 634237747 635427628 637938576 641440887 645422592 649320297
961 649320297 652671967 655240479 657054214 658353882 659466553 660665283 662069778 663626328 665160065
970 665160065 666464691 667381058 667831650 667813644 667366638 666541214 665383682 663927765 662185898 660137787
980 660137787 657728271 654894638 651624451 648023453 644348221 640972519 638279991 636527901 635743065
989 635743065 635705986 636028404 636283226 636119728 635313835 633750191 631376266 628179665 624216385 619664612
999 619664612 614854088 610224686 606210670 603096504 600918274 599460335 598350334 597204437 595751801
1008 595751801 593886223 591635246 589081497 586280632 583217659 579808235 575933037 571482353 566389656
1017 566389656 560645485 554289932 547394371 540044594 532347832 524478226 516755867 509726982 504186287
1026 504186287 501090164 501344910 505522232 513602982 524869652 538011131 551424255 563606300
1034 563606300 573493042 580627975 585124054 587468643 588276901 588095169 587306404 586134186 584696655
1043 584696655 583061371 581273308 579357109 577311668 575112495 572722931 570108871 567245064 564113846
1052 564113846 560698242 556980705 552946663 548590622 543917732 538938141 533653717 528048782 522087669
1061 522087669 515721207 508899117 501579208 493727646 485312462 476291351 466604500 456176605
1069 456176605 444926834 432784576 419701385 405656052 390651512 374711952 357886009 340263023
1077 340263023 321997757 303332539 284602261 266212082 248592873 232147427 217209377 204027767
1085 204027767 192777309 183579960 176515903 171613007 168816833 167965298 168792191 170980263 174258442
1094 174258442 178518810 183905048 190836143 199936066 211875992 227164536 245939159 267828236
1102 267828236 291935654 316971951 341515617 364338493 384700966 402514229 418303528 432968864
1110 432968864 447415352 462183914 477219200 491867790 505111771 515951309 523788910 528677254
1118 528677254 531344795 533006210 535037575 538634224 544551392 552986107 563601418 575660896
1126 575660896 588222504 600341072 611238441 620404129 627610588 632848511 636215782 637812843
1134 637812843 637692566 635881996 632455330 627608032 621684570 615142555 608475151 602135239 596497993
1143 596497993 591861839 588464661 586476707 585957603 586800385 588703918 591209373 593801918 596037102
1152 596037102 597638855 598522949 598748550 598424683 597629204 596372108 594614601 592318344 589491119
1161 589491119 586199570 582544479 578618622 574477158 570143585 565652122 561096382 556639938 552452660
1170 552452660 548581848 544818764 540656166 535412903 528526230 519907684 510187531 500686684 493063431
1179 493063431 488748093 488399315 491634827 497169075 503295975 508494720 511882744 513337288 513283272
1188 513283272 512305603 510803375 508841019 506215935 502648735 497957687 492126694 485262680 477502708
1197 477502708 468941498 459615021 449523277 438658333 427007599 414538956 401185532 386852722
1205 386852722 371445007 354894409 337176971 318312054 298363152 277454453 255810852 233803158
1213 233803158 211973934 191021957 171739178 154913874 141220379 131124058 124816904 122203026
1221 122203026 122934990 126502495 132350006 139994688 149110279 159553108 171329708 184525585
1229 184525585 199226151 215459042 233164635 252194443 272319469 293239784 314593792 335973396
1237 335973396 356955795 377152519 396266708 414141617 430778351 446310310 460943489 474879608
1245 474879608 488256683 501125679 513466721 525221596 536316071 546653328 556091995 564436722
1253 564436722 571467247 576999283 580934486 583248062 583893318 582667503 579133606 572688141 562794037
1262 562794037 549296799 532669525 514044075 494993477 477152481 461854668 449940300 441779327
1270 441779327 437424278 436742058 439416351 444825783 451915588 459206772 465006714 467764473 466412811
1279 466412811 460547371 450383682 436555862 419898338 401325417 381842308 362616539 345003471
1287 345003471 330447235 320263824 315380287 316129761 322173538 332565575 345931625 360715599
1295 360715599 375441780 388949432 400547485 410049477 417662354 423753204 428564301 431983185
1303 431983185 433463097 432141762 427130051 417884560 404545097 388126526 370499191 354146004
1311 354146004 341741982 335650864 337455711 347637787 365487404 389264107 416563911 444795799
1319 444795799 471648064 495441742 515305710 531155510 543509598 553205452 561098404 567821426
1327 567821426 573658524 578539047 582116928 583880196 583246536 579647636 572642136 562100143 548449211
1336 548449211 532893410 517462196 504767647 497457199 497505989 505603676 520890884 541175880
1344 541175880 563559647 585226974 604102097 619149704 630279617 637980118 642897568 645541229
1352 645541229 646188583 644943008 641833878 636866264 629991531 621052437 609781647 595910721
1360 595910721 579389305 560633850 540694389 521233292 504270058 491738510 484980621 484349289
1368 484349289 489066277 497397995 507093925 515941124 522242622 525081253 524320946 520409775 514106407
1377 514106407 506250572 497635078 488966980 480864296 473836899 468243294 464246902 461816521 460782661
1386 460782661 460933685 462102394 464202499 467200890 471046906 475602646 480610962 485714760 490514336
1395 490514336 494634705 497778053 499747429 500446892 499866447 498061981 495137253 491226006 486475296
1404 486475296 481028824 475013351 468530693 461656151 454443893 446936951 439179382 431225586 423153496
1413 423153496 415079041 407176361 399698486 392985077 387444725 383497696 381491089 381606636 383802452
1422 383802452 387817116 393240891 399627609 406595993 413878136 421296387 428694763 435872726 442567253
1431 442567253 448496933 453441887 457310944 460152435 462104187 463310013 463852654 463733826 462900848
1440 462900848 461287880 458834877 455474854 451107979 445606270 438868484 430917130 421978798 412498055
1449 412498055 403054771 394216576 386395416 379774551 374331093 369924278 366383514 363547516 361249962
1458 361249962 359294853 357475128 355652084 353856544 352339020 351513481 351798553 353435478 356379166
1467 356379166 360327148 364870682 369677734 374604149 379674110 384958344 390432358 395910759 401088600
1476 401088600 405662994 409454193 412463875 414853287 416873665 418798370 420885239 423360634 426400108
1485 426400108 430091248 434395485 439146194 444113808 449128532 454214172 459669228 466047935 474035339
1494 474035339 484251595 497039261 512296829 529402924 547266808 564515457 579792061 592096596
1502 592096596 601061325 607050819 611028633 614221497 617703743 622065544 627292213 632884827 638144951
1511 638144951 642479401 645597229 647537460 648559036 648981476 649059525 648943863 648714752 648450775
1520 648450775 648280029 648385925 648961334 650130920 651875305 653997345 656157532 657981644 659204025
1529 659204025 659781113 659904785 659894867 660004196 660240784 660312500 659746017 658140335 655428772 652002869
1539 652002869 648618698 646113510 645064240 645555191 647163925 649166718 650858917 651831284 652079849
1548 652079849 651912231 651712418 651685104 651704636 651341934 650056686 647477112 643645172 639106026 634786949
1558 634786949 631685715 630485840 631259308 633403435 635857048 637523041 637705269 636357269 634023895
1567 634023895 631506195 629432259 627957153 626745224 625225372 622953033 619861832 616260986 612598648
1576 612598648 609156876 605884933 602477913 598652725 594431190 590239029 586736145 584468460 583546181
1585 583546181 583535156 583621979 582947884 580914688 577304192 572182274 565705185 557996407 549199982
1594 549199982 539674873 530175629 521847191 515959587 513464432 514575729 518592911 524070969 529279976
1603 529279976 532760315 533737221 532236977 528888168 524530258 519821663 515014954 509968948 504349174
1612 504349174 497891045 490583878 482696800 474649391 466814575 459354935 452175102 444994736 437492256
1621 437492256 429441376 420778046 411584282 402013931 392204323 382207832 371959305 361275215
1629 361275215 349886398 337503128 323909111 309062500 293163967 276651459 260106544 244102135
1637 244102135 229055786 215154533 202383099 190632381 179829712 170027313 161424904 154339972
1645 154339972 149169302 146370344 146459560 149995451 157510185 169380455 185672379 206018772
1653 206018772 229592495 255202427 281491776 307179737 331266937 353138428 372539673 389448662
1661 389448662 403912010 415927277 425423660 432347450 436785736 439047089 439630127 439086876 437848549
1670 437848549 436117516 433887520 431073265 427657394 423747063 419494095 414926338 409815331 403685455
1679 403685455 395990677 386368294 374824104 361733322 347651291 333038750 318054352 302520218
1687 302520218 286061401 268329391 249190941 228809509 207630024 186315594 165686665 146661377
1695 146661377 130160275 116952152 107468195 101670284 99064837 98896275 100452671 103350258
1703 103350258 107652998 113767052 122154570 132998447 145965023 160153084 174232292 186701546
1711 186701546 196172028 201599617 202427120 198633156 190698242 179506626 166206169 152052841
1719 152052841 138272200 125961437 116035604 109206152 105967522 106581640 111065750 119202166
1727 119202166 130585890 144704523 161022892 179039288 198293209 218336582 238698025 258882084
1735 258882084 278415527 296926975 314218864 330291595 345299606 359456177 372927856 385767937
1743 385767937 397913818 409249458 419696083 429286919 438191566 446676102 455022964 463445091
1751 463445091 472031517 480744286 489458923 498024330 506315880 514265251 521866837 529170074 536265602
1760 536265602 543263206 550257950 557285271 564280930 571071129 577414818 583093452 588014870 592280579
1769 592280579 596174774 600070610 604293327 609001999 614142189 619486961 624737091 629629097 634007530
1778 634007530 637844200 641217194 644274063 647192993 650142517 653232880 656468353 659722214 662764359
1787 662764359 665351562 667349091 668826599 670066681 671462479 673344803 675819168 678702850 681598740
1796 681598740 684078903 685884781 687046204 687858429 688736420 690019684 691829987 694044724 696387939
1805 696387939 698582840 700480576 702107544 703619308 705198288 706960297 708913193 710977936 713050232
1814 713050232 715055695 716975174 718829727 720648422 722439423 724181747 725831985 727340164 728663940
1823 728663940 729782791 730712814 731521835 732329102 733282471 734506912 736048813 737848969 739766159
1832 739766159 741647263 743405151 745052185 746664658 748291092 749871445 751222076 752120438 752443848
1841 752443848 752283478 751956177 751888199 752427292 753681717 755475235 757443466 759214935 760576859
1850 760576859 761539154 762272720 762973328 763740005 764536133 765248184 765793381 766197968 766594696 767137909
1860 767137909 767890930 768754730 769492569 769838409 769637756 768945084 768020859 767228546 766874924 767077560
1870 767077560 767718124 768502731 769095612 769258347 768931046 768226776 767354126 766517944 765844421 765361710
1880 765361710 765024414 764758987 764498520 764199905 763841782 763422165 762958298 762489395 762073441 761773758
1890 761773758 761640320 761694031 761920776 762275696 762693863 763101120 763427505 763625565 763686905 763652115
1900 763652115 763596497 763595123 763679352 763812103 763907394 763886490 763746185 763588257 763588028 763906174 764593048
1911 764593048 765543137 766530457 767314529 767754822 767874756 767837906 767854309 768071213 768509293 769072952
1921 769072952 769620361 770045776 770327759 770520325 770701294 770913391 771135330 771293716 771310043 771148758
1931 771148758 770844879 770491714 770195847 770023117 769959641 769912491 769749908 769366379 768741684 767960358
1941 767960358 767179108 766552505 766153259 765927048 765711823 765311127 764591446 763550415 762326431 761141281
1951 761141281 760209427 759658203 759495697 759636765 759965515 760398026 760911179 761527557 762270584 763120880
1961 763120880 763999939 764791260 765388260 765740128 765871582 765864792 765815735 765786896 765784302 765770721 765703735
1972 765703735 765579376 765452576 765421295 765584869 765994644 766628647 767399979 768196030 768926544 769555054
1982 769555054 770098038 770596390 771079330 771538391 771932526 772215424 772372360 772443008 772514496 772687531
1992 772687531 773030243 773543549 774156265 774753723 775226517 775516739 775637817 775660553 775672913 775734406
2002 775734406 775849075 775968781 776026077 775973358 775809860 775580978 775350494 775163956 775021362 774877777
2012 774877777 774668884 774348602 773919754 773438416 772992096 772660065 772478027 772423706 772430344 772421036 772346649
2023 772346649 772206268 772043839 771920547 771880569 771928101 772026596 772119522 772160645 772137375 772073822 772012711
2034 772012711 771989212 772008667 772043915 772050247 771991272 771860580 771686249 771517181 771397705 771344757 771339264
2045 771339264 771335297 771283951 771156082 770955429 770712814 770467911 770245514 770044250 769836960 769588089
2055 769588089 769273148 768891830 768466873 768031082 767609482 767207260 766811600 766402283 765968323 765517426
2065 765517426 765074310 764671097 764331436 764060516 763843918 763655624 763471909 763282776 763097916 762941895
2075 762941895 762842941 762819672 762871475 762977066 763103714 763219910 763308716 763372574 763428650 763496399 763584824
2086 763584824 763684616 763773117 763824463 763825302 763781204 763715744 763657684 763627625 763626633 763637161 763631668 763587723 763500137
2099 763500137 763384171 763268509 763181534 763137054 763127136 763126068 763103790 763041000 762940369 762823792 762721252
2110 762721252 762652893 762617645 762592010 762543793 762450409 762313080 762158508 762025299 761943436 761916733 761920013
2121 761920013 761910629 761850891 761727753 761558380 761380386 761230774 761124878 761048508 760964661 760835724 760644836
2132 760644836 760407562 760166397 759970703 759853668 759816971 759832535 759859619 759867554 759851379 759832916 759846039
2143 759846039 759914932 760037918 760185318 760312424 760381622 760379944 760324478 760251312 760195389 760171738 760168457 760153198
2155 760153198 760092697 759970245 759795685 759598694 759413071 759257660 759126434 758992310 758823624 758601990
2165 758601990 758333817 758047256 757776947 757544861 757349854 757169113 756973495 756744919 756487885 756228027
2175 756228027 755997849 755818634 755689163 755586624 755478897 755342941 755177002 755001907 754850769 754752197
2185 754752197 754716949 754732208 754770279 754801712 754809570 754795456 754776077 754770584 754787598 754818954 754841309 754828262
2197 754828262 754762344 754643555 754487534 754315643 754143982 753974152 753794937 753590775 753352356 753085861
2207 753085861 752812119 752558746 752348480 752188721 752068100 751961975 751843109 751693268 751509781 751304398
2217 751304398 751095200 750895233 750704498 750509338 750290070 750031509 749731827 749404755 749071350 748750610
2227 748750610 748449097 748160172 747871017 747572861 747269821 746978455 746721039 746512604 746353607 746226959
2237 746226959 746106491 745968475 745803604 745620499 745442429 745295868 745198822 745153580 745145874 745152893 745154877
2248 745154877 745142365 745118942 745095367 745079193 745067749 745045166 744990463 744888229 744737549 744553833 744361115
2259 744361115 744180603 744020615 743874207 743725052 743558655 743371124 743173828 742987671 742834702 742728043
2269 742728043 742666473 742635117 742612305 742578278 742523117 742449875 742373962 742314758 742288208 742299118 742340012 742392960
2281 742392960 742437515 742455292 742434540 742370071 742260818 742108612 741917114 741692657 741443558 741180801 740915146
2292 740915146 740655594 740410080 740184402 739982605 739806137 739652939 739519043 739401016 739299240 739217529
2302 739217529 739159393 739120789 739084549 739021912 738902359 738709946 738457184 738188553 737970963 737871017 737927704
2313 737927704 738131485 738416977 738677292 738795547 738687897 738339996 737819595 737256317 736786575 736492233
2323 736492233 736358185 736277161 736103745 735729904 735142593 734427795 733719330 733123398 732666550 732296143
2333 732296143 731928482 731502457 730995712 730387802 729607468 728519974 726996613 725050278 722956696
2342 722956696 721268768 720668564 721698380 724490585 728636169 733276825 737392502 740154495 741183929
2351 741183929 740608215 738912354 736680603 734365997 732181015 730130005 728124619 726098251 724059448
2360 724059448 722075424 720222702 718544846 717046280 715711975 714534531 713522720 712694550 712061462
2369 712061462 711619949 711354904 711250839 711301117 711508484 711881027 712425156 713140640 714017563 715030975
2379 715030975 716138000 717276535 718374252 719365387 720209122 720899811 721461182 721928787 722330322
2388 722330322 722673264 722951050 723155670 723291626 723378754 723444672 723510284 723578796 723636551 723661423 723635559
2399 723635559 723555069 723429260 723274536 723106308 722932739 722753677 722563934 722359924 722143555 721924362
2409 721924362 721718063 721540146 721399155 721291733 721202469 721110153 720997849 720861053 720709763 720563049
2419 720563049 720437927 720339127 720255585 720164642 720042038 719871826 719650650 719385605 719088135 718767471
2429 718767471 718427200 718067474 717689590 717300110 716912766 716546326 716219482 715944824 715725555 715554199
2439 715554199 715417938 715303726 715205765 715127029 715077438 715066986 715098495 715164032 715245972 715323792 715382538
2450 715382538 715417786 715435486 715445786 715457077 715469513 715474319 715458298 715410538 715326385 715211411 715077744 714939117
2462 714939117 714805222 714676666 714545593 714398956 714225693 714021454 713791656 713548431 713304977 713068085
2472 713068085 712835464 712597198 712341690 712063141 711765594 711461563 711166687 710892029 710639114 710400543
2482 710400543 710164413 709921417 709669266 709414291 709167175 708937378 708727264 708530960 708336792 708133850
2492 708133850 707916565 707687759 707455292 707226639 707003555 706779099 706541672 706280975 705995102 705692368
2502 705692368 705388184 705097733 704827271 704572983 704322815 704065552 703797150 703524780 703262253 703023300
2512 703023300 702813263 702626648 702449265 702267303 702073364 701870880 701670837 701485367 701320648 701174088
2522 701174088 701036682 700900497 700763855 700635376 700529709 700458908 700425415 700418396 700417938 700403748 700365219
2533 700365219 700305710 700241699 700191116 700163956 700155869 700149231 700122528 700062027 699969559 699862518 699765167 699696350
2545 699696350 699660034 699643402 699622955 699577408 699497299 699389038 699269028 699153061 699046478 698939896 698815384
2556 698815384 698656158 698456726 698227692 697989120 697760391 697549286 697348022 697137680 696899643 696624756
2566 696624756 696318817 695997620 695678558 695370712 695071640 694771118 694458313 694129028 693788910 693447952
2576 693447952 693115768 692794418 692477646 692155457 691820755 691474533 691127014 690792542 690482559 690199661
2586 690199661 689934464 689671249 689393463 689091721 688766098 688424377 688076096 687726364 687373352 687010345
2596 687010345 686630859 686234512 685828934 685426865 685039978 684674988 684329376 683995438 683664322 683332825
2606 683332825 683004227 682686996 682389908 682117462 681867676 681633148 681404266 681173019 680935135 680689850
2616 680689850 680438614 680183716 679927139 679671478 679420166 679178238 678950806 678741684 678551254 678375549
2626 678375549 678207092 678036575 677856827 677663956 677459869 677249832 677041245 676839371 676646271 676460114
2636 676460114 676277695 676096268 675916824 675743256 675581055 675434494 675304108 675186996 675077667 674972229
2646 674972229 674868927 674769745 674677582 674594498 674518280 674445419 674370651 674291153 674206161 674116516 674022293 673921738
2658 673921738 673811569 673688889 673554230 673410645 673262787 673112411 672957153 672790756 672606964 672403870
2668 672403870 672185516 671960678 671738129 671521759 671308899 671092758 670866470 670628891 670383987 670139160
2678 670139160 669900360 669667511 669434891 669193420 668935242 668657608 668363113 668057327 667745438 667428207
2688 667428207 667102585 666762924 666405029 666028824 665639877 665247040 664858627 664478149 664101868 663720474
2698 663720474 663322144 662899475 662451935 661987000 661516724 661049881 660589066 660127716 659653549 659155121
2708 659155121 658626709 658071060 657496872 656913681 656326141 655733032 655127335 654503250 653859406 653202133
2718 653202133 652542648 651892395 651256943 650634155 650014496 649387589 648747787 648097687 647447891 646810608
2728 646810608 646194077 645596924 645008545 644413528 643799515 643162537 642509918 641856537 641219559 640612183
2738 640612183 640040588 639503670 638996735 638515625 638057709 637621689 637204475 636798935 636392899 635971870
2748 635971870 635523071 635039940 634523506 633981171 633422508 632854233 632277794 631690216 631087837 630469475
2758 630469475 629839630 629206581 628578453 627959251 627347260 626736641 626121140 625496902 624864311 624224014
2768 624224014 623574066 622907562 622212181 621476288 620692978 619864693 619002724 618123436 617243309 616375160
2778 616375160 615526695 614704018 613913765 613165588 612470512 611836967 611266785 610752907 610280609 609832039
2788 609832039 609391708 608950081 608504295 608054771 607601128 607139435 606661186 606157341 605622444 605057449
2798 605057449 604469872 603871231 603271637 602677383 602090034 601508636 600932808 600365219 599811211 599276237
2808 599276237 598764267 598275566 597808266 597361145 596935768 596536751 596169739 595836830 595533409 595247116
2818 595247116 594960594 594655800 594319725 593946037 593534660 593087578 592605286 592084541 591519356 590905609
2828 590905609 590244102 589542351 588812790 588068123 587317505 586563225 585801582 585025940 584228897 583404884
2838 583404884 582549553 581659126 580729790 579758492 578743095 577683983 576582909 575441170 574258347
2847 574258347 573030853 571754341 570425529 569044533 567616577 566150665 564656715 563143501 561615982
2856 561615982 560073929 558512077 556920013 555284157 553589668 551823921 549979286 548056259 546064301
2865 546064301 544020462 541946678 539866486 537802925 535777359 533808479 531911812 530096054 528360710
2874 528360710 526692238 525063629 523437233 521771431 520028038 518177834 516204300 514101944 511872902
2883 511872902 509522324 507055702 504477119 501791344 499004517 496124840 493161583 490123520 487017441
2892 487017441 483847504 480617294 477334137 474013672 470685844 467395134 464198303 461155586 458318672
2901 458318672 455720444 453368111 451245918 449323540 447568665 445956383 444474564 443118439 441883965
2910 441883965 440758781 439718437 438727264 437743912 436727066 435640717 434456596 433156052 431731873
2919 431731873 430189667 428548317 426838875 425099487 423370628 421689949 420090866 418603134 417253456
2928 417253456 416065826 415057182 414233627 413586960 413097534 412740822 412498283 412364731 412348213 412463875
2938 412463875 412719727 413105240 413584328 414099998 414586029 414982605 415248985 415368462 415345840 415198174
2948 415198174 414946861 414611092 414206161 413746414 413247299 412728004 412210922 411719894 411276398 410895996
2958 410895996 410584183 410332336 410115776 409893761 409613304 409216614 408649406 407869453 406851196 405587883
2968 405587883 404088860 402378616 400495071 398493958 396453362 394480667 392713356 391311760 390441971
2977 390441971 390248528 390826302 392199059 394312820 397047081 400242844 403733139 407370987 411042786
2986 411042786 414668961 418196373 421591187 424837456 427940636 430931282 433862343 436795769 439782524
2995 439782524 442843170 445957260 449067650 452095909 454964218 457613411 460014458 462168694 464102173
3004 464102173 465855026 467471046 468987770 470428085 471795235 473072624 474229050 475227356 476036301
3013 476036301 476637650 477029190 477220192 477224960 477055321 476718369 476219292 475564423 474766884 473847771
3023 473847771 472834091 471755981 470641289 469510727 468373222 467221107 466029854 464762955 463384857
3032 463384857 461879768 460269814 458622322 457042389 455645485 454522285 453706245 453157425 452771416
3041 452771416 452406425 451921921 451210670 450214958 448924675 447361450 445558357 443546715 441350250
3050 441350250 438989563 436490479 433889427 431235199 428582115 425979156 423458786 421027336 418663025
3059 418663025 416320457 413943329 411479416 408894577 406181412 403360291 400471954 397567139 394696007
3068 394696007 391897812 389196968 386600418 384097023 381659966 379250984 376828003 374353523 371803398
3077 371803398 369171104 366466331 363709946 360927162 358144951 355395126 352719193 350171471 347814980
3086 347814980 345707512 343883324 342336998 341018410 339841270 338702888 337505913 336176262 334668999
3095 334668999 332968025 331081200 329037704 326885681 324692307 322536392 320495758 318632011 316977024
3104 316977024 315529900 314264145 313144226 312141781 311247005 310470238 309835415 309369564 309091549
3113 309091549 309006596 309103584 309357491 309734840 310202484 310736141 311327496 311986980 312739544 313615208
3123 313615208 314636765 315810165 317121944 318544579 320048180 321612473 323234901 324929047 326716576
3132 326716576 328613701 330619087 332709236 334841881 336967583 339044189 341048279 342977829 344847755
3141 344847755 346678581 348486557 350276566 352042999 353773346 355453491 357070808 358612900 360066299
3150 360066299 361417198 362652512 363765640 364757385 365636024 366411667 367090378 367670555 368143120
3159 368143120 368496666 368723068 368821182 368796768 368659172 368415947 368070450 367621307 367065353 366400719
3169 366400719 365630074 364761810 363810081 362793350 361733131 360651436 359566689 358491249 357430344
3178 357430344 356381645 355339966 354300842 353264389 352236099 351224174 350235443 349270706 348323555
3187 348323555 347381096 346427193 345446281 344426537 343360405 342243996 341076317 339857521 338588562
3196 338588562 337270279 335902557 334484482 333013954 331488838 329907265 328269272 326575775 324829025
3205 324829025 323030472 321181335 319282417 317334499 315339146 313297672 311211128 309079227 306900578
3214 306900578 304674835 302404213 300095081 297757931 295405388 293049660 290700283 288363552 286044579
3223 286044579 283750172 281491508 279285717 277152138 275108624 273165417 271322212 269570732 267900200
3232 267900200 266305809 264794712 263386593 262107449 260982056 260025482 259242172 258629398 258185158
3241 258185158 257914028 257828522 257945518 258279877 258840618 259631214 260653439 261912498 263418140 265183296
3251 265183296 267219181 269531593 272120380 274981785 278112144 281509228 285172024 289097004 293276253
3260 293276253 297695427 302336178 307178459 312202187 317387886 322714386 328157043 333685799 339267197
3269 339267197 344866371 350452843 356004562 361510506 366969566 372387009 377768707 383116226 388424721
3278 388424721 393685303 398888168 404026451 409096756 414096718 419021912 423863983 428613091 433261261
3287 433261261 437806511 442253380 446609459 450879059 455058517 459135475 463092155 466911278 470580673
3296 470580673 474094162 477448883 480641670 483666878 486517143 489186401 491673393 493983536 496127853
3305 496127853 498120804 499976463 501707497 503324890 504838791 506259880 507600174 508872681 510090294
3314 510090294 511265335 512408028 513526421 514625320 515705948 516765404 517796211 518787117 519725380
3323 519725380 520599022 521399422 522122993 522771378 523349953 523867912 524336243 524769135 525182495 525593681
3333 525593681 526016808 526460190 526922913 527394447 527858162 528295937 528694725 529048576 529359589 529633904
3343 529633904 529875526 530081863 530238190 530318031 530286980 530109673 529759369 529225883 528519363 527668571
3353 527668571 526714630 525702858 524678116 523682327 522758102 521951637 521313324 520892601 520730133 520848732
3363 520848732 521247826 521903419 522773132 523804092 524939575 526124001 527306213 528441658 529494324
3372 529494324 530438919 531261520 531957054 532525711 532968903 533286133 533476906 533544540 533500328 533366127
3382 533366127 533172836 532955666 532748070 532579002 532472916 532451859 532536697 532745628 533088036 533557930
3392 533557930 534131546 534770966 535433807 536085167 536704445 537285042 537827911 538332710 538792572 539195671
3402 539195671 539530907 539795227 539994965 540144081 540259361 540355644 540445099 540536385 540635376 540741768 540845604
3413 540845604 540927162 540960617 540924911 540814896 540647125 540456696 540286064 540169830 540123138 540139313 540196152
3424 540196152 540265579 540325470 540365601 540389137 540409431 540443916 540508499 540611916 540753212 540923615 541111259
3435 541111259 541306915 541507111 541712723 541923141 542131462 542323990 542486076 542614212 542723236 542847481
3445 542847481 543028564 543299294 543668709 544118233 544610748 545105476 545573196 546002274 546394958 546759987
3455 546759987 547104568 547432899 547747841 548054695 548360939 548674850 549001884 549345589 549708290 550093040
3465 550093040 550502739 550935898 551384697 551835518 552275772 552701912 553121223 553547325 553987770 554435387
3475 554435387 554868279 555261536 555603828 555907631 556205254 556532784 556911812 557339363 557795143 558256836
3485 558256836 558715363 559176826 559653244 560149078 560654678 561154175 561638145 562113762 562599106 563106613
3495 563106613 563626175 564122772 564554329 564898338 565172348 565431480 565742645 566150475 566655197 567215996
3505 567215996 567778244 568306274 568803329 569305649 569860039 570495377 571208076 571965637 572725105 573451233
3515 573451233 574125557 574744186 575308113 575815239 576259460 576635857 576947784 577213440 577466507 577754211
3525 577754211 578129082 578637047 579300919 580107460 581003036 581907234 582743530 583474464 584124298 584771233
3535 584771233 585506630 586379585 587354851 588313942 589103432 589611473 589830132 589868011 589903259 590100098
3545 590100098 590536842 591182632 591935463 592693367 593412170 594118767 594874725 595725899 596673927 597688446
3555 597688446 598743362 599837456 600973854 602105370 603090630 603710556 603760605 603178139 602133179
3564 602133179 601015358 600306244 600392570 601413155 603212814 605423546 607621994 609483871 610873909
3573 610873909 611849022 612599716 613365860 614354782 615671921 617269630 618934631 620335312 621136780
3582 621136780 621153259 620464783 619429512 618562431 618328896 618950157 620324059 622096901 623843803
3591 623843803 625256653 626244240 626914940 627475739 628123245 628982620 630103340 631479645 633056107
3600 633056107 634714966 636266594 637478943 638153496 638217278 637781067 637125397 636614418 636569786 637157631
3610 637157631 638322792 639795837 641171188 642047729 642198563 641713409 641035538 640839539 641750565
3619 641750565 644014664 647277603 650622482 652893906 653192139 651296844 647808304 643918762 640925369
3628 640925369 639722290 640511856 642840576 645894318 648874969 651275330 652969666 654142303 655140381
3637 655140381 656318588 657903442 659880219 661923828 663429718 663686905 662175217 658864517 654354324
3646 654354324 649734879 646196823 644561920 644968872 646872330 649348373 651533890 652973938 653724976
3655 653724976 654207382 654929657 656243134 658222275 660678329 663247757 665500183 667039948 667600479
3664 667600479 667122955 665780945 663915253 661883926 659895477 657927704 655796967 653354416 650691910
3673 650691910 648223495 646575241 646334305 647788467 650794601 654824982 659140472 662985382 665723953
3682 665723953 666910858 666336288 664086227 660594711 656623383 653111038 650908966 650504379 651860809
3691 651860809 654460907 657522049 660276947 662190475 663046875 662920532 662101212 661015015 660144348
3700 660144348 659913406 660532303 661854782 663347778 664241791 663840408 661856613 658603973 654926987
3709 654926987 651886749 650347824 650659485 652568817 655376129 658236771 660454712 661660385 661833954
3718 661833954 661215973 660175247 659093399 658291931 657996063 658314896 659218826 660514221 661829071
3727 661829071 662647324 662424469 660785370 657745895 653851242 650112915 647702332 647483521 649589996
3736 649589996 653274841 657159958 659802170 660316238 658729935 655882416 652922287 650690842 649337158
3745 649337158 648375320 647123489 645240173 643019943 641267700 640837555 642121582 644801331 648002396
3754 648002396 650748138 652438660 653085709 653195114 653403168 654095917 655223770 656381760 657068253
3763 657068253 656958313 656048965 654637146 653181000 652132721 651808624 652315750 653527756 655109329
3772 655109329 656599045 657549133 657687759 657032700 655887985 654705811 653879471 653575287 653698807
3781 653698807 654005585 654281158 654470596 654680557 655067596 655702057 656508408 657317352 657978973 658443527
3791 658443527 658740463 658881454 658768082 658195801 656971893 655070496 652712860 650299988 648231659
3800 648231659 646727982 645773621 645222092 644982224 645145950 645953140 647601242 650025101 652799377
3809 652799377 655248032 656711121 656819916 655622864 653504791 650964508 648399048 646018448 643916626
3818 643916626 642209930 641119461 640918961 641773300 643585129 645963898 648360977 650301056 651570969
3827 651570969 652253952 652587967 652741852 652658157 652066498 650666351 648365402 645420227 642384415
3836 642384415 639891472 638398361 638046112 638710327 640190582 642387085 645323181 648968658 652976303
3845 652976303 656525497 658443375 657619476 653549881 646734238 638682632 631471329 627006912 626319962
3854 626319962 629206467 634373207 640009995 644510574 647021332 647593155 646926575 645885391 645046844
3863 645046844 644500198 643950653 643024445 641576080 639828072 638280983 637466049 637688522 638896332
3872 638896332 640725479 642672195 644287796 645303345 645649033 645399933 644707260 643754578 642739182
3881 642739182 641854935 641249313 640972748 640950928 641018524 641012802 640881577 640740585 640834732 641411819 642565689
3892 642565689 644134979 645709686 646754990 646801300 645620041 643318024 640315094 637218628 634645386
3901 634645386 633056107 632654419 633376350 634957695 637039795 639267311 641345062 643051834 644230042
3910 644230042 644784164 644695053 644042358 643009033 641846237 640805130 640061188 639670753 639578972 639669876
3920 639669876 639831047 639995651 640144501 640278397 640378952 640392227 640241241 639869766 639290581 638614159
3930 638614159 638030739 637747269 637893562 638447418 639219818 639922333 640291443 640209503 639750938 639128685
3940 639128685 638568344 638188744 637960205 637759285 637477417 637103806 636726151 636461525 636371651 636429939
3950 636429939 636555901 636678238 636772575 636841431 636869774 636803741 636585464 636215401 635783119 635425224 635230904
3961 635230904 635174103 635128899 634968834 634669456 634324875 634059067 633902321 633746796 633430252 632889404
3971 632889404 632245407 631732826 631509209 631500816 631432610 631042061 630313950 629521141 629005966 628855247
3981 628855247 628754997 628196411 626911201 625183525 623705788 622999916 622827530 622141571 619799728
3990 619799728 615624390 610935326 607814636 607156258 606536064 599433975 576850586 531047974 459738846
3999 459738846 368466835
4000 368466835
##END=$$ End of the data block
