##TITLE=$$ Begin of the data block
##JCAMP-DX=5.00 $$ ACD/SpecManager v 10.08
##SPECTROMETER/DATA SYSTEM=16PC
##DATE=04 Jun 2013 14:02:58
##DATA TYPE=INFRARED SPECTRUM
##DATA CLASS=XYDATA
##ORIGIN=
##OWNER=
##NPOINTS=3601
##FIRSTX=400.00000000
##LASTX=4000.00000000
##MAXX=4000.00000000
##MINX=400.00000000
##MAXY=78.80381012
##MINY=10.22669506
##XFACTOR=1.0000000000
##YFACTOR=0.000000100000000
##FIRSTY=41.88799667
##DELTAX=1.00000000
##XUNITS=1/CM
##YUNITS=TRANSMITTANCE
##XYDATA=(X++(Y..Y))
400 418879967 523379478 605658035 659900055 689115982 702066574 708312225 714134750 721192322
408 721192322 727956772 732422867 734163895 734626160 735894470 739105759 743693771 747881927 749935913
417 749935913 749258423 746662674 743792572 742187119 742589798 744804535 748001480 751161118 753407135
426 753407135 754175415 753292389 751024475 748055267 745299683 743553162 743112106 743587494 744048004
435 744048004 743447800 741114044 737037277 731825104 726374359 721448517 717359695 713867798 710291901
444 710291901 705760880 699514313 691171417 680901184 669433441 657888489 647466583 639113083
452 639113083 633294640 629980888 628818817 629396400 631456566 634967003 640041351 646774979 655086365
461 655086365 664624786 674772949 684739990 693729553 701148376 706797180 710962372 714340515 717788315
470 717788315 721979523 727112885 732812195 738276367 742620621 745257263 746143494 745791397 745044403
479 745044403 744724884 745303574 746725540 748449860 749676971 749661026 747982101 744673386 740168152
488 740168152 735098419 730041580 725311508 720875092 716414032 711512756 705905151 699704895 693521347
497 693521347 688390503 685495834 685744629 689356232 695656128 703197021 710181885 714985580 716509171
506 716509171 714197006 707767258 696919785 681329269 661051788 637166328 612226486 590107117
514 590107117 575113182 570640869 577972755 595782204 620588608 647947540 673822632 695566940
522 695566940 712200546 724055557 732130814 737524948 741156082 743734360 745827408 747872009
530 747872009 750099106 752457504 754637375 756225204 756925507 756730042 755943222 755054321 754530792
539 754530792 754630356 755317307 756304398 757183228 757589111 757332916 756459656 755220337 753966751 753009644
549 753009644 752492218 752326584 752223358 751797943 750709534 748765488 745945358 742336807 738021622
558 738021622 732988281 727130737 720360336 712786484 704877930 697499847 691772537 688775940 689202347
567 689202347 693103104 699837875 708253708 717020645 724989548 731439209 736145248 739285049 741251221
576 741251221 742468262 743270264 743856964 744310226 744639130 744829178 744876785 744802170 744639130 744409256
586 744409256 744099121 743656540 743016586 742134552 741000443 739607315 737886581 735657196 732646103
595 732646103 728604813 723479614 717538910 711360931 705651627 700964127 697468262 694913635 692829437
604 692829437 690865631 689084244 688017044 688430710 690903854 695444870 701366730 707505188 712678299
613 712678299 716153717 717890854 718450851 718649902 719156799 720240326 721757278 723324356 724524384
622 724524384 725018539 724536896 722831421 719703903 715157242 709596710 703933105 699454117 697457352
631 697457352 698777847 703432236 710556717 718680038 726210327 731921005 735244980 736293259 735647888
640 735647888 734061279 732192307 730451431 728960953 727591248 726036224 723912201 720869751 716701584
649 716701584 711406937 705173798 698261108 690827408 682788849 673806992 663451004 651497345
657 651497345 638236961 624631386 612205582 602676544 597444801 597153015 601492386 609331627
665 609331627 619097176 629232483 638551788 646384964 652521057 657046432 660184250 662189331 663295364
674 663295364 663682709 663452835 662627716 661202850 659241714 656950912 654663315 652701492 651182327
683 651182327 649879532 648239365 645540466 641085587 634290657 624622879 611494942 594301071
691 594301071 572719841 547203178 519364433 491932755 468125763 450639725 440736961 437938805
699 437938805 440538979 446695328 455503044 467436142 483887863 506061249 533839951 565290794
707 565290794 597091141 625663300 648424606 664535217 674834747 681105804 685117645 687940369
715 687940369 689793854 690372009 689354935 686795654 683207016 679376755 676056900 673700180 672336578
724 672336578 671606064 670901260 669568787 667117767 663381195 658577423 653231049 647964249 643235016
733 643235016 639138908 635370674 631367950 626553230 620546150 613237648 604712830 595107307 584520874
742 584520874 573058586 560964584 548722992 536996346 526370888 517015495 508457565 499652176
750 499652176 489378738 476814346 462011604 446036110 430676155 417850266 408986626 404642067
758 404642067 404492531 407628441 412954216 419478989 426395760 432996292 438563004 442372246 443840981
767 443840981 442741585 439345093 434391289 428874130 423733826 419587746 416607666 414573135 413051796
776 413051796 411618271 410025101 408282318 406639023 405498276 405301056 406414032 409048576 413225479
785 413225479 418792458 425485344 433012161 441131630 449693413 458630180 467902107 477421532 486994095
794 486994095 496310272 504999847 512738876 519368095 524975586 529905930 534684868 539881744 545957489
803 545957489 553145332 561397362 570408058 579696808 588730011 597048683 604372978 610653114 616040726
812 616040726 620779762 625043144 628778229 631637688 633048897 632422295 629429169 624240799 617622337
821 617622337 610831947 605350685 602535706 603310242 607981529 616223526 627204170 639802475 652849045
830 652849045 665332794 676536636 686085358 693909912 700148468 705025864 708751907 711470108
838 711470108 713265305 714214859 714447098 714176025 713692856 713317642 713337326 713949966 715239182 717184601
848 717184601 719695969 722657623 725962372 729523697 733263092 737080612 740826569 744294128 747244110
857 747244110 749460602 750818634 751336594 751185226 750641479 749998093 749460220 749069138 748684616 748034668
867 748034668 746811905 744776382 741822052 737986374 733410568 728283997 722813568 717238541 711878738
876 711878738 707175751 703682251 701976013 702517471 705501251 710766296 717804489 725867615 734134293
885 734134293 741876984 748579636 753983688 758069229 760994492 763020859 764440155 765515671 766438370
894 766438370 767306747 768130112 768856049 769411774 769744873 769848480 769764328 769562988 769311295 769041138
904 769041138 768729858 768304062 767664261 766726837 765466385 763940430 762278976 760640335 759149094
913 759149094 757847443 756688385 755581894 754473114 753411942 752571030 752195053 752496414 753548965
922 753548965 755233536 757263107 759279633 760976257 762186050 762904358 763237534 763317566 763226318 762966614
932 762966614 762484131 761722717 760673599 759394608 757988968 756557617 755150909 753742981 752237854
941 752237854 750506897 748435593 745966187 743115692 739968109 736641769 733248596 729859238 726493073
950 726493073 723138123 719798813 716553879 713599777 711251984 709889297 709848022 711295242 714131393
959 714131393 717967300 722201462 726181946 729399109 731635971 733015518 733923569 734839859 736147766
968 736147766 737997284 740270081 742646332 744733047 746198807 746867447 746749573 746017456 744935684
977 744935684 743768005 742681503 741674423 740560684 739031143 736789551 733715897 729985580 726074524
986 726074524 722630920 720249939 719251862 719556503 720710754 722048416 722905045 722795258 721497879
995 721497879 719043503 715648270 711637726 707387085 703268356 699593735 696550140 694154129 692255630
1004 692255630 690606003 688968277 687212143 685346603 683468170 681657257 679879456 677950211 675579681
1013 675579681 672473907 668440933 663450089 657622604 651162949 644261856 637014046 629389114 621275291
1022 621275291 612604103 603522072 594549026 586637955 581067924 579155540 581855240 589388733 601061935
1031 601061935 615369263 630369377 644204712 655568314 663948822 669588623 673205261 675620804
1039 675620804 677455902 678986969 680182114 680851440 680822449 680060806 678703537 677009811 675265274
1048 675265274 673677063 672299271 671009598 669546738 667599411 664915619 661395111 657125015 652343292
1057 652343292 647340546 642337494 637391434 632365189 626972427 620879440 613818855 605667915 596462135
1066 596462135 586339951 575444984 563829536 551401787 537935753 523138847 506743965 488588066
1074 488588066 468652420 447059860 424048119 399943428 375145378 350122757 325402222 301540546
1082 301540546 279080257 258505154 240213814 224516411 211643734 201747036 194874611 190928631
1090 190928631 189630280 190526695 193063431 196718140 201162758 206400890 212827969 221177330 232348232
1099 232348232 247144680 265992641 288715153 314452953 341777077 368988266 394526863 417366600
1107 417366600 437251663 454685745 470660286 486217575 502004242 517991142 533463097 547290573
1115 547290573 558372765 566085815 570562706 572706413 573941383 575804710 579528542 585753479
1123 585753479 594446907 605023842 616593552 628236694 639221611 649105530 657717209 665050354
1131 665050354 671126175 675886536 679162979 680735397 680451584 678347168 674705048 670017242 664865341
1140 664865341 659777374 655129089 651133194 647902832 645536346 644161377 643906708 644824905 646815491
1149 646815491 649604340 652792816 655954742 658729248 660876083 662278976 662920609 662853317 662178879
1158 662178879 661033249 659563446 657887878 656053391 654009247 651619339 648721237 645215149 641151581
1167 641151581 636773796 632473450 628647575 625487862 622787552 619881172 615805321 609677124 601168747
1176 601168747 590858002 580249405 571381912 566139259 565548706 569382019 576253929 584169807
1184 584169807 591264153 596392365 599332161 600566216 600821609 600627213 600094910 598969002 596845131
1193 596845131 593397522 588497009 582195511 574636078 565964088 556281128 545640259 534047928
1201 534047928 521459274 507767601 492810097 476401329 458378372 438637733 417145081 393924713
1209 393924713 369056778 342703362 315165138 286942406 258762093 231543007 206298199 183997078
1217 183997078 165425835 151078396 141102934 135310688 133244390 134293261 137826385 143316498
1225 143316498 150422459 159016094 169151535 181001205 194777184 210664845 228771858 249094830
1233 249094830 271497307 295698204 321272583 347673492 374276772 400449486 425629883 449403267
1241 449403267 471547928 492038498 510998764 528623695 545097122 560538063 574988289 588429565
1249 588429565 600806236 612031136 621976624 630475883 637354317 642488327 645850983 647490311
1257 647490311 647424316 645495148 641282196 634171486 623600998 609394608 592022018 572634926
1265 572634926 552840958 534315262 518431473 506075668 497673492 493336220 492963905 496204033
1273 496204033 502295303 509939156 517351990 522553635 523798866 519962158 510710754 496417236
1281 496417236 477912140 456238747 432539673 408085823 384349823 362999725 345738945 334025879
1289 334025879 328779678 330188255 337679520 350050201 365694504 382873878 399978790 415749245
1297 415749245 429417686 440737343 449868889 457149620 462808762 466738434 468408623 466977768
1305 466977768 461570473 451649132 437365303 419787369 400917053 383462410 370385590 364316750
1313 364316750 366981010 378800774 398797264 424825974 454067879 483629494 511077652 534785500
1321 534785500 554044533 568967094 580247650 588865509 595795097 601780510 607208366 612081223
1329 612081223 616072197 618616943 619010048 616512299 610503731 600719261 587542458 572253647
1337 572253647 557065659 544820404 538346901 539661942 549313889 566157112 587675362 610739975
1345 610739975 632495956 651027069 665580902 676348648 683992157 689178772 692321854 693570328
1353 693570328 692951279 690513611 686359024 680550690 672979889 663307571 651062546 635898705
1361 635898705 617921600 597949867 577571983 558932724 544271469 535345345 532923317 536533966
1369 536533966 544563789 554678764 564421883 571781464 575555916 575431824 571816635 565541573 557571678
1378 557571678 548808250 540000343 531731644 524428253 518366737 513681488 510389557 508442039 507782593
1387 507782593 508382759 510234222 513296394 517433090 522375946 527739983 533087196 538010788 542198601
1396 542198601 545455208 547679749 548822174 548845215 547710609 545391693 541899033 537300987 531726799
1405 531726799 525349197 518353348 510905342 503126183 495083847 486798210 478265495 469492416 460540962
1414 460540962 451572418 442879066 434889030 428128624 423139572 420365105 420037308 422107887 426256599
1423 426256599 431983109 438748627 446112442 453801079 461683044 469670639 477607727 485211258 492103004
1432 492103004 497915421 502412949 505561790 507514305 508520622 508819084 508559990 507784805 506447334
1441 506447334 504441032 501612511 497766418 492693596 486240578 478410110 469441643 459816322 450159264
1450 450159264 441075745 432990799 426070366 420253677 415359993 411201820 407636566 404551659 401821213
1459 401821213 399298744 396875916 394577217 392621117 391385307 391271591 392533951 395167542 398921051
1468 398921051 403425560 408360100 413552437 418962784 424574165 430272789 435805626 440845337 445120354
1477 445120354 448528366 451168671 453284302 455162621 457058334 459170341 461655655 464639664 468192368
1486 468192368 472286568 476784058 481491203 486282539 491237259 496711235 503293190 511648102 522304573
1495 522304573 535463409 550885277 567881470 585405159 602224045 617154922 629318695 638355904
1503 638355904 644523010 648611603 651694260 654778824 658504105 662998734 667947845 672814941 677097778
1512 677097778 680502472 682980118 684650345 685689240 686254501 686472092 686468964 686405563 686477356 686881027
1522 686881027 687761078 689160995 690995407 693058167 695069199 696760178 697974091 698737106 699252777
1531 699252777 699800568 700567856 701501465 702270432 702387161 701446762 699370041 696513062 693576965
1540 693576965 691341858 690355453 690722809 692095566 693853989 695386353 696330719 696673050 696677170 696689377
1550 696689377 696920395 697297745 697458954 696891403 695170364 692197571 688336258 684358521 681201706
1559 681201706 679612274 679827957 681449814 683584900 685208893 685591507 684577942 682589111 680346909
1568 680346909 678471222 677168274 676170578 674947662 673048019 670363770 667162704 663882751 660829849
1577 660829849 657985001 655049362 651701202 647898254 644017105 640727005 638652992 638024826 638515511
1586 638515511 639357529 639655991 638711281 636173325 631982079 626194496 618868179 610116310 600307121
1595 600307121 590250511 581189919 574520721 571318359 571892204 575591507 580977478 586295052 590041466
1604 590041466 591390419 590311470 587376442 583374977 578932152 574289055 569313011 563689499 557176552
1613 557176552 549781876 541786003 533611717 525622444 517960014 510500069 502938538 494950676 486333122
1622 486333122 477065125 467272034 457129555 446764221 436189728 425286636 413814888 401448555
1630 401448555 387838097 372704773 355954514 337766762 318608742 299143753 280061264 261900234
1638 261900234 244949074 229262238 214772053 201425705 189278183 178511810 169409199 162325363
1646 162325363 157689838 156024418 157933416 164025822 174769840 190323181 210406055 234269810
1654 234269810 260777359 288570347 316275291 342694778 366939011 388471832 407069511 422720795
1662 422720795 435519905 445602798 453153687 458456802 461931038 464093666 465442429 466312141
1670 466312141 466797752 466803474 466198883 464979019 463315125 461439514 459427147 457014122 453590088
1679 453590088 448398705 440848312 430759811 418404617 404314308 388970337 372550621 354866676
1687 354866676 335507202 314096565 290531540 265104961 238499470 211700859 185879936 162261677
1695 162261677 141968527 125832119 114212141 106907043 103230629 102266951 103221588 105724144
1703 105724144 109939909 116437178 125859566 138543329 154228325 171962833 190216732 207145061
1711 207145061 220915298 230012932 233473625 231008377 223014603 210479279 194797649 177552471
1719 177552471 160301399 144418945 131006184 120862093 114488792 112114496 113725367 119118528
1727 119118528 127974319 139937410 154674559 171882973 191244736 212357082 234687901 257597847
1735 257597847 280433750 302657948 323949738 344229202 363587837 382161827 400007896 417042999
1743 417042999 433070793 447879982 461363182 473599014 484859619 495537376 506023293 516585922
1751 516585922 527299194 538047333 548598289 558713493 568244591 577181396 585638542 593795891
1759 593795891 601824570 609825935 617799530 625640678 633160515 640129318 646339951 651682434 656206436
1768 656206436 660139313 663833694 667652283 671832886 676396103 681146317 685768280 689970551 693607254
1777 693607254 696717911 699477463 702097702 704732895 707437286 710173264 712847290 715344391 717551422
1786 717551422 719377975 720791321 721854019 722741241 723703384 724972076 726646576 728622360 730614166
1795 730614166 732277679 733374863 733900452 734096375 734344330 734987411 736170654 737783279 739525223
1804 739525223 741063995 742197189 742943115 743518295 744219131 745275574 746744843 748497620 750291672
1813 750291672 751889725 753162003 754126053 754917755 755716553 756666489 757825623 759152145 760523911
1822 760523911 761774139 762741165 763322220 763523026 763484497 763458099 763725510 764487534 765770874 767410049
1832 767410049 769120560 770630112 771797943 772653198 773334732 773973389 774594955 775108566 775382843
1841 775382843 775360641 775129395 774901657 774913177 775305557 776063919 777042999 778058853 778982773 779782181
1851 779782181 780490265 781138763 781707153 782125092 782329102 782328568 782237015 782235489 782486725 783039780 783781281
1862 783781281 784464340 784808807 784625702 783913269 782870407 781823883 781095657 780872269 781134644 781678772
1872 781678772 782210388 782468185 782317200 781776428 780982895 780119553 779347992 778768005 778408051 778233795
1882 778233795 778164825 778096008 777927399 777598877 777118988 776567688 776067886 775732956 775618591 775704346
1892 775704346 775914841 776162491 776386337 776565628 776702805 776803055 776861420 776870728 776837997 776789093 776755981
1903 776755981 776755066 776775970 776794968 776804123 776834335 776949844 777214050 777643127 778185883 778741684 779211884
1914 779211884 779551010 779785004 779985962 780219193 780500107 780788116 781019363 781157913 781226807 781302109
1924 781302109 781468964 781768799 782166061 782555161 782803650 782811737 782558594 782116394 781624985 781237869
1934 781237869 781060715 781106033 781284332 781436691 781397476 781063461 780439148 779638062 778835907 778199081
1944 778199081 777814941 777657547 777601624 777476807 777136917 776519623 775668564 774721298 773865280 773283234
1954 773283234 773102646 773363037 774006729 774893417 775836182 776651306 777209244 777470932 777498093 777428589
1964 777428589 777421494 777593994 777969055 778461990 778908844 779135437 779033051 778614044 778022461 777489014
1974 777489014 777249527 777456284 778120193 779104767 780176773 781093597 781689377 781932983 781928864 781868134
1984 781868134 781947250 782288666 782894516 783649063 784368210 784875259 785070648 784973068 784713440 784487610
1994 784487610 784484558 784816818 785477371 786337509 787187195 787805939 788038101 787849960 787344589 786730576
2004 786730576 786250076 786092072 786321335 786850357 787468796 787917557 787986984 787597351 786832886 785915070
2014 785915070 785122910 784690323 784718475 785138779 785738602 786242828 786420441 786172562 785571976 784834366
2024 784834366 784234772 784000931 784224701 784826431 785585098 786223068 786510773 786353683 785824661 785135880
2034 785135880 784556961 784312439 784498444 785046616 785751419 786346512 786604919 786424408 785864792 785127640
2044 785127640 784480896 784159088 784275589 784778442 785466385 786062546 786315002 786091537 785429916 784526215
2054 784526215 783662186 783100433 782983475 783279190 783792191 784237213 784349136 783985519 783181610 782138214
2064 782138214 781146469 780479050 780289536 780558090 781103210 781651306 781940079 781814880 781283951 780512848
2074 780512848 779762726 779293060 779267807 779695206 780425262 781206055 781774979 781954880 781716919 781189194
2084 781189194 780606384 780219955 780203705 780587997 781250153 781960602 782470474 782604218 782325516 781750183
2094 781750183 781102142 780629807 780513458 780797806 781376724 782033234 782521286 782658691 782394562 781828613
2104 781828613 781172104 780667572 780498581 780720215 781241074 781858978 782337723 782495422 782272263 781749954
2114 781749954 781120300 780612335 780407867 780574951 781044388 781637192 782131882 782347107 782206116 781762466
2124 781762466 781178360 780660324 780382462 780422745 780736160 781174622 781543961 781677475 781498795 781049500
2134 781049500 780473480 779963455 779690475 779741821 780090256 780606461 781108627 781430511 781481552 781278305
2144 781278305 780933533 780611572 780464401 780574799 780927124 781413879 781877136 782166367 782192841 781959915
2154 781959915 781559677 781138306 780841980 780764542 780914917 781216736 781536865 781736526 781720123 781468887
2164 781468887 781046066 780570679 780173111 779948044 779922028 780047684 780224304 780338669 780306702 780103912
2174 780103912 779769669 779391861 779069901 778879929 778848648 778946152 779101562 779230042 779263840 779176407 778989716
2185 778989716 778765488 778581696 778504181 778564377 778747559 778999557 779246216 779419250 779478226 779421005 779280777
2196 779280777 779111023 778965378 778880234 778864441 778899536 778947678 778965988 778918915 778791122 778590698 778346863
2207 778346863 778101044 777893753 777753067 777685776 777677612 777697678 777708664 777677689 777584915 777428436 777223358
2218 777223358 776997604 776783066 776606674 776481400 776401062 776341095 776263885 776131134 775916595 775616684
2228 775616684 775255585 774880600 774548950 774309311 774184341 774160004 774189072 774204330 774143753 773973312 773700790
2239 773700790 773377991 773081512 772887802 772844238 772950287 773155289 773374557 773518829 773527527 773391342
2249 773391342 773157501 772911835 772745438 772717972 772832260 773030853 773216705 773289413 773183060 772892380
2259 772892380 772475510 772034912 771681747 771497040 771502914 771653442 771850128 771977463 771945801 771727524
2269 771727524 771370392 770982361 770692368 770600357 770739136 771060944 771454086 771785660 771948700 771902084
2279 771902084 771682510 771390762 771153107 771073151 771190872 771462021 771769943 771963882 771914902 771565323
2289 771565323 770954742 770209427 769498062 768971939 768710861 768695450 768816299 768914871 768842850 768516617
2299 768516617 767949524 767248840 766577606 766090240 765869751 765885391 765997925 766007614 765735855 765103302
2309 765103302 764172058 763132858 762237015 761696472 761593781 761836777 762178268 762300415 761932907 760961685
2319 760961685 759484863 757783661 756219177 755089264 754509277 754370728 754396210 754266205 753755569
2328 753755569 752815933 751571732 750246124 749061966 748170853 747625351 747381516 747304764 747170181 746681595
2338 746681595 745548248 743627090 741084366 738476257 736663437 736536407 738643341 742887421 748457336
2347 748457336 754054184 758333359 760370483 759944534 757526398 754001923 750284042 746993332 744331512
2356 744331512 742156677 740179443 738159180 736018753 733853836 731869431 730290833 729288101 728929367
2365 728929367 729162827 729828491 730700684 731557846 732260361 732805481 733331833 734066162 735227432 736934204
2375 736934204 739150238 741692734 744295578 746698685 748727951 750339737 751616669 752721710 753829117
2384 753829117 755052261 756397400 757756882 758948898 759789886 760172119 760115433 759770813 759369965
2393 759369965 759144287 759241333 759673538 760317154 760961227 761386032 761443710 761110992 760499420 759814606
2403 759814606 759283600 759072723 759224701 759643631 760130997 760461349 760470657 760119858 759510498 758844376
2413 758844376 758345947 758175659 758371048 758834152 759370270 759761887 759848251 759582520 759046936 758418427
2423 758418427 757902451 757655716 757729111 758048019 758441010 758702469 758668213 758274689 757583313 756757660
2433 756757660 756006470 755508728 755350800 755498962 755814056 756105194 756203461 756024246 755599670 755064468
2443 755064468 754603882 754382553 754482346 754871140 755416946 755936127 756261749 756302872 756074905 755691376
2453 755691376 755318375 755112610 755162506 755455246 755882874 756281662 756494675 756429596 756092987 755586700
2463 755586700 755069122 754696655 754565735 754680481 754952087 755234604 755377274 755279388 754924927 754386520
2473 754386520 753797607 753304214 753012695 752951736 753065109 753232956 753319702 753222198 752909470 752430573
2483 752430573 751894684 751429062 751131592 751035690 751101151 751230927 751308975 751242523 750996017 750601273 750144196
2494 750144196 749732590 749455261 749349976 749390945 749498596 749569473 749514389 749289627 748911819 748450012
2504 748450012 748000107 747649765 747448273 747390823 747422943 747462006 747429123 747276459 747003555 746655197 746303482
2515 746303482 746021271 745855865 745814133 745860214 745930481 745955505 745884933 745703964 745439301 745148163 744899826
2526 744899826 744750671 744726715 744813614 744964523 745116348 745211639 745217972 745137177 745002136 744864502 744774857
2537 744774857 744765167 744838943 744969864 745111237 745213013 745238190 745176468 745046616 744890442 744757538 744688339
2548 744688339 744700394 744784088 744905624 745018845 745078812 745055084 744939880 744749680 744521027 744299240 744123459
2559 744123459 744016190 743971786 743959885 743932953 743843765 743663025 743390198 743055649 742710571 742408981 742188187
2570 742188187 742055969 741986771 741930466 741828842 741636581 741336746 740947952 740520477 740118942 739800644
2580 739800644 739595108 739491653 739442520 739377670 739230576 738962631 738579712 738130188 737688980 737329102
2590 737329102 737093811 736979523 736935425 736881790 736738358 736454468 736026993 735502243 734959946 734486389
2600 734486389 734144058 733951187 733874969 733842773 733768234 733581238 733255081 732818069 732344208 731928253
2610 731928253 731650009 731543655 731581879 731684875 731747360 731678772 731435852 731040268 730571213 730137253
2620 730137253 729835663 729717407 729767456 729909210 730031357 730029831 729845047 729486237 729028168 728584518
2630 728584518 728265610 728137131 728193512 728360062 728518906 728553467 728392181 728036423 727562943 727097015
2640 727097015 726767120 726657639 726775894 727048187 727345276 727530060 727509003 727267380 726875687 726462250
2650 726462250 726165085 726078873 726219788 726518555 726847000 727066269 727078171 726861572 726480255 726059799
2660 726059799 725740585 725625916 725743103 726031723 726364975 726595764 726610565 726372375 725934067 725419312
2670 725419312 724976807 724725342 724710236 724886398 725136795 725316010 725304337 725052567 724599762 724058609
2680 724058609 723572617 723262329 723180313 723290634 723481369 723606415 723538132 723216629 722669983 722007141
2690 722007141 721377029 720914764 720692062 720690536 720807266 720893250 720808182 720472488 719898148 719184418 718481140
2701 718481140 717931366 717617950 717531357 717572479 717590866 717440033 717032471 716371155 715547562 714705963
2711 714705963 713990707 713492050 713214874 713079147 712949829 712689362 712208405 711497726 710632782 709744263
2721 709744263 708969727 708401108 708051910 707851181 707671280 707375717 706871567 706144104 705262299 704352264
2731 704352264 703549500 702948380 702568359 702347641 702168961 701903000 701458206 700813675 700028000 699218674
2741 699218674 698519211 698031006 697785339 697729645 697743988 697683792 697431107 696937408 696241455 695452728
2751 695452728 694709854 694125671 693746262 693532639 693378448 693151321 692743607 692112350 691294861 690393295
2761 690393295 689535599 688829956 688323975 687990646 687737656 687443771 687002945 686362228 685539017 684611816
2771 684611816 683687286 682859879 682175827 681617279 681111832 680561295 679879913 679028778 678031387 676969376
2781 676969376 675956726 675101013 674469070 674062347 673816910 673624878 673373032 672982407 672434998 671777420
2791 671777420 671100388 670500107 670039825 669724808 669499664 669270935 668942337 668451843 667793808 667020187
2801 667020187 666220398 665489197 664893341 664449539 664121857 663836441 663511581 663087692 662549591 661931763
2811 661931763 661305771 660753784 660339203 660083542 659960098 659902954 659831161 659675446 659401321 659016495
2821 659016495 658566055 658111649 657707672 657379303 657112427 656857986 656548691 656125031 655555878 654851456
2831 654851456 654060593 653251419 652488403 651807251 651203690 650637054 650045547 649370880 648578339 647667084
2841 647667084 646667252 645626678 644591217 643587952 642614975 641641922 640621338 639504700 638259735
2850 638259735 636882782 635400810 633862762 632322922 630820923 629369202 627947845 626512756 625012054
2859 625012054 623401299 621657410 619781723 617795296 615730438 613619614 611488838 609354706 607225914
2868 607225914 605106697 603001633 600919342 598873940 596882935 594961777 593116837 591337929 589594193
2877 589594193 587835922 586002731 584035950 581890984 579547806 577010612 574303551 571459007 568506126
2886 568506126 565462265 562331314 559105721 555774307 552328300 548765526 545092163 541320992 537471008
2895 537471008 533568192 529646416 525750389 521934013 518255920 514770775 511519547 508522873 505779953
2904 505779953 503274345 500983276 498886566 496970444 495224380 493634033 492173080 490800934 489467278
2913 489467278 488120995 486720734 485240974 483672142 482014618 480272255 478447952 476542282 474558563
2922 474558563 472508698 470418091 468327942 466292686 464373322 462627411 461097794 459804001 458739281
2931 458739281 457875710 457175941 456609116 456162682 455847054 455689507 455719376 455952148 456375732 456946831
2941 456946831 457596245 458242035 458806877 459231529 459486465 459571228 459509430 459336472 459086151 458780670
2951 458780670 458427925 458025932 457573166 457078972 456569099 456083298 455665016 455346909 455137062 455010986
2961 455010986 454912415 454761848 454471703 453962936 453178711 452092476 450707779 449051361 447163391
2970 447163391 445090218 442883110 440606079 438348160 436234360 434428444 433119240 432492294 432692490
2979 432692490 433789825 435760193 438487930 441793137 445471306 449333878 453237076 457092819 460861549
2988 460861549 464536705 468129959 471658707 475143280 478602600 482051735 485496521 488927879 492321205
2997 492321205 495639992 498843193 501893463 504761086 507424622 509870834 512094154 514099846 515907021
3006 515907021 517549362 519069748 520507698 521887932 523208656 524439621 525529060 526416092 527048111
3015 527048111 527393723 527450943 527247391 526832314 526263199 525590248 524844894 524034233 523147202 522166405
3025 522166405 521083603 519909058 518670349 517400551 516120491 514825859 513487206 512066574 510542412
3034 510542412 508934937 507314034 505786209 504461784 503414192 502649155 502096252 501625214 501080742
3043 501080742 500321922 499251633 497827606 496056519 493977776 491645660 489114914 486434746 483646049
3052 483646049 480782738 477872772 474939957 472005310 469086494 466197319 463343773 460520477 457707520
3061 457707520 454871979 451973572 448974495 445851784 442606354 439267731 435891037 432545586 429297142
3070 429297142 426189232 423227959 420377083 417567596 414716949 411754761 408643494 405386353 402021675
3079 402021675 398605690 395193367 391827965 388540840 385360222 382323112 379477692 376876869 374561806
3088 374561806 372542953 370789948 369232407 367772331 366303978 364730721 362979126 361004448 358794670
3097 358794670 356371536 353792000 351142807 348529396 346056328 343803673 341811943 340076027 338558121
3106 338558121 337208824 335991173 334895744 333941078 333162727 332596550 332262840 332159157 332261505
3115 332261505 332530518 332922592 333399124 333936195 334529381 335195045 335966530 336883011 337977257 339263496
3125 339263496 340733185 342358131 344102707 345937233 347849388 349846268 351946678 354168320 356513824
3134 356513824 358961487 361467476 363975983 366434593 368808556 371088181 373287010 375431709 377548943
3143 377548943 379654999 381749725 383818245 385835533 387772369 389601593 391300774 392856255 394264526
3152 394264526 395531311 396668968 397690315 398601608 399399414 400070992 400600739 400977859 401202316
3161 401202316 401284828 401241074 401083794 400816612 400433998 399925919 399286537 398519974 397641830 396675453
3171 396675453 395645180 394571075 393465500 392334938 391182747 390012589 388830070 387642021 386455879
3180 386455879 385278740 384117470 382978477 381867752 380787354 379735031 378701363 377671013 376625748
3189 376625748 375548363 374426460 373254204 372030449 370757484 369437637 368071251 366656456 365188713
3198 365188713 363661041 362066040 360396919 358650093 356827049 354934578 352983971 350987358 348953323
3207 348953323 346884384 344776001 342619629 340405617 338127365 335784264 333380775 330924988 328426056
3216 328426056 325891876 323328590 320740967 318134575 315517330 312900944 310300865 307735653 305224915
3225 305224915 302787590 300439224 298189754 296042404 293993225 292033482 290155220 288356094 286644268
3234 286644268 285038700 283565540 282250996 281114883 280167847 279413300 278853245 278494129 278348923
3243 278348923 278435230 278770370 279367867 280235443 281377888 282799797 284508724 286513519 288822212
3252 288822212 291439266 294365044 297597466 301134453 304975929 309122620 313572807 318318901 323345566
3261 323345566 328630028 334144859 339861450 345751762 351788864 357944908 364189606 370489311 376807823
3270 376807823 383110008 389364929 395548630 401646042 407649727 413558960 419377632 425112152 430769920
3279 430769920 436356621 441872902 447312088 452658958 457893028 462994308 467949448 472756424 477424164
3288 477424164 481968002 486401291 490727768 494938126 499011078 502920341 506642456 510164871 513488808
3297 513488808 516627312 519598541 522416420 525085068 527595863 529931641 532075043 534018288 535769577
3306 535769577 537353287 538805199 540162506 541455460 542700653 543900681 545048027 546133537 547153664
3315 547153664 548116150 549040413 549951897 550872765 551812134 552760696 553692398 554572639 555369568 556063843
3325 556063843 556652679 557148399 557573509 557953377 558313675 558675385 559053459 559454193 559873924 560300636
3335 560300636 560720062 561121597 561504097 561875725 562248764 562631607 563022461 563407936 563766861 564076157
3345 564076157 564316063 564470749 564527702 564476357 564308052 564018364 563608894 563088570 562472687 561782074
3355 561782074 561042747 560289078 559566002 558928528 558438263 558153267 558116417 558346291 558832550 559540100
3365 559540100 560418053 561412163 562476006 563576241 564692001 565808563 566909485 567971077 568961639
3374 568961639 569846458 570596428 571194763 571642647 571957664 572168579 572307854 572404022 572476463 572534561
3384 572534561 572580910 572618027 572656784 572720299 572844315 573067818 573420830 573911057 574517365 575194244 575883675
3395 575883675 576533279 577109566 577604675 578031960 578415184 578776817 579128380 579467812 579781570 580051079
3405 580051079 580260162 580402145 580483932 580526047 580557098 580604668 580683060 580786247 580886612 580943756 580920181
3416 580920181 580798759 580591850 580340309 580099678 579919586 579827156 579818573 579864464 579923820 579961014 579957504
3427 579957504 579915123 579852905 579797554 579774895 579803658 579891052 580032845 580214920 580418091 580623169 580816498
3438 580816498 580990410 581143570 581276550 581392326 581498032 581608925 581748962 581947250 582225990 582590599
3448 582590599 583026390 583503876 583993225 584476585 584953079 585431747 585919418 586412506 586896324 587356033
3458 587356033 587785835 588194618 588601303 589026146 589482117 589973679 590498810 591052551 591626434 592207184
3468 592207184 592778206 593326607 593852539 594373779 594918213 595507507 596139832 596785583 597400589 597951088
3478 597951088 598433609 598879547 599338760 599855347 600448112 601110001 601820488 602560577 603319054 604087181
3488 604087181 604849968 605585403 606275444 606921272 607549744 608201675 608906364 609657822 610411949 611106148
3498 611106148 611695023 612177887 612601089 613034973 613536034 614121628 614765434 615421944 616055412 616661758
3508 616661758 617267303 617910309 618615265 619379616 620175552 620966301 621723328 622434425 623099976 623721581
3518 623721581 624292221 624795914 625215073 625544510 625801125 626026955 626282349 626632423 627129326 627795067
3528 627795067 628609695 629511528 630411911 631225662 631907806 632477875 633017044 633630638 634390755 635286598
3538 635286598 636213722 637015152 637557297 637801361 637829323 637807198 637906456 638225250 638756981 639417915
3548 639417915 640111542 640786285 641449814 642141113 642887192 643683777 644512863 645377274 646312866 647352676
3558 647352676 648458786 649472885 650139236 650209885 649591904 648445816 647173920 646282349 646181107
3567 646181107 647021790 648650284 650692368 652719193 654406357 655623856 656435776 657038040 657674103
3576 657674103 658554916 659791565 661342087 662992783 664399033 665199203 665173111 664374542 663156433
3585 663156433 662056732 661581497 661992950 663209915 664872131 666525497 667827606 668664398 669139786
3594 669139786 669473343 669880905 670508728 671426544 672647705 674133606 675772705 677363815 678645401
3603 678645401 679381332 679470901 679020157 678328705 677789612 677745590 678361282 679560928 681043549 682375259
3613 682375259 683135452 683089142 682328720 681318436 680775070 681386414 683462296 686682892 690113068
3622 690113068 692526398 692928696 691027069 687405701 683301468 680085602 678713531 679403763 681674805
3631 681674805 684665985 687544403 689797516 691318893 692321472 693178864 694271774 695856323 697949295
3640 697949295 700242844 702113571 702788925 701659088 698612595 694210892 689561615 685911026 684138412
3649 684138412 684411774 686179733 688492889 690467911 691650848 692117310 692313690 692771530 693862686
3658 693862686 695687256 698086395 700721970 703163681 704980164 705841370 705623093 704462204 702708282
3667 702708282 700761795 698879242 697058640 695094528 692782822 690153046 687577362 685677948 685074921
3676 685074921 686117630 688736877 692475739 696647797 700518036 703430328 704878464 704568863 702507248
3685 702507248 699077682 695037842 691362686 688959503 688363342 689563141 692041168 695000229 697659683
3694 697659683 699477539 700238342 700019073 699112701 697953262 697041931 696830597 697555618 699077835
3703 699077835 700840988 702025452 701878357 700075760 696931152 693321533 690350418 688906784 689329987
3712 689329987 691327820 694156494 696945114 699003983 699998016 699953766 699153137 697991638 696860580
3721 696860580 696075058 695841675 696241684 697219696 698570251 699935150 700834579 700763779 699364090 696626587
3731 696626587 693035736 689534912 687255554 687070084 689161758 692844696 696780243 699532013 700196075
3740 700196075 698780365 696116943 693354568 691325684 690147476 689285889 688020248 686006088 683578644
3749 683578644 681609650 681011429 682197876 684829941 687987976 690654221 692213364 692690353 692622681
3758 692622681 692681503 693281174 694386826 695592728 696378632 696382980 695557404 694161453 692641907 691475067
3768 691475067 691027527 691460114 692679825 694350357 695978165 697068863 697309647 696694717 695524597
3777 695524597 694264450 693330612 692916412 692952271 693210907 693481216 693698425 693951645 694380875 695049973
3787 695049973 695888596 696742630 697481842 698073502 698557358 698941269 699105225 698806152 697805328 696041794
3797 696041794 693728180 691288986 689167328 687621231 686646500 686076813 685787201 685847855 686507034
3806 686507034 687999115 690304337 693030319 695511856 697085800 697376480 696427841 694612427 692395859
3815 692395859 690118484 687926407 685869522 684063416 682771454 682330933 682962646 684596634 686844330
3824 686844330 689148865 691033096 692293167 693023758 693464127 693771210 693865204 693454742 692223053
3833 692223053 690065155 687224503 684241333 681737976 680170593 679689102 680186996 681486282 683516846
3842 683516846 686340027 689970703 694097595 697904205 700172958 699707413 695907516 689209061 681121674
3851 681121674 673776321 669157486 668351746 671166153 676282196 681856842 686273727 688697891 689212494
3860 689212494 688540955 687547760 686792526 686343002 685887451 685039139 683637772 681886673 680272217
3869 680272217 679329300 679390717 680447311 682175751 684095154 685758667 686883545 687379608 687297363
3878 687297363 686755676 685901108 684900436 683940277 683196640 682772369 682644196 682668839 682665863 682542801
3888 682542801 682382278 682426987 682952271 684090576 685703659 687380981 688571167 688786545 687784805
3897 687784805 685656586 682791443 679754944 677127762 675364456 674703674 675144730 676484756 678398895
3906 678398895 680530472 682563019 684255219 685442657 686028824 685990829 685395584 684416428 683308334
3915 683308334 682340012 681704178 681451492 681491699 681660690 681814499 681893311 681921158 681950378 681996613 682008972
3926 682008972 681896133 681588516 681095734 680524063 680044098 679824371 679959030 680420837 681059723 681652374
3936 681652374 681988983 681958694 681596069 681055756 680525360 680123978 679849319 679607544 679299774 678909607
3946 678909607 678521576 678259735 678196182 678297043 678450012 678545990 678548279 678494263 678436813 678380356 678275223
3957 678275223 678073730 677792816 677518539 677337036 677250290 677157974 676933899 676540070 676077042 675712509
3967 675712509 675538635 675476837 675328064 674937210 674338379 673745270 673374329 673246994 673148880 672808533
3977 672808533 672154465 671415939 670941467 670855103 670851593 670365982 669040298 667117538 665359421 664440384
3987 664440384 664241486 663688736 661459961 657177429 652122574 648571243 647702179 647168732 640072021
3996 640072021 616597328 568108673 491857376 393740158
4000 393740158
##END=$$ End of the data block
