##TITLE=$$ Begin of the data block
##JCAMP-DX=5.00 $$ ACD/SpecManager v 10.08
##SPECTROMETER/DATA SYSTEM=16PC
##DATE=12 May 1998 13:50:54
##DATA TYPE=INFRARED SPECTRUM
##DATA CLASS=XYDATA
##ORIGIN=
##OWNER=
##NPOINTS=3601
##FIRSTX=400.00000000
##LASTX=4000.00000000
##MAXX=4000.00000000
##MINX=400.00000000
##MAXY=69.68151093
##MINY=15.28759003
##XFACTOR=1.0000000000
##YFACTOR=0.000000100000000
##FIRSTY=34.21086121
##DELTAX=1.00000000
##XUNITS=1/CM
##YUNITS=TRANSMITTANCE
##XYDATA=(X++(Y..Y))
400C42108612Q4473267O3298072L6916466J3509484j478692p115097o244697l062973
408E22404442o38733K28538M95530J457901L569183O218033Q369179R398422R458618
417E60961113R199829R176407R452324R664078R412040Q612824P548370O619530O050339
426F36696854N777053N575867N277176M878922M485855M165344L866501L476486K946243
435F77146301K365494J910400J709900J741639J849212J855469J685715J397094J114197
444F92775421R22623Q20770P43713O33088M78897L06396J34201m7531k54135m64478
454F96048965o10046o13632m55704k06985L891P0266k7160k17514m01383n27954o23093
465F92439651p53173r54819j190872j366730j399841j279831j082840r25980q93173
$$ plain form
400 342108612 426581879 489879951 526796417 540305901 538827209 531712112 525467415 522404442
408 522404442 521765709 521994247 522489777 523947678 527516861 533734894 542104073 551502495 560961113
417 560961113 570160942 579337349 588789673 598453751 607865791 616478615 624026985 630646515 636696854
426 636696854 642473907 648049774 653326950 658205872 662691727 666857071 670723572 674200058 677146301
435 677146301 679511795 681422195 683132095 684873734 686722946 688578415 690264130 691661224 692775421
444 692775421 693698044 694518814 695262527 695895615 696374512 696680908 696815109 696767578 696513443 696048965
454 696048965 695438919 694825287 694369583 694162598 694166489 694236755 694209595 693992081 693590698 693062744 692439651
465 692439651 691686478 690731659 689540787 688174057 686774216 685494385 684411545 683485565 682592392
474F82592392r90372j149673j281891j334534j324844j325836j422348j659928k015762
483F70087204k405472k722015k888413k897949k816238k745743k761841k864151k969665
492F45015717k956543k738038k316818j791000j301346r55391p70912o73027n42412
501F30970230k86446J08033N66253R59931J168556J132164Q81042N19906J81961l4790
511F36166840j16005j39466k33841n08270r90448j610069k241097k777099l188896
520F24361649l533669l902969m354897m870796n371323n774994o058044o275520o529885
529E77689552o909218p442970q093338q787651r461937j0083313j0643577j1128006
537E05139542j1480523j1587753j1283531j0379715q713875o209106k927819R00383
$$ plain form
474 682592392 681602020 680452347 679170456 677835922 676511078 675185242 673762894 672102966 670087204
483 670087204 667681732 664959717 662071304 659173355 656357117 653611374 650849533 647985382 645015717
492 645015717 642059174 639321136 637004318 635213318 633911972 632956581 632185669 631512642 630970230
501 630970230 630683784 630791817 631358070 632318001 633486557 634618721 635499763 636019669 636201630 636166840
511 636166840 636050835 635911369 635677528 635169258 634178810 632568741 630327644 627550545 624361649
520 624361649 620827980 616925011 612570114 607699318 602327995 596553001 590494957 584219437 577689552
529 577689552 570780334 563337364 555244026 546456375 536994438 526911125 516267548 505139542
537 505139542 493659019 482071266 470787735 460408020 451694145 445485039 442557220 443457603
545D43457603M898262Q617898J1650428J3733979J4810257J5010223J4575691J3758736
553E40513077J2743759J1623115J0424309R163742P890816O697388N689544M939423
561F09685173M446335M129524L862000L530426L091697K592507K143860J854477J768379
570F37104378J832924J927490J927032J771851J497040J207275J011658R59625J015167
579F50254440J080475J054764Q90732O16226L16315Q3389k9144k9221K5864O7444N5770
590F54387054M807k4719L9901K40250N53665Q94470J147843J224365J104965Q51822
600F60424423N77240L87573L29056L69187M17709L79410K06680p6523l85208o17447
610F62012100p01904o28128m47388k43606r0714j8616m654P706O9962J92642L32794
$$ plain form
545 443457603 448355865 456973763 468624191 482358170 497168427 512178650 526754341 540513077
553 540513077 553256836 564879951 575304260 584468002 592358818 599056206 604745750 609685173
561 609685173 614131508 618261032 622123032 625653458 628745155 631337662 633481522 635335999 637104378
570 637104378 638937302 640864792 642791824 644563675 646060715 647267990 648279648 649239273 650254440
579 650254440 651334915 652389679 653280411 653896637 654212952 654296341 654267197 654237976 654263840 654331284 654387054
590 654387054 654391861 654367142 654407043 654647293 655200958 656095428 657243271 658467636 659572601 660424423
600 660424423 661001663 661389236 661718292 662087479 662505188 662884598 663091278 663014755 662629547 662012100
610 662012100 661310196 660682068 660234680 659991074 659900360 659881744 659877090 659884796 659954758 660147400 660480194
621F60480194M13437L66058J70594j32752m63943p52716r79310j188354j463089j879196
631F54570923k462158l178101l952560m714814n433654o130486o858864p658310q496399
640F05685577r228401r590988r256859p943344n543556k225494J563186N208626Q126411
649E76795158R957924J0669480J0504722R827767Q943519Q004074P034722O038894
657F47776260N085526M299545L764115L411712L011627K293091J142502k56348j452407
666F69075623j940384j442109r3536J589050K946244L491592L123551K128677R93194
675F79871902J45569k21939j75934O8131K98462M02832L79410K82974J69372P2098
685F81292877Q087n951M0055J34964K34985K82593K40784J24511m425p1106l8681O7902
$$ plain form
621 660480194 660893631 661259689 661430283 661297531 660833588 660080872 659101562 657913208 656450119 654570923
631 654570923 652108765 648930664 644978104 640263290 634829636 628699150 621840286 614181976 605685577
640 605685577 596457176 586866188 577609329 569665985 564122429 561896935 563460121 568668747 576795158
649 576795158 586753082 597422562 607927284 617755051 626698570 634702644 641737366 647776260
657 647776260 652861786 657161331 660925446 664337158 667348785 669641876 670784378 670528030 669075623
666 669075623 667135239 665693130 665599594 667188644 670134888 673626480 676750031 678878708 679871902
675 679871902 680017471 679795532 679619598 679687729 679986191 680389023 680768433 681051407 681220779 681292877
685 681292877 681300964 681295013 681335068 681470032 681705017 681987610 682228394 682352905 682348480 682277374 682238693 682306595
697F82306595J75400K07901J32980k1744j85394k89307l02353k46200j77841j55411
707F81444626k07443l17459m35410n06058m99878m35943l73307l80249m93469o86645
717F77108765q75931r61075q82797o62995l99780k20871k12402l73764o18973q24966
727F71075211q98591q23898o61774n12313m59519n30929o92444q71201r94415j022492
737F63607635r62905q63953p91626p99637r06296j084594j274338j411820j461792
746F54050674j436462j389008j386032j473770j655578j895829k139740k337570k458877
755F37877808k497025k469215k425804k462006k714119l326645m380188n815468p386894
764F04400444q694344r294014q852043p277984m772721j768150J217232L739624N543709
$$ plain form
697 682306595 682481995 682689896 682822876 682801132 682615738 682326431 682024078 681777878 681600037 681444626
707 681444626 681237183 680919724 680484314 679978256 679478378 679042435 678669128 678288879 677795410 677108765
717 677108765 676232834 675271759 674388962 673725967 673326187 673105316 672892914 672519150 671900177 671075211
727 671075211 670176620 669352722 668690948 668178635 667719116 667188187 666495743 665624542 664630127 663607635
737 663607635 662644730 661780777 660989151 660189514 659283218 658198624 656924286 655512466 654050674
746 654050674 652614212 651225204 649839172 648365402 646709824 644813995 642674255 640336685 637877808
755 637877808 635380783 632911568 630485764 628023758 625309639 621982994 617602806 611787338 604400444
764 604400444 595706100 586412086 577560043 570282059 565509338 563741188 564958420 568698044 574241753
773E74241753O587143O984901O915894O539611N962372N243111M425545L563919K722969
782F23187218J963005J322632Q06236L95737O2484k16636m52156o43654p80144q44841
792F24799881q19473o94962m84085k31018p362J08070O0883j52474m78020q23173j094513
803F20183754j234932j245384j177979j108894j102028j183739j334533j505394j643029
812F08647842j716346j730767j722984j741028j816292j946754k096252k215348k270584
821E91391487k265625k239494k239952k289162k359238k382774k286415k040901j686745
830E71601181j328316j089782j063195j272659j674423k188339k739411l286552l832321
839E53126183m414864n101395n977554p127457q586082j0264435j1883392j2961388
$$ plain form
773 574241753 580828896 587813797 594729691 601269302 607231674 612474785 616900330 620464249 623187218
782 623187218 625150223 626472855 627279091 627674828 627737312 627520676 627068520 626424866 625644722 624799881
792 624799881 623980408 623285446 622801361 622570343 622562981 622671051 622731934 622579460 622101440 621278267 620183754
803 620183754 618948822 617703438 616525459 615416565 614314537 613130798 611796265 610290871 608647842
812 608647842 606931496 605200729 603477745 601736717 599920425 597973671 595877419 593662071 591391487
821 591391487 589125862 586886368 584646416 582357254 579998016 577615242 575328827 573287926 571601181
830 571601181 570272865 569183083 568119888 566847229 565172806 562984467 560245056 556958504 553126183
839 553126183 548711319 543609924 537632370 530504913 521918831 511654396 499771004 486809616
847D86809616j2906608j1204873p645492k480965L568077R492874J4295769J7292977
855D97221375J8289680J7570877J5724564J3400116J1107788R128914P537422O286468
863E96267204N290985M475289L782158L167343K601394K079049J623001J272049J051521
872F21609993R48219R05915Q47969P17315N06287K59552M9782o3362o4736R728R1018
883F25817680J11885L9559j09368k78549l98330m23279l53737k38991j52397j53275
893F23861198k54440m13322n54276o10351n59845m40369l28369k99912l92456n89523
903F19418335q31184j048279j194039j266021j309624j399422j609840j975632k455940
912F06328354k913590l127060k845115j873131j61552K139701M699250P087021Q899040
$$ plain form
847 486809616 473903008 462698135 455052643 452571678 456139755 465632629 479928398 497221375
855 497221375 515511055 533081932 548806496 562206612 573314400 582443314 589980736 596267204
863 596267204 601558189 606033478 609815636 612982979 615584373 617663422 619286423 620558472 621609993
872 621609993 622558212 623464127 624312096 625029411 625535698 625795250 625845032 625781670 625716934 625726662 625817680
883 625817680 625929565 625969124 625859756 625581207 625182877 624759598 624405861 624166870 624014473 623861198
893 623861198 623606758 623193436 622639160 622028809 621468964 621028595 620700226 620400314 620007858 619418335
903 619418335 618587151 617538872 616344833 615078812 613769188 612369766 610759926 608784294 606328354
912 606328354 603414764 600287704 597442589 595569458 595407906 597547607 602246857 609333878 618232918
921F18232918R868850R923020R166145P813187O109924M274826K480011Q57620m91256
930F68235245j498490k144012k466889k557449k526169k462921k409057k353821k262039
939F47554398k106247j893158j664353j473312j356392j313210j308174j291656j227226
948F33920670j111069r72786q58269q05817q24508q89435r53674r71680r22585q21189
958F24789658p09725o36978o31828o86989p62024q04253p75909o75583n39169m20838
968F18146362l65524l83339m44794m94918m81949l83721k19764m2153Q9874J39084
978F15559158J07079L2349l1395m7226j6289J7776j2169j62735m51164q41484j256981
989F12896919j612854j848984j953201j958542j921844j890831j882668j881637j859017
$$ plain form
921 618232918 628101768 638024788 647190933 655004120 661114044 665388870 667868881 668726501 668235245
930 668235245 666736755 664592743 662125854 659568405 657042236 654579315 652170258 649816437 647554398
939 647554398 645448151 643554993 641890640 640417328 639060936 637747726 636439552 635147896 633920670
948 633920670 632809601 631836815 630978546 630172729 629348221 628458786 627505112 626533432 625610847 624789658
958 624789658 624079933 623442955 622811127 622124138 621362114 620557861 619781952 619106369 618567200 618146362
968 618146362 617780838 617397499 616952705 616457787 615975838 615592117 615372353 615330200 615420074 615559158
978 615559158 615666237 615698586 615667191 615619965 615603676 615621452 615609283 615446548 614995384 614153900 612896919
989 612896919 611284065 609435081 607481880 605523338 603601494 601710663 599827995 597946358 596087341
998E96087341j802978j740837j738243j872330k194176k699814l333816m025231m734268
1007E71945648n474586o287384p162857p958298q367424p987137o479607l762130j31150
1016E18335075L758850P077561R094543R434204Q200951N925293L365250J252899Q9798
1025E66534424M9820R99450K593689M399453O004791P098274P515602P251320O436577
1034F08883400N286331M031716K860946J887055J151924O51207L57437K34947K33765
1043F25578728K88086L27072K96020J83449K5940j10054j65520j22337j5144Q8882
1053F26375122J25008O6261o6338k16102l22151l49808l04756k26708j68419j69716
1063F24742393k38838l52211m66957n42297n60990n33866m95148m81720n15328n92880
$$ plain form
998 596087341 594284363 592543526 590805283 588932953 586738777 584038963 580705147 576679916 571945648
1007 571945648 566471062 560183678 553020821 545062523 536695099 528707962 522228355 518466225 518335075
1016 518335075 522093925 529171486 538266029 547700233 555901184 561826477 565191727 566444626 566534424
1025 566534424 566584244 567583694 570177383 574576836 580581627 587679901 595195503 602446823 608883400
1034 608883400 614169731 618201447 621062393 622949448 624101372 624752579 625110016 625344963 625578728
1043 625578728 625866814 626193886 626489906 626673355 626699295 626589241 626423721 626301384 626286240 626375122
1053 626375122 626500130 626566391 626500053 626283951 625961800 625611992 625307236 625080528 624912109 624742393
1063 624742393 624503555 624151344 623684387 623142090 622581100 622047234 621552086 621070366 620555038 619962158
1073F19962158o88476p71637q21343q37745q40760q57277r07516r94606j103897j212311
1083F10926590j301537j369972j435242j525230j664429j857032k085343k320175k541695
1092E94825935k756767k999763l315201l728523m228363m770813n308724n826912o364937
1101E55525932p010231p869186r033432j0553894j2422409j4550057j6727752j8586693
1109D58772278j9596481j9143448j6704941j2070084n515213K165833R826355J6278305
1117D14012604K0636024K2549477K2234344K0311470J7540360J4576149J1836700R497872
1125E53195000P573394O003609M713974L631973K689286J834984J055183L87878r4604
1134E80990677l30086l16887j39770N0659Q8997j44959o87027j483535k405930l274727
$$ plain form
1073 619962158 619273682 618502045 617680702 616842957 616002197 615144920 614237404 613242798 612138901 610926590
1083 610926590 609625053 608255081 606819839 605294609 603630180 601773148 599687805 597367630 594825935
1092 594825935 592069168 589069405 585754204 582025681 577797318 573026505 567717781 561890869 555525932
1101 555525932 548515701 540646515 531613083 521059189 508636780 494086723 477358971 458772278
1109 458772278 439175797 420032349 403327408 391257324 385742111 387907944 397734299 414012604
1117 414012604 434648628 457198105 479432449 499743919 517284279 531860428 543697128 553195000
1125 553195000 560768394 566772003 571485977 575117950 577807236 579642220 580697403 581085281 580990677
1134 580990677 580660591 580343704 580203934 580254593 580343590 580198631 579511604 578028069 575622139 572347412
1144E72347412l883285m023705l530312k333107n06858J715316L982888N916481P214622
1153E76899452P733078P505264O703797N566635M323921L154488K175484J453590J016807
1162F16532516Q59185R37004J171760J461411J705742J828651J794625J607666J301384
1171F29199944R23576N25627J54648j51444l70483n02701n71823o19926o89812q08334
1181F27089272r73359j156005j315880j420708j464577j469726j474381j512451j595497
1190F14706688j705704j805382j856155j838837j765518j674881j614227j618691j692314
1199E99134979j808548j922416j993828k007675j978569j938782j914139j901779j862984
1208E81806259j737404j472435j056099n30586J5259M77409P74002Q73108P96547O03447
$$ plain form
1144 572347412 568464127 564440422 560910110 558577003 558070145 559785461 563768349 569684830 576899452
1153 576899452 584632530 592137794 598841591 604408226 608732147 611886635 614062119 615515709 616532516
1162 616532516 617391701 618328705 619500465 620961876 622667618 624496269 626290894 627898560 629199944
1171 629199944 630123520 630649147 630803795 630652351 630281868 629779167 629207344 628587418 627897606 627089272
1181 627089272 626115913 624959908 623644028 622223320 620758743 619289017 617814636 616302185 614706688
1190 614706688 613000984 611195602 609339447 607500610 605735092 604060211 602445984 600827293 599134979
1199 599134979 597326431 595404015 593410187 591402512 589423943 587485161 585571022 583669243 581806259
1208 581806259 580068855 578596420 577540321 577009735 577024994 577502403 578276405 579149513 579946060 580549507
1218E80549507L58620J05743j44844m10995p19528j087227j507759j954575k393494
1227E72795448k797165l154907l465767l721122l881951l868141l569336k886391j785316
1236E43665352l43208J241874K693749L742103M217301M114494L592758K910080K318993
1245E68153496J972160J880341J934280J976776J883087J610451J200218P36428K97470
1254E81644707p8354l93562o69175r15832j121292j257744j302948j260719j163826
1263E73481255j062661j002388j003074j053696j122093j173020j189041j178550j173363
1272E63523369j211891j319771j497383j717072j937408k124443k269516k397156k553253
1281E46495476k782517l104820l505173l941230m366189m754791n115509n485077n908584
$$ plain form
1218 580549507 580908127 581013870 580869026 580458031 579738503 578651276 577143517 575188942 572795448
1227 572795448 569998283 566843376 563377609 559656487 555774536 551906395 548337059 545450668 543665352
1236 543665352 543322144 544564018 547257767 550999870 555217171 559331665 562924423 565834503 568153496
1245 568153496 570125656 572005997 573940277 575917053 577800140 579410591 580610809 581347237 581644707
1254 581644707 581566353 581172791 580503616 579587784 578466492 577208748 575905800 574645081 573481255
1263 573481255 572418594 571416206 570413132 569359436 568237343 567064323 565875282 564696732 563523369
1272 563523369 562311478 560991707 559494324 557777252 555839844 553715401 551445885 549048729 546495476
1281 546495476 543712959 540608139 537102966 533161736 528795547 524040756 518925247 513440170 507531586
1290E07531586o415634p006417p654304q320694q972931r599648j0216217j0857734
1298D38488007j1562806j2339172j3120155j3722039j3826293j3018075j0889167p188874
1306C42821426j968612M348907J1020241J7153091K1942711K4880142K5857659K5135307
1314D71190872K3200188K0587997J7740479J4939804J2317123R903145P681313N622902
1322E83183823L700599J895905K05116j356888k756996l958702m941406n716210o331329
1331E63923912o857719p365532p898789q457603q997345r446488r738350r847793r813919
1340D85500374r739151r759369r997673j0524635j1339989j2379723j3534050j4650726
1348C93575058j5521164j5861130j5319137j3545227j0306969n621853J64318O404152
$$ plain form
1290 507531586 501115952 494109535 486455231 478134537 469161606 459561958 449345741 438488007
1298 438488007 426925201 414586029 401465874 387743835 373917542 360899467 350010300 342821426
1306 342821426 340852814 345201721 356221962 373375053 395317764 420197906 446055565 471190872
1314 471190872 494391060 514979057 532719536 547659340 559976463 569879608 577560921 583183823
1322 583183823 586884422 588780327 588985443 587628555 584871559 580912857 575971451 570255241 563923912
1331 563923912 557066193 549700661 541801872 533344269 524346924 514900436 505162086 495314293 485500374
1340 485500374 475761223 466001854 456004181 445479546 434139557 421759834 408225784 393575058
1348 393575058 378053894 362192764 346873627 333328400 323021431 317399578 317563896 323968048
1356C23968048J2285652J7037583K0128898K1384011K0981979J9350548J7004471J4398155
1364D66539345J1839447R482155P383918N580864M140206L156166K695312K730141
1372E13547554L106461L578224L906517L967018L808632L618431L606605L874703M342308
1381E47356453M778480M918671M598389L826561K755203J576500M09927p48481j990242
1390E67481461l404465m994126o655387q223381r557076j0603638j1408958j2077408
1398E00557022j2706985j3342171j3961983j4492607j4827347j4832916j4348450j3196869
1406C88847694j1221504q354568m682656m72412L863983P866669J1147575J3484650
1414D00479431J4854813J5398292J5340538J4908181J4271583J3524323J2692871J1763038
$$ plain form
1356 323968048 336253700 353291283 373420181 394804192 415786171 435136719 452141190 466539345
1364 466539345 478378792 487860947 495244865 500825729 504965935 508122101 510817413 513547554
1372 513547554 516654015 520232239 524138756 528105774 531914406 535532837 539139442 543014145 547356453
1381 547356453 552134933 557053604 561651993 565478554 568233757 569810257 570220184 569471703 567481461
1390 567481461 564076996 559082870 552427483 544204102 534647026 524043388 512634430 500557022
1398 500557022 487850037 474507866 460545883 446053276 431225929 416393013 402044563 388847694
1406 388847694 377626190 369271622 364588966 364116554 367980537 375847206 386994781 400479431
1414 400479431 415334244 430732536 446073074 460981255 475252838 488777161 501470032 513233070
1422E13233070J0713807R545555Q301124P066384N940628M990654M204788L482475
1430E67478485K676735J673126M64211q30422k021599k958106l624344m169274m839401
1439E53849411n853462p281037q989067j0681152j2002487j2664108j2534829j1676445
1447D72166824j0316887q772430p338333o175499n234566m264145k922744r63021J589241
1456D27768440M369469O775017Q210296Q362160P359085N724220M134255L109932K798691
1465D78611565K957763L134537K938614K245293J235885K61917l72734n86052n51529
1474D89875259n89103r75228j781234k821389l730545m127197l778763k695312j115608
1483D68260880N99327K107772L199807L834266M091301M076004L827629L288460K352905
$$ plain form
1422 513233070 523946877 533492432 541793556 548859940 554800568 559791222 563996010 567478485
1430 567478485 570155220 571828346 572292557 571462135 569440536 566482430 562858086 558688812 553849411
1439 553849411 547995949 540714912 531725845 521044693 509042206 496378098 483843269 472166824
1447 472166824 461849937 453077507 445739174 439563675 434329109 430064964 427142220 426179199 427768440
1456 427768440 432137909 438912926 447123222 455485382 462844467 468568687 472702942 475812874 478611565
1465 478611565 481569328 484703865 487642479 489887772 491123657 491385574 491012840 490426788 489875259
1474 489875259 489286156 488310928 486529694 483708305 479977760 475850563 472071800 469376488 468260880
1483 468260880 468860207 470967979 474167786 478002052 482093353 486169357 489996986 493285446 495638351
1492D95638351R71871p50694k535210m013062m890594n109596m903183m697724m890899
1501D64819260n622101o661949p499314p592964o652603m804802k542381m98619Q35800
1510D23780327J299591J067276N03464l9292l58696m28428l29972j60942K2812K11830
1520D25567970M16947O46591Q96683J150627J377678J532097J568946J477204J313781
1529D35948524J202012J273040J576882K011146K337532K292405J739730P78847k71988
1538D48888130j016464j173859p18193J10092R21822J358948J240349O13060l03727
1547D49920158j234130j970597k453270k783241l168983l821946m836616o110344p341271
1556D16199760q133163q170776p387658o038436m620018l668671l525696m190292n334473
$$ plain form
1492 495638351 496610222 495859528 493324318 489311256 484420662 479311066 474407883 469710159 464819260
1501 464819260 459197159 452535210 445035896 437442932 430790329 425985527 423443146 422944527 423780327
1510 423780327 425079918 426147194 426650658 426611366 426252670 425824242 425494270 425333328 425356140 425567970
1520 425567970 425984917 426631508 427528191 428678818 430056496 431588593 433157539 434634743 435948524
1529 435948524 437150536 438423576 440000458 442011604 444349136 446641541 448381271 449160118 448888130
1538 448888130 447871666 446697807 445979614 446089706 447011528 448370476 449610825 450223885 449920158
1547 449920158 448686028 446715431 444262161 441478920 438309937 434487991 429651375 423541031 416199760
1556 416199760 408066597 399895821 392508163 386469727 381849709 378181038 374655342 370465050 365130577
1565C65130577o473274p196655p350846p078171o712265o589736o883946p535744q308181
1574C01001759q920575r190158r108429q825798q559399q480835q641071q962841r294930
1583B21017723r490166r462795r197769q721619q057975p202206o128750m823084l313961
1592A54619398j685219n8279J442414K730007L775825M613133N316429N968571O625747
1601A83348026P292729P917061Q408851Q672180Q637467Q274917P586918O589794N306836
1610B52034779L778629K091465L94001j119328k262897k929058l133640l003407k713280
1619B43137264k397537k088909j716728j157608l15228Q21915K164287L549481M793796
1628B46790733N741177O296329O444340O254482N873166N493183N298843N394497N746765
$$ plain form
1565 365130577 358657303 351460648 344109802 337031631 330319366 323729630 316845684 309309940 301001759
1574 301001759 292081184 282891026 273782597 264956799 256397400 247916565 239275494 230312653 221017723
1583 221017723 211527557 202064762 192866993 184145374 176087399 168885193 162756443 157933359 154619398
1592 154619398 152934179 152875900 154318314 157048321 160824146 165437279 170753708 176722279 183348026
1601 183348026 190640755 198557816 206966667 215638847 224276314 232551231 240138149 246727943 252034779
1610 252034779 255813408 257904873 258298874 257179546 254916649 251987591 248853951 245850544 243137264
1619 243137264 240739727 238650818 236934090 235776482 235461254 236283169 238447456 241996937 246790733
1628 246790733 252531910 258828239 265272579 271527061 277400227 282893410 288192253 293586750 299333515
1637B99333515O177616O426182O267185N634613M679375L721428L098717K987594L290749
1646C41616974L669510L722458L218956K262993J271591P68089J090431K179260L581238
1655C63381500M671097M979248M433632L375435K345848J772118J743583K007180K164459
1664C90874100J937523J332397O01807N5732j44844p1945N4093M5814j12114k59361
1674C94313202j96381J47782O33239R80759R53369N25894o5193m31099k39525O06652
1684C97228699J912918L290405M344101M842491M788399M364471L805161L276367K826614
1693D30679626K422142K029686J682969J487465J561508J951675K579689L256683L764840
1702D51416283L960800L842392L543815L257790L127136L169136L265915L229561K907600
$$ plain form
1637 299333515 305511131 311937313 318204498 323839111 328518486 332239914 335338631 338326225 341616974
1646 341616974 345286484 349008942 352227898 354490891 355762482 356530571 357621002 359800262 363381500
1655 363381500 368052597 373031845 377465477 380840912 383186760 384958878 386702461 388709641 390874100
1664 390874100 392811623 394144020 394745827 394801559 394656715 394584770 394638863 394684677 394572563 394313202
1674 394313202 394116821 394264603 394897842 395878601 396831970 397357864 397292671 396861572 396622047 397228699
1684 397228699 399141617 402432022 406776123 411618614 416407013 420771484 424576645 427853012 430679626
1693 430679626 433101768 435131454 436814423 438301888 439863396 441815071 444394760 447651443 451416283
1702 451416283 455377083 459219475 462763290 466021080 469148216 472317352 475583267 478812828 481720428
1711D81720428K271843J452942P00722K88467L99819J044235K038841L069229L810273
1720D96796799M059982L825493L307915K795753K503929K458611K488174K341004J860160
1729E22437820J112557L84674L3150K79617J067390K076493K890434L217659L037338
1738E36537132K583809K186814K071800K240066K497139K596970K406463J989556J562347
1747E56672096J364861J523781J990051K578468L068848L311844L279190L044815K725754
1756E79559708K419815K179680K022819J958504J999435K150193K373924K574386K613716
1765E99852180K375184J839981J129837M83589J59263L13530R16405J755753K530784
1774F11356506K983513L003502K650337K099648J551552J154861R78356J018981J220551
$$ plain form
1711 481720428 483992271 485445213 486145935 486434402 486834221 487878456 489917297 492986526 496796799
1720 496796799 500856781 504682274 507990189 510785942 513289871 515748482 518236656 520577660 522437820
1729 522437820 523550377 523935051 523968201 524247818 525315208 527391701 530282135 533499794 536537132
1738 536537132 539120941 541307755 543379555 545619621 548116760 550713730 553120193 555109749 556672096
1747 556672096 558036957 559560738 561550789 564129257 567198105 570509949 573789139 576833954 579559708
1756 579559708 581979523 584159203 586182022 588140526 590139961 592290154 594664078 597238464 599852180
1765 599852180 602227364 604067345 605197182 605680771 605840034 606153564 607069969 608825722 611356506
1774 611356506 614340019 617343521 619993858 622093506 623645058 624799919 625778275 626797256 628017807
1783F28017807J484299J678428J667862J368294Q11882J66359l15323m10805n0964
1792F34417839O25458J327095J750793J735535J338577P97272L96347L21426N74646
1801F43284988R93882J351242J475296J327209J002503O67038M67910M65699O22787
1810F51658554Q37326J007614J082764J075668J035996J006164R87931R46884Q45260
1819F60484161O77338M80576L10669K01110J40305Q8425K0446l8070j7166J45950M47235
1830F62940979P95898J057282J132584J022186Q18863O36749N22079M18091K12784
1839F69557495j58920o35224j030120j131211q30078k00043N30472J095124J324920
1848F68522415J219635R21784O15692M26101L69263L79944TL38363K86026K84119L70178
$$ plain form
1783 628017807 629502106 631180534 632848396 634216690 635028572 635194931 634879608 634468803 634417839
1792 634417839 635043297 636370392 638121185 639856720 641195297 641992569 642388916 642710342 643284988
1801 643284988 644278870 645630112 647105408 648432617 649435120 650102158 650570068 651035767 651658554
1810 651658554 652495880 653503494 654586258 655661926 656697922 657704086 658692017 659638901 660484161
1819 660484161 661161499 661642075 661952744 662153854 662294159 662382584 662403030 662364960 662347794 662493744 662940979
1830 662940979 663736877 664794159 665926743 666948929 667767792 668404541 668926620 669344711 669557495
1839 669557495 669398575 668763351 667733231 666602020 665771942 665571899 666102371 667197495 668522415
1848 668522415 669742050 670663834 671279526 671705627 672074890 672454834 672834778 673173141 673459167 673743286 674113464
1859F74113464N20478O52389O63986M89579J45797k60925n70450o37436m02145P6294
1869F74791031O36291J089249J299057J240311R94491O92520M44718K96860K31552
1878F81716080K08587J99356J98899K07443K05307J55792K9450j60294l49045m51355
1888F81960220m12140k45208k8687J40000K00042J56021O4164r613k9908r15N0430
1899F81844406J00021J36872J54037J36566O5003o4468k17896l25394l17077j70365
1909F81341705N9357K56882L08227J64643j21231m22593o04934n95627m17252j63498
1919F79805679N7602J79215K01721J73721J52283J66550K04696K27509J99890J10474
1929F81479340j7014j36108k02866j95770j31226n7373l3874j03379k66418m76074
$$ plain form
1859 674113464 674633942 675286331 675950317 676439896 676585693 676324768 675754318 675116882 674714737 674791031
1869 674791031 675427322 676516571 677815628 679055939 680050430 680742950 681187668 681484528 681716080
1878 681716080 681924667 682124023 682322922 682530365 682735672 682891464 682920914 682760620 682411575 681960220
1888 681960220 681548080 681302872 681274185 681414185 681614227 681770248 681834412 681824799 681794891 681793976 681844406
1899 681844406 681944427 682081299 682235336 682371902 682436905 682372437 682154541 681829147 681512070 681341705
1909 681341705 681401062 681657944 681966171 682130814 682009583 681586990 680982056 680386429 679969177 679805679
1919 679805679 679863281 680042496 680244217 680417938 680570221 680736771 680941467 681168976 681368866 681479340
1929 681479340 681462326 681326218 681123352 680927582 680796356 680738983 680705109 680601730 680335312 679859238
1939F79859238o55594p30591o67343m88968k66647q7204j3276n6915j80130l18298
1949F76394272m13895m40826m09851l52097k96402k52380k08054j44272n1574N7068
1959F73881989J50070J92718J67237Q5449j2818p8125p5073M58J16577K21787K68402
1970F74918671K35595J39161K2277o6757r7122p0572j6708K4719K5177j6251p5683
1981F75022507j18408j21842q9264n0812m5776r9487k04544l20969l91846l73459k57949
1992F72948151q0796R3918K02942K10800J26343m654j22986j84478j77231j24359o6834
2003F72820816m2419o4850j21079j78222k03400j81046j21231n5694j9531l5019r9106
2014F71699219j83106k47116k60086k15607j35498n9661k6703n5237j33667k28806
$$ plain form
1939 679859238 679203644 678473053 677805710 677316742 677050095 676962891 676949615 676892700 676712570 676394272
1949 676394272 675980377 675539551 675129700 674777603 674481201 674228821 674020767 673876495 673824921 673881989
1959 673881989 674032059 674224777 674392014 674477463 674464645 674386520 674311447 674311905 674428482 674650269 674918671
1970 674918671 675154266 675293427 675315704 675248947 675151825 675081253 675064545 675089264 675114441 675098190 675022507
1981 675022507 674904099 674782257 674692993 674642181 674596405 674496918 674292374 673971405 673579559 673206100 672948151
1992 672948151 672867355 672961273 673164215 673375015 673501358 673496704 673373718 673189240 673012009 672887650 672820816
2003 672820816 672778397 672713547 672592468 672414246 672210846 672029800 671908569 671852875 671833344 671798325 671699219
2014 671699219 671516113 671268997 671008911 670793304 670657806 670598145 670571442 670516205 670382538 670153732
2024F70153732l00674l22876k93579k35367j83106j66168j97601k68784l58505m41208
2034F67385864m99801n31922n45273n53512n67856n89752o14624o31790o32859o13403
2044F61605072n74188n18494m47082l58735k50778j25198R384J36032K34299K86713
2054F59997025K84805K31552J40152K9297q2092j79749k55585l08990l46375l75976
2064F59134064m09012m48914m94537n39169n75028o00967o22635o51474o97861p62710
2074F53331757q37174r04846r52301r75647r83582r92736j017380j062164j119309
2083F44486618j173706j210175j221847j212082j191597j172981j164093j165772j173782
2092F33800583j179924j179733j172867j163941j160469j166954j183204j202584j215133
$$ plain form
2024 670153732 669853058 669530182 669236603 669001236 668818130 668651962 668454361 668185577 667827072 667385864
2034 667385864 666886063 666354141 665808868 665255356 664687500 664097748 663483124 662851334 662218475 661605072
2044 661605072 661030884 660512390 660065308 659706573 659455795 659330597 659339981 659476013 659710312 659997025
2054 659997025 660281830 660513382 660653534 660682831 660600739 660420990 660165405 659856415 659510040 659134064
2064 659134064 658725052 658276138 657781601 657242432 656667404 656066437 655443802 654792328 654094467 653331757
2074 653331757 652494583 651589737 650637436 649661789 648678207 647685471 646668091 645605927 644486618
2083 644486618 643312912 642102737 640880890 639668808 638477211 637304230 636140137 634974365 633800583
2092 633800583 632620659 631440926 630268059 629104118 627943649 626776695 625593491 624390907 623175774
2101F23175774j213265j196022j170578j149559j143379j154671j175308j190109j182823
2110F12600060j144143j075821r89036q99735q20922p57485p04422o49910n81322m88891
2120F04488373l72849k39601j00174L6240J67579K99607M43382O08254P95517R95597
2130F07121925J191635J365891J509857J626587J731377J841507J966476K102738K231559
2139F22689552K328835K375297K366562K316666K250557K193565K157288K135963K108612
2148F42922897K051773J950837J810073J650925J501389J384430J306991J258164J218338
2157F57055817J167373J098481J018676R45740Q97980Q84552R00116R25598R39255
2166F65833588R23843Q77380Q12226P49206P07550O95877P07016P22504P22961O97480
$$ plain form
2101 623175774 621962509 620766487 619595909 618446350 617302971 616148300 614972992 613782883 612600060
2110 612600060 611455917 610380096 609391060 608491325 607670403 606912918 606208496 605558586 604977264 604488373
2120 604488373 604115524 603875923 603775749 603811989 603979568 604279175 604722557 605330811 606126328 607121925
2130 607121925 608313560 609679451 611189308 612815895 614547272 616388779 618355255 620457993 622689552
2139 622689552 625018387 627393684 629760246 632076912 634327469 636521034 638678322 640814285 642922897
2148 642922897 644974670 646925507 648735580 650386505 651887894 653272324 654579315 655837479 657055817
2157 657055817 658223190 659321671 660340347 661286087 662184067 663068619 663968735 664894333 665833588
2166 665833588 666757431 667634811 668447037 669196243 669903793 670599670 671306686 672029190 672752151 673449631
2176F73449631O49109N92804N47561N24903N23147N28412N21698M89960M32205L61099
2186F78620529K96478K53602K39105K44217K52914K48413K22778J80207J34125R9411
2196F80791779Q4152Q5754R2926R3003P9422N6762L6545L1052M4784P0725R3231R4910
2208F81655045O6833J2512n2719j09253j43051j52054j48468j50833j76620k30027
2218F80571365l00140l65601m02984m02222l68500l23105k91824k91443l21121l63846
2228F77140579l96118m01230l80249l50799l39432l65448m31900n20477o02646o51856
2238F72700424o58874o35224o08673o09588o55671p43789q51975r49554j013947j039428
2248F64933701j040726j044693j075287j142578j236801j332016j398163j413422j372680
$$ plain form
2176 673449631 674098740 674691544 675239105 675764008 676287155 676815567 677337265 677827225 678259430 678620529
2186 678620529 678917007 679170609 679409714 679653931 679906845 680155258 680378036 680558243 680692368 680791779
2196 680791779 680875931 680961685 681054611 681147614 681227036 681283798 681320343 681351395 681396179 681466904 681560135 681655045
2208 681655045 681721878 681734390 681681671 681572418 681429367 681277313 681128845 680978012 680801392 680571365
2218 680571365 680271225 679905624 679502640 679100418 678731918 678408813 678116989 677825546 677504425 677140579
2228 677140579 676744461 676343231 675962982 675612183 675272751 674907303 674475403 673954926 673352280 672700424
2238 672700424 672041550 671406326 670797653 670188065 669532394 668788605 667936630 666987076 665973129 664933701
2248 664933701 663892975 662848282 661772995 660630417 659393616 658061600 656663437 655250015 653877335
2257F53877335j285859j172409j048126r16290p67136n83801l55682r0714J82419M19846
2267F48259583N79452O37054N97001M89044L54538K29187J29928N3482j6479r5215
2277F51217575j89133k92587l92456m78058n45120o00357o56357p25632q13751r12857
2287F45611267j004333j063385j069413j016311r16977p97005o83556n92880n22651
2296F37944756m57345l78799k81944j77994r2010n0774p0763j51596k77443m22477
2306F35583611n57862o58417p06749o98699o47240n82276n46531n82390p18422r55238
2316F28929787j259461j567917j804351j902886j838302j640969j394310j204262j150169
2325F15167160j243782j415558j548347j538124j352616j050377p44896n39207m72298
$$ plain form
2257 653877335 652591476 651419067 650370941 649454651 648687515 648103714 647748032 647657318 647839737 648259583
2267 648259583 648839035 649476089 650073090 650562134 650916672 651145859 651275787 651329269 651312790 651217575
2277 651217575 651028442 650735855 650343399 649865341 649320221 648719864 648063507 647337875 646524124 645611267
2287 645611267 644606934 643543549 642474136 641457825 640540848 639743843 639060287 638467407 637944756
2296 637944756 637487411 637108612 636826668 636648674 636556664 636505890 636435127 636283531 636006088 635583611
2306 635583611 635025749 634367332 633660583 632961884 632314644 631732368 631185837 630603447 629885025 628929787
2316 628929787 627670326 626102409 624298058 622395172 620556870 618915901 617521591 616317329 615167160
2325 615167160 613923378 612507820 610959473 609421349 608068733 607018356 606273460 605734253 605261955
2334F05261955n14946o15616p53860r56764j248703j573334j747208j510048o63871
2343E95677605P64808K449341L842354M392052L793716K142601j01433k312736l963013
2352F06685295m806862m912414m546662m000930l459321k967720k488098j978798j443061
2361E76081429r21135m52958m5585L24554O85616J040458J361466J610031J765480
2370E81449356J841278J878548J922035J997948K103080K212830K294693K322502K281571
2379F00303841K168808J990242J758422J489830J200715R04541O10466L25546N9776
2388F10812187j72272l55796m81949n56908o01196o40488o94084p62825q28171q61473
2398F04857025q38394p51991o18134m71115l50876k88734k95716l61213m57459n53398
$$ plain form
2334 605261955 604747009 604131393 603377533 602420769 601172066 599598732 597851524 596341476 595677605
2343 595677605 596442413 598891754 602734108 607126160 610919876 613062477 612961044 610648308 606685295
2352 606685295 601878433 596966019 592419357 588418427 584959106 581991386 579503288 577524490 576081429
2361 576081429 575160294 574707336 574661751 574986305 575671921 576712379 578073845 579683876 581449356
2370 581449356 583290634 585169182 587091217 589089165 591192245 593405075 595699768 598022270 600303841
2379 600303841 602472649 604462891 606221313 607711143 608911858 609816399 610426865 610752411 610812187
2388 610812187 610639915 610284119 609802170 609245262 608644066 608003578 607309494 606546669 605718498 604857025
2398 604857025 604018631 603266640 602648506 602177391 601826515 601537781 601242065 600880852 600423393 599869995
2408E99869995o26907o73790p07321p47757q09212q90656r74311j034470j052094j022453
2418E91331024r59129q85849q24852p87888p72552p66754p56760p33490o98013o59066
2428E83486671o29158o19163o32134o61773o96183p21206p28836p20711p08466p07702
2438E76661339p30820p80334q47474r17205r75037j014709j039734j060028j085434
2447E68210564j119728j160431j198502j226768j242676j250763j260681j281853j319122
2456E57150040j370240j426353j476860j513672j535225j546554j556359j571655j594353
2465E43558769j619034j635971j635399j611633j565666j502876j430321j351471j265564
2474E29940834j169052j059151r37996q15277p04574o19812n70374n55534n67551n94597
$$ plain form
2408 599869995 599243088 598569298 597861977 597114220 596305008 595414352 594440041 593405571 592353477 591331024
2418 591331024 590371895 589486046 588661194 587873306 587100754 586334000 585577240 584843750 584145737 583486671
2428 583486671 582857513 582238350 581606216 580944443 580248260 579527054 578798218 578077507 577369041 576661339
2438 576661339 575930519 575150185 574302711 573385506 572410469 571395760 570356026 569295998 568210564
2447 568210564 567090836 565930405 564731903 563505135 562262459 561011696 559751015 558469162 557150040
2456 557150040 555779800 554353447 552876587 551362915 549827690 548281136 546724777 545153122 543558769
2465 543558769 541939735 540303764 538668365 537056732 535491066 533988190 532557869 531206398 529940834
2474 529940834 528771782 527712631 526774635 525959358 525254784 524634972 524064598 523509064 522941513 522346916
2484E22346916o26755o60705p00531p53555q25234r14268j012345j107025j188965
2493E14557533j255760j314316j375961j450272j539344j634980j722793j788864j825333
2502E00649910j834526j824608j805038j780320j746902j695633j616936j506424j366958
2511D85472565j208649j044540q85468p37991o02913m76723l56140k40021j31416l8185
2521D79750519K9335O1264N3100Q431o0387j35879k00234k42462k59971k59057k46925
2532D78497734k28653k02217j60942r9106j6823P6638J67198K39677K85912L05824
2542D78865242L05862K93580K71034K34566J76506R0599k1744j51024k81105l96156
2552D79387360m86794n53551o06536o59218p22733q00400q86573r70765j043892j103248
$$ plain form
2484 522346916 521720161 521059456 520358925 519605370 518780136 517865868 516853523 515746498 514557533
2493 514557533 513301773 511987457 510611496 509161224 507621880 505986900 504264107 502475243 500649910
2502 500649910 498815384 496990776 495185738 493405418 491658516 489962883 488345947 486839523 485472565
2511 485472565 484263916 483219376 482333908 481595917 480993004 480516281 480160141 479920120 479788704 479750519
2521 479750519 479779854 479841118 479894218 479902649 479842262 479706383 479506149 479263687 479003716 478744659 478497734
2532 478497734 478269081 478066864 477905922 477806816 477789993 477866631 478033829 478273506 478559418 478865242
2542 478865242 479171104 479464684 479735718 479970284 480146790 480237389 480215645 480064621 479783516 479387360
2552 479387360 478900566 478347015 477740479 477081261 476358528 475558128 474671555 473700790 472656898 471553650
2562D71553650j154900j210823j282539j374741j483116j595459j697922j780777j843681
2571D58129692j893959j943245k001305k070503k146530k219582k279281k320137k342491
2580D38912659k352372k358245k366372k378082k389641k393188k380486k346649k289848
2589D17657776k212639k118111k008781j884956j746331j591835j422844j242332j053925
2598D02376022q59337o57958m44489k14005L6545L03040N73082Q27331J044350J206856
2608D04191437J308212J354179J360627J347999J333733J327438J329842J336021J339646
2617D16229134J339035J337013J340294J352958J374741J399384J416092J416931J400261
2626D28605843J373901J352882J353531J386223J449661J531678J614341J682091J729012
$$ plain form
2562 471553650 470398750 469187927 467905388 466530647 465047531 463452072 461754150 459973373 458129692
2571 458129692 456235733 454292488 452291183 450220680 448074150 445854568 443575287 441255150 438912659
2580 438912659 436560287 434202042 431835670 429457588 427067947 424674759 422294273 419947624 417657776
2589 417657776 415445137 413327026 411318245 409433289 407686958 406095123 404672279 403429947 402376022
2598 402376022 401516685 400858727 400414238 400200233 400236778 400539818 401112900 401940231 402984581 404191437
2608 404191437 405499649 406853828 408214455 409562454 410896187 412223625 413553467 414889488 416229134
2617 416229134 417568169 418905182 420245476 421598434 422973175 424372559 425788651 427205582 428605843
2626 428605843 429979744 431332626 432686157 434072380 435522041 437053719 438668060 440350151 442079163
2635D42079163J761055J792564J837082J900902J978531K055053K114792K146759K150116
2644D59816017K133141K106170K076760K044868K002678J940041J848640J726837J580849
2653D77276001J420822J258469J100197R47151P94563O36444M71726L04527J45569
2662D84355469N913j07728j96495k70423l42064m21868n12848o10275p05109p89260
2672D80405312q60482r22317r82819j049690j126900j213722j304817j393318j473847
2681D70077400j544494j607628j668206j731414j800728j874275j946717k011261k062225
2690D53830452k099037k126312k151337k181015k217636k258110k294693k319641k327881
2699D33854790k318459k293854k257690k210197k149849k073479j979523j871223j756325
$$ plain form
2635 442079163 443840218 445632782 447469864 449370766 451349297 453404350 455519142 457665901 459816017
2644 459816017 461949158 464055328 466132088 468176956 470179634 472119675 473968315 475695152 477276001
2653 477276001 478696823 479955292 481055489 482002640 482797203 483433647 483905373 484209900 484355469
2662 484355469 484361382 484253654 484057159 483786736 483444672 483022804 482509956 481899681 481194572 480405312
2672 480405312 479544830 478622513 477639694 476590004 475463104 474249382 472944565 471551247 470077400
2681 470077400 468532906 466925278 465257072 463525658 461724930 459850655 457903938 455892677 453830452
2690 453830452 451731415 449605103 447453766 445272751 443055115 440797005 438502312 436182671 433854790
2699 433854790 431536331 429242477 426984787 424774590 422624741 420551262 418571739 416700516 414944191
2708D14944191j645660j549492j473046j416778j375389j343422j316643j294823j280021
2717D02248917j274910j278878j286773j290627j281357j253280j204300j138001j059913
2726C91180878r75724q89015q00705p09419o14014n15022m14200l15666k21558j32942
2736C85592613m7569L7537J25732K17247L12080M07677N02396N95245O84357P67441
2746C89194756Q38813Q92945R24110R30672R15184Q83331Q40530P90596P34101O69517
2756C97614555N96428N15099M29306L43094K60887J85470J19439O4010K0447j2054
2766D00136681l6164n6686q0452j11351j51215j97220k44140k88315l28941l69645
2776C98272552m15916m71077n33676n96085o48231o80924o90956o81724o63033o44569
$$ plain form
2708 414944191 413298531 411749039 410275993 408859215 407483826 406140404 404823761 403528938 402248917
2717 402248917 400974007 399695129 398408356 397117729 395836372 394583092 393378792 392240791 391180878
2726 391180878 390205154 389316139 388515434 387806015 387192001 386676979 386262779 385947113 385725555 385592613
2736 385592613 385545044 385582581 385708313 385925560 386237640 386645317 387147713 387742958 388427315 389194756
2746 389194756 390033569 390926514 391850624 392781296 393696480 394579811 395420341 396210937 396945038 397614555
2756 397614555 398210983 398726082 399155388 399498482 399759369 399944839 400064278 400128288 400148735 400136681
2766 400136681 400100517 400043831 399963379 399852028 399700813 399503593 399259453 398971138 398642197 398272552
2776 398272552 397856636 397385559 396851883 396255798 395607567 394926643 394235687 393553963 392890930 392246361
2786C92246361o33240o29578o29234o27098o19850o09131n98831n94330n97267o06384
2796C86101418o17333o25191o26869o21605o11839n99938n87539n74913n58892n35736
2806C80141563n00717m50363l84521l05291k19421j33018n1651K2583R2430J61857
2816C78373451K33994L08227L77922M33846M66957M73862M57687M27284L92647L60794
2826C82306671L32565L04871K74010K38724K02484J70250J43585J19552Q9302M2954
2836C84224968k4223j10245k05879k99874l83300m53759n14488n71556o29387o89278
2846C80342979p47947p99637q37822q57048q53958q28095p83233p26319o65931o10238
2856C72632751n63240n25055m93507m66194m43077m26903m20341m23546m33083m42581
$$ plain form
2786 392246361 391613121 390983543 390354309 389727211 389107361 388498230 387899399 387305069 386707802 386101418
2796 386101418 385484085 384858894 384232025 383610420 382998581 382398643 381811104 381236191 380677299 380141563
2806 380141563 379640846 379190483 378805962 378500671 378281250 378148232 378096581 378119164 378211594 378373451
2816 378373451 378607445 378915672 379293594 379727440 380194397 380668259 381125946 381553230 381945877 382306671
2826 382306671 382639236 382944107 383218117 383456841 383659325 383829575 383973160 384092712 384182014 384224968
2836 384224968 384200745 384090500 383884621 383584747 383201447 382747688 382233200 381661644 381032257 380342979
2846 380342979 379595032 378795395 377957573 377100525 376246567 375418472 374635239 373908920 373242989 372632751
2856 372632751 372069511 371544456 371050949 370584755 370141678 369714775 369294434 368870888 368437805 367995224
2866C67995224m47006m45976m43917m48875m67301n00183n41305n78537o00243n97534
2876C62924347n70297n24292m68674m12140l59840l12043k67791k26174j89705j63688
2886C59429703j52970j60255j82343k11601k38609k57759k68708k78930k98271l36113
2896C57044144l95241m70734n51719o27060o89164p38220p79800q22220q70400r24072
2906C50175514r79652j030884j075134j113396j147079j176682j198540j205291j189766
2915C40059090j148301j082992j000557r08966q14934p20329o25038n27764m28123
2924C32802086l27225k27661j31989m2839L8071J10893J76773K37847K98004L59421
2934C33293381M23012M87976N52063O12754O67382P12166P41233P46689P21970O64062
$$ plain form
2866 367995224 367548218 367102242 366658325 366209450 365742149 365241966 364700661 364122124 363521881 362924347
2876 362924347 362354050 361829758 361361084 360948944 360589104 360277061 360009270 359783096 359593391 359429703
2886 359429703 359276733 359116478 358934135 358722534 358483925 358226166 357957458 357678528 357380257 357044144
2896 357044144 356648903 356178169 355626450 354999390 354310226 353572006 352792206 351969986 351099586 350175514
2906 350175514 349195862 348164978 347089844 345976448 344829369 343652687 342454147 341248856 340059090
2915 340059090 338910789 337827797 336827240 335918274 335103340 334383011 333757973 333230209 332802086
2924 332802086 332474861 332247200 332115211 332072372 332110443 332221336 332398109 332635956 332933960 333293381
2934 333293381 333716393 334204369 334756432 335369186 336036568 336748734 337489967 338236656 338958626 339622688
2944C39622688N77965M78668L87802L29781L24669L81126M91143O29692P58628Q35953
2954C44818115Q27332P14950N02510K09351j35574n04265q71735j212616j497192j690102
2964C41160774j756782j677208j456261j128540p51190l90091j06468N2986N9967r4605
2974C33912582l97033q10662j277008j726074k092819k329865k412872k334747k093449
2983C18438053j689567j131669m55360K63538R16176J386185J589165J503334J172981
2992C21992836O86989J41678l88146q56476j232681j485519j576557j475659j185207
3001C14621258p56989k87285J14556L62453M24195L25431J28689r8076l05767m74949
3011C14053516o09016p18212q10776q87775r48353r93767j029091j060657j091862
$$ plain form
2944 339622688 340200653 340679321 341067123 341396904 341721573 342102699 342593842 343223534 343982162 344818115
2954 344818115 345645447 346360397 346862907 347072258 346936684 346432419 345560684 344348068 342850876 341160774
2964 341160774 339403992 337726784 336270523 335141983 334390793 334000702 333894234 333947220 334007187 333912582
2974 333912582 333515549 332704887 331427879 329701805 327608986 325279121 322866249 320531502 318438053
2983 318438053 316748486 315616817 315161457 315424995 316341171 317727356 319316521 320819855 321992836
2992 321992836 322679825 322821503 322433357 321576881 320344200 318858681 317282124 315806465 314621258
3001 314621258 313864269 313576984 313691540 314053993 314478188 314803619 314932308 314834232 314528465 314053516
3011 314053516 313444500 312726288 311915512 311027737 310079384 309085617 308056526 306995869 305904007
3020C05904007j120930j142883j152840j149654j136837j119881j103534j089306j074086
3029B95814056j054267j025982r88369r43833q96187q50219q08316p70435p35283p01237
3039B87039928o67629o36120o08024n83840n61027n36289n07889m77696m53109m42105
3049B81566200m50992m79813n22995n71690o20346o67114p15942p71294q34217r00402
3059B75031395r62009j010819j043282j061515j071911j081085j092549j104660j110229
3068B65493336j101113j070461j016064r42363q58059p73449o94428o21280n47085
3077B57869034m62437l60279k40593j10321K0638J43318K54669L56426M52480N45731
3087B58468666O35395P18250P92237Q56952R14097R66187J012993J053218J085186
$$ plain form
3020 305904007 304783077 303640194 302487354 301337700 300200863 299080982 297977448 296888142 295814056
3029 295814056 294759789 293733807 292745438 291801605 290905418 290055199 289246883 288476448 287741165 287039928
3039 287039928 286372299 285736179 285128155 284544315 283983288 283446999 282939110 282461414 282008305 281566200
3049 281566200 281115208 280635395 280112400 279540710 278920364 278253250 277537308 276766014 275931797 275031395
3059 275031395 274069386 273058567 272015285 270953770 269881859 268800774 267708225 266603565 265493336
3068 265493336 264392223 263321762 262305698 261363335 260505276 259731827 259037399 258416119 257869034
3077 257869034 257406597 257046318 256805725 256695404 256716042 256859360 257114029 257470455 257922935 258468666
3087 258468666 259104061 259822311 260614548 261471500 262385597 263351784 264364777 265417995 266503181
3096B66503181J109353J129036J148605J171169J196327J220894J241875J257629J270829
3105B77248898J285820J307048J335774J370888J407947J443482J475753J504860J532879
3114B89913349J560841J587829J611500J628361J637401J640816J644020J654454J676864
3123C04555435J710777J749650J783561J803360J806298J796474J784592J781883J796017
3132C20568047J826667J867066J907005J938210J958427J971054J983414K002144K029457
3141C38051491K061920K091865K111207K115135K104988K086181K065773K048531K034645
3150C56771736K020531K000389J970367J930046J881752J830025J779862J733398J692123
3159C73610229J654664J619072J583747J548081J514282J485977J467095J459846J462059
$$ plain form
3096 266503181 267612534 268741570 269890175 271061344 272257671 273478565 274720440 275978069 277248898
3105 277248898 278534718 279841766 281177540 282548428 283956375 285399857 286875610 288380470 289913349
3114 289913349 291474190 293062019 294673519 296301880 297939281 299580097 301224117 302878571 304555435
3123 304555435 306266212 308015862 309799423 311602783 313409081 315205555 316990147 318772030 320568047
3132 320568047 322394714 324261780 326168785 328106995 330065422 332036476 334019890 336022034 338051491
3141 338051491 340113411 342205276 344316483 346431618 348536606 350622787 352688560 354737091 356771736
3150 356771736 358792267 360792656 362763023 364693069 366574821 368404846 370184708 371918106 373610229
3159 373610229 375264893 376883965 378467712 380015793 381530075 383016052 384483147 385942993 387405052
3168C87405052J467743J468926J459846J440239J415558J394386J384201J386452J397476
3177D00219879J409531J415367J412887J404801J398048J398583J409225J425858J442070
3186D12936249J449051J441993J421204J391449J360092J333809J315041J303291J295242
3195D25247421J288338J281128J273765J265984J257286J245155J228409J208115J186790
3204D36482391J169205J158066J153450J152992J151886J146278J133347J112137J083717
3213D46743469J050987J019822R97276R89723R99832J022950J048584J063385J057891
3222D55993919J030884R91478R53598R29909R25484R34867R47114R50431R39904R18693
3232D65516281Q96149Q82149Q80508Q87299Q93287Q88672Q69637Q40530Q11577P95135
$$ plain form
3168 387405052 388872795 390341721 391801567 393241806 394657364 396051750 397435951 398822403 400219879
3177 400219879 401629410 403044777 404457664 405862465 407260513 408659096 410068321 411494179 412936249
3186 412936249 414385300 415827293 417248497 418639946 420000038 421333847 422648888 423952179 425247421
3195 425247421 426535759 427816887 429090652 430356636 431613922 432859077 434087486 435295601 436482391
3204 436482391 437651596 438809662 439963112 441116104 442267990 443414268 444547615 445659752 446743469
3213 446743469 447794456 448814278 449811554 450801277 451801109 452824059 453872643 454936028 455993919
3222 455993919 457024803 458016281 458969879 459899788 460825272 461760139 462707253 463657684 464597588 465516281
3232 465516281 466412430 467294579 468175087 469062386 469955673 470844345 471713982 472554512 473366089 474161224
3242D74161224P96738Q13751Q36144Q49800Q45604Q21075P82624P41729P09725O93283
3252D82051697O92825P03087P15370P21245P15599O97784O71273O43768O21948O10771
3262D88845367O09322O12907O13709O04286N81436N46799N06744M69361M42085M28810
3272D94260826M29382M38767M50897M59023M58603M48570M30336M07295L82919L60909
3282D98527527L42445L27873L16163L04527K90871K75077K58789K47345K44255K51427
3292E01386299K64626K75001K74201K58407K31705K04239J85890J80702J84174J84936
3302E03630180J72577J43700J03760O3743L4333J9149J4611J2016K785j6976m6081
3313E04133797p9613j11351j37596j56975j71127j84784k02751k28691k62223k99835
$$ plain form
3242 474161224 474957962 475771713 476607857 477457657 478303261 479124336 479906960 480648689 481358414 482051697
3252 482051697 482744522 483447609 484162979 484884224 485599823 486297607 486968880 487612648 488234596 488845367
3262 488845367 489454689 490067596 490681305 491285591 491867027 492413826 492920570 493389931 493832016 494260826
3272 494260826 494690208 495128975 495579872 496038895 496497498 496946068 497376404 497783699 498166618 498527527
3282 498527527 498869972 499197845 499514008 499818535 500109406 500384483 500643272 500890617 501134872 501386299
3292 501386299 501650925 501925926 502200127 502458534 502690239 502894478 503080368 503261070 503445244 503630180
3302 503630180 503802757 503946457 504050217 504113960 504148293 504167442 504182053 504194069 504196854 504179878 504133797
3313 504133797 504054184 503942833 503805237 503648262 503477135 503292351 503089600 502860909 502598686 502298851
3323E02298851l35083l61977l79791l92341m07601m32739m69513n11665n48897n69878
3333D97889366n69458n51834n29366n17387n27992n64842o20499o81381p32575p64694
3343D91829338p76787p75795p71904p73964p86628q08869q36792q65288q89663r06716
3353D83636932r15870r18999r21478r29871r48982r78241j010666j035385j042709
3362D74934731j029664j001930r71031r47762r39140r44137r58672r75876r91325j001930
3372D65173264j004105r95636r75418r47228r18426q97217q87871q87184q85010q70247
3382D55904922q37211p89642p39975p02630o88285o96564p19071p40776p48291p34062
3392D48508415o98166o48803n97268n55496n31120n26619n38902n60074n80483n91125
$$ plain form
3323 502298851 501963768 501601791 501222000 500829659 500422058 499989319 499519806 499008141 498459244 497889366
3333 497889366 497319908 496768074 496238708 495721321 495193329 494628487 494007988 493326607 492594032 491829338
3343 491829338 491052551 490276756 489504852 488730888 487944260 487135391 486298599 485433311 484543648 483636932
3353 483636932 482721062 481802063 480880585 479950714 479001732 478023491 477012825 475977440 474934731
3362 474934731 473905067 472903137 471932106 470984344 470045204 469101067 468142395 467166519 466175194 465173264
3372 465173264 464169159 463173523 462198105 461250877 460332451 459435234 458547363 457660179 456775169 455904922
3382 455904922 455067711 454278069 453538094 452835464 452147179 451450615 450731544 449990768 449242477 448508415
3392 448508415 447810249 447161446 446564178 446008682 445477562 444950943 444412041 443851967 443271484 442680359
3402D42680359n85594n63126n27954m89388m56352m35371m26293m23088m18167m07486
3412D37947540l93600l84407l85704l96538m06380l99093l63541k99225k18887j41754
3422D34558411q4114n2681m2763m3526m3602l5553j6556J2932M9401Q6479J16539J31950
3434D34636917J31073J19934J10245J12343J27830J48468J61133J59416J50910J55067
3444D36013336J92986K72484L80439M87366N61485N86014N66063N25246M90036M76646
3454D40552101M84772N01747N12810N12047N05409N04913N22690N62477O18668O78749
3464D45956383P27691P52488P45925P09229O52618N95169N58434N57976N93261O45867
3474D52495041O85921O88133O47430N83039N30624N20134N59044O27327O90803P22084
$$ plain form
3402 442680359 442094765 441531639 441003685 440514297 440057945 439622574 439196281 438773193 438355026 437947540
3412 437947540 437553940 437169533 436783829 436387291 435980911 435581818 435218277 434919052 434700165 434558411
3422 434558411 434474297 434421616 434378853 434335327 434291725 434256172 434239616 434252548 434301949 434388428 434504967 434636917
3434 434636917 434767990 434887924 434998169 435110512 435238342 435386810 435547943 435707359 435858269 436013336
3444 436013336 436206322 436478806 436859245 437346611 437908096 438494110 439060173 439585419 440075455 440552101
3454 440552101 441036873 441538620 442051430 442563477 443068886 443573799 444096489 444658966 445277634 445956383
3464 445956383 446684074 447436562 448182487 448891716 449544334 450139503 450697937 451255913 451849174 452495041
3474 452495041 453180962 453869095 454516525 455099564 455630188 456150322 456709366 457336693 458027496 458749580
3484D58749580P18384O98853O89392P02553P29980P52068P55691P46041P42912P60460
3494D66045914P91244Q05512P72438O84509N70908M84886M72259N41191O57120P63436
3504D72589417Q16116Q08983P74650P58133P88727Q62427R48906J012993J034431J015434
3514D81410217R72138R21211Q69484Q15239P53555O83594O11267N46913N04608M99497
3524D88587723N45311O48269P98798R68399J113358J191063J181907J101952J002311
3533D97139091R46389R77630J091156J228867J302719J238899J023178P18079M39682
3542E06105690L03230L62282N79224Q46176J046486J119995J092110J046524J063003
3551E13564720J162682J299209J401711J433754J420059J417084J446266J447258J297226
$$ plain form
3484 458749580 459467964 460166817 460856209 461558762 462288742 463040810 463796501 464542542 465285454 466045914
3494 466045914 466837158 467642670 468415108 469099617 469670525 470155411 470627670 471168861 471825981 472589417
3504 472589417 473405533 474214516 474989166 475747299 476536026 477398453 478347359 479360352 480394783 481410217
3514 481410217 482382355 483303566 484173050 484988289 485741844 486425438 487036705 487583618 488088226 488587723
3524 488587723 489133034 489781303 490580101 491548500 492661858 493852921 495034828 496136780 497139091
3533 497139091 498085480 499063110 500154266 501383133 502685852 503924751 504947929 505666008 506105690
3542 506105690 506408920 506771202 507350426 508196602 509243088 510363083 511455193 512501717 513564720
3551 513564720 514727402 516026611 517428322 518862076 520282135 521699219 523145485 524592743 525889969
3560E25889969Q95767K63748m16221q64373q39386k77061O62842J665611K409325K707557
3570E32097778K567826K151641J675072J315003J163978J233750J473617J781311K010956
3579E47470932K002716J646767R61036J28594n50041p86476m53187L37792J275711
3588E52033844K003670K289161K120896J683998J234550R64547R31282J078796J314354
3597E65655098J571007J818695K025757K125549K026749J670570J094666M52079m2572
3606E78397598k05803K7695N73769J233558J765519J966094J733666J112518L10288
3615E86914902l35846m63104J49841J420669K906342L933105L891640K567673L18909
3624F01304131k030488l553009l655471k355271k39830J852608L241158L672981L331489
$$ plain form
3560 525889969 526785736 527049484 526633263 525768890 524929504 524652443 525315285 526980896 529390221 532097778
3570 532097778 534665604 536817245 538492317 539807320 540971298 542205048 543678665 545459976 547470932
3579 547470932 549473648 551120415 552081451 552210045 551660004 550873528 550420341 550758133 552033844
3588 552033844 554037514 556326675 558447571 560131569 561366119 562330666 563261948 564340744 565655098
3597 565655098 567226105 569044800 571070557 573196106 575222855 576893425 577988091 578440170 578397598
3606 578397598 578191795 578219490 578793259 580026817 581792336 583758430 585492096 586604614 586914902
3615 586914902 586579056 586115952 586265793 587686462 590592804 594525909 598417549 600985222 601304131
3624 601304131 599273643 595720634 592065163 589709892 589470062 591322670 594563828 598236809 601568298
3633F01568298K634163J980324J599541J545639J763420K132187K453880K441292J797333
3642F19916077L87954j577186l520127m696044m556504l064308p59811J486663K902375
3651F06519089L170852K525101J545334Q13866O43043J004753J651955K295608K718583
3660F22888184K790489K440910J663208N60341o27098j583519k069283k069320j820412
3669F22173500j672630j850815k281571k609024k400436j418381K20719K092933L676949
3678F15931244M584122M671287M004173K742691J068535q03604k567673l824920m195404
3687F21610451l499565j896096J35727J981507L144111L424835K938767J989555R04427
3696F30733719o3706p38411r85183p18498K5672J008225J798439J929131J140136m28352
$$ plain form
3633 601568298 604202461 606182785 607782326 609327965 611091385 613223572 615677452 618118744 619916077
3642 619916077 620304031 618726845 615206718 610510674 605954170 602889862 602130051 603616714 606519089
3651 606519089 609689941 612215042 613760376 614574242 615217285 616222038 617873993 620169601 622888184
3660 622888184 625678673 628119583 629782791 630343132 629716034 628132515 626063232 623993912 622173500
3669 622173500 620500870 618650055 616368484 613759460 611359024 609940643 610161362 612254295 615931244
3678 615931244 620515366 625186653 629190826 631933517 633002052 632198448 629630775 625805855 621610451
3687 621610451 618110886 616214790 616350517 618332024 621476135 624900970 627839737 629829292 630733719
3696 630733719 630670013 629931602 628946419 628227921 628253593 629261818 631060257 632989388 634129524 633701172
3706F33701172k231636l538933l772697k785721r27162J133194K713203L394051L133583
3715F30819054K197456R83467j47400r63363j365357j351089r76105l39661M16832
3724F29273834J112900J544228J517601R03282k90146j844750l317756m131813l792229
3733F20975151k156372L88260K980003M611321M602051K966232M44946j853027l024979
3742F29933586k837219j800194q09746n73120j175308k053680k386437j639519P7858
3751F16736221K066498L452301L692551K857628J540641M76838J26571M70925J101570
3760F32521744J511879J387214P35512j77193r98458j452637j415787r13315q2893
3769F31116066Q57277J639442K007332J807556J080590P9078q19511j282654j185226
$$ plain form
3706 633701172 631469536 627930603 624157906 621372185 620445023 621578217 624291420 627685471 630819054
3715 630819054 633016510 633999977 633852577 632889214 631523857 630172768 629196663 628857002 629273834
3724 629273834 630386734 631930962 633448563 634351845 634061699 632216949 628899193 624767380 620975151
3733 620975151 618818779 619207039 622187042 626798363 631400414 634366646 634811592 632958565 629933586
3742 629933586 627096367 625296173 624486427 623913307 622737999 620684319 618297882 616658363 616736221
3751 616736221 618802719 622255020 625947571 628805199 630345840 630822678 630949249 631420174 632521744
3760 632521744 634033623 635420837 636156349 635979156 634980698 633528061 632112274 631198959 631116066
3769 631116066 631973343 633612785 635620117 637427673 638508263 638587341 637767830 636485176 635299950
3778F35299950o63796l1128M09584N26657M11683K85339L33519N83343R00040J094933
3788F39150124J063118Q45108N73425L49731J51368j49537o70471j384697k085685
3797F37842484k490273k415237j907540j221428o48308l16047j00479K72140R97505
3806F30012817J996766K901000L242226K738609J481400j00403j476364k298851k546921
3815F35950279k452583k274475k093735j773186j105270k7618J254425K339439K850876
3824F32668152K659378J959724J145516N67512L30620K54402K1019n94139j551704
3833F37460480k543526l156128l096695k349434j169739P5722J118508J917190K616005
3842F30872383L357697M068451M375801L747177J811981j306839m863968p690658q671990
$$ plain form
3778 635299950 634636154 634605026 635014610 635541267 635952950 636238289 636571808 637155151 638055191 639150124
3788 639150124 640213242 641058350 641631775 641981506 642132874 641983337 641312866 639928169 637842484
3797 637842484 635352211 632936974 631029434 629808006 629159698 628843651 628743172 629015312 630012817
3806 630012817 632009583 634910583 638152809 640891418 642372818 642272415 640796051 638497200 635950279
3815 635950279 633497696 631223221 629129486 627356300 626251030 626223412 627477837 629817276 632668152
3824 632668152 635327530 637287254 638432770 639000282 639330902 639585304 639606323 639012184 637460480
3833 637460480 634916954 631760826 628664131 626314697 625144958 625220680 626339188 628256378 630872383
3842 630872383 634230080 638298531 642674332 646421509 648233490 646926651 642062683 634372025 625700035
3851F25700035p276192l860283M32587M149933O152535O066932M362068K031365P8430
3860F37837410r22318r89112n79911k56958l65486q86268j500969j805954j537400
3869F28993034p02400M36707J495018K138290K214050J784707J063194K98385l26004
3878F37394981p30819r15413r07669p35016m37203r4795J69754K46163J18980q6937
3888F34022026j49231J21079P37495J480522J980133J898995J118774j87302j628875
3897F39393616k773438l319168l177147k450447j349335j10359J051445J960411K496491
3906F31722069K614250K353935J821785J144791M27551k58942q50944j267281j416320
3915F36290894j250153q19244k81220J69563M01497M18625L38440K94457L32145L79067
$$ plain form
3851 625700035 618423843 614563560 614996147 619146080 625298615 631365547 635727615 637758980 637837410
3860 637837410 636915092 635925980 635346069 635089111 634723625 633837357 632336388 630530434 628993034
3869 628993034 628290634 628727341 630222359 632360649 634574699 636359406 637422600 637720985 637394981
3878 637394981 636664162 635748749 634841080 634106064 633668861 633574066 633743820 633989983 634108963 634022026
3888 634022026 633872795 633993874 634731369 636211891 638192024 640091019 641209793 641022491 639393616
3897 639393616 636620178 633301010 630123863 627673416 626324081 626213722 627265167 629225578 631722069
3906 631722069 634336319 636690254 638512039 639656830 640084381 639825439 638974495 637707214 636290894
3915 636290894 635040741 634221497 633940277 634109840 634511337 634929962 635268402 635562859 635895004 636274071
3925F36274071L09219N8632l04527o03447o58722m02680P7668N87501R27353R83086
3935F37248154P58819L53966q8005m30718n84564n33371l43017j36299l2883p9270
3945F36132812k16865l17383k71530o9313J89133L63807L74108K48108Q7776k1744
3955F36498909p3929j24397k16446l19901l47137k39410l7346J30233J46065O485j71394
3966F35251732k49329j93863j09748j39809l17841n11741n28145k99683J7739J48239
3976F33067551o5041m92134p91321p01256l03306j641j84822q39233j472893j503143
3986F26712761q31947r9678k72446j774902l854104m884071l677559j025047k36168
3995F10056839n891113k1158219m5174522p2247543r3748017
$$ plain form
3925 636274071 636583290 636641922 636337395 635733948 635075226 634672546 634750214 635337715 636265068 637248154
3935 637248154 638006973 638360939 638272934 637842216 637257652 636724281 636381264 636244965 636212082 636132812
3945 636132812 635915947 635598564 635327034 635257721 635446854 635810661 636184769 636432877 636520653 636498909
3955 636498909 636424980 636300583 636084137 635764236 635417099 635177689 635140343 635270576 635416641 635423126 635251732
3966 635251732 635002403 634808540 634698792 634558983 634241142 633729401 633201256 632901573 632919312 633067551
3976 633067551 633002510 632510376 631719055 631017799 630714493 630712852 630528030 629688797 628215904 626712761
3986 626712761 625880814 625781136 625508690 623733788 619879684 614995613 611318054 610293007 610056839
3995 610056839 604165726 583007507 537832985 465585442 371837425
4000C71837425
$$ plain form
4000 371837425
##END=$$ End of the data block
