##TITLE=$$ Begin of the data block
##JCAMP-DX=5.00 $$ ACD/SpecManager v 10.08
##SPECTROMETER/DATA SYSTEM=16PC
##DATE=21 May 2013 13:59:02
##DATA TYPE=INFRARED SPECTRUM
##DATA CLASS=XYDATA
##ORIGIN=
##OWNER=
##NPOINTS=3601
##FIRSTX=400.00000000
##LASTX=4000.00000000
##MAXX=4000.00000000
##MINX=400.00000000
##MAXY=75.44161987
##MINY=13.50979233
##XFACTOR=1.0000000000
##YFACTOR=0.000000100000000
##FIRSTY=30.44946480
##DELTAX=1.00000000
##XUNITS=1/CM
##YUNITS=TRANSMITTANCE
##XYDATA=(X++(Y..Y))
400C04494648P3400631N4251671L0617828R699860l666878q583603p508278m177475
$$ 304494648 377895279 432146950 462764778 472464638 468797760 460214157 452705879 448528404
408D48528404j424598j03569N49697J708565L880310O628800R076652J0638237J1385765
$$ 448528404 447103806 447000237 447549934 449258499 453138809 459767609 468844261 479482498 490868263
417D90868263J1847573J2488250J3327294J3970680J3972855J3205909J1952820J0683861
$$ 490868263 502715836 515204086 528531380 542502060 556474915 569680824 581633644 592317505
425E92317505R730415R106636Q590927P958146P163848O343537N666427N181275M787521
$$ 592317505 602047920 611154556 619745483 627703629 634867477 641211014 646877441 652058716 656846237
434F56846237M335327L759156L128967K587280K231751K045669J922989J754685J505889
$$ 656846237 661181564 664940720 668069687 670656967 672888718 674934387 676857376 678612061 680117950
443F80117950J222229R77784Q13293P12586O26678N09491L38974J09863j75400n02548
$$ 680117950 681340179 682317963 683131256 683843842 684470520 684980011 685318985 685428848 685253448 684750900
453F84750900q29010j083221j193619j137466r72672q19168p94754r45587j221161
$$ 684750900 683921890 682838669 681645050 680507584 679534912 678715744 677920990 676975403 675754242
462F75754242j511307j719513j819381j857300j903687j995773k112732k198715k210236
$$ 675754242 674242935 672523422 670704041 668846741 666943054 664947281 662834549 660635834 658425598
471F58425598k151413k070312k027283k056732k154694k292251k438813k583236k729874
$$ 658425598 656274185 654203873 652176590 650119858 647965164 645672913 643234100 640650864 637920990
480F37920990k891426l074494l274726l479119l669586l826866l935623l990555l997116
$$ 637920990 635029564 631955070 628680344 625201225 621531639 617704773 613769150 609778595 605781479
489F05781479l965569l897705l772278l548851l183593k659378k001648j273384n46380
$$ 605781479 601815910 597918205 594145927 590597076 587413483 584754105 582752457 581479073 580932693
498E80932693J29662P40814J294403J793251K213517K510490K640343K589683K381706
$$ 580932693 581062355 581803169 583097572 584890823 587104340 589614830 592255173 594844856 597226562
507E97226562K064095J680794J254539P85828K71263k80304q41446j375961j856613
$$ 597226562 599290657 600971451 602225990 603011818 603283081 603002777 602161331 600785370 598928757
516E98928757k275467k644997k988586l328972l681717m051285m434090m822006n208702
$$ 598928757 596653290 594008293 591019707 587690735 584009018 579957733 575523643 570701637 565492935
525E65492935n596199n998268o436234o929359p484016q089142q726502r385223j0070839
$$ 565492935 559896736 553898468 547462234 540532875 533048859 524959717 516233215 506847992 496777153
534D96777153j0796776j1552696j2270355j2801132j2926445j2405320j1039505q737831
$$ 496777153 485980377 474427681 462157326 449356194 436429749 424024429 412984924 404247093
542D04247093n558624j710892K474671O606216J0303421J3265495J5319481J6437874
$$ 404247093 398688469 396977577 399452248 406058464 416361885 429627380 444946861 461384735
550D61384735J6719246J6344032J5521393J4444466J3266067J2090683J0979767R959526
$$ 461384735 478103981 494448013 509969406 524413872 537679939 549770622 560750389 570709915
558E70709915R029198Q173485P376785O636238N967407N396881M944687M609337M362831
$$ 570709915 579739113 587912598 595289383 601925621 607893028 613289909 618234596 622843933 627206764
567F27206764M163017L973732L779488L589096L422775L295441L204575L130188L046875
$$ 627206764 631369781 635343513 639123001 642712097 646134872 649430313 652634888 655765076 658811951
576F58811951K938080K805328K670288K565536K520142K543259K614822K685013K691040
$$ 658811951 661750031 664555359 667225647 669791183 672311325 674854584 677469406 680154419 682845459
585F82845459K583008K350998K036209J718902J486741J394805J444321J585159J743775
$$ 682845459 685428467 687779465 689815674 691534576 693021317 694416122 695860443 697445602 699189377
594F99189377J860504J910095J903076J865311J813355J744155J639862J486359J290283
$$ 699189377 701049881 702959976 704863052 706728363 708541718 710285873 711925735 713412094 714702377
603G14702377J079712Q92411P53402O59104N76477M58755K70691Q011k97775n94559
$$ 714702377 715782089 716674500 717427902 718087006 718663483 719122238 719392929 719400940 719103165 718508606
613G18508606q36029j004639j119461j222610j353913j528473j731033j931305k110596
$$ 718508606 717672577 716667938 715548477 714325867 712971954 711443481 709712448 707781143 705670547
622G05670547k280883k483292k768021l164062l661194m214401m769745n294113n794678
$$ 705670547 703389664 700906372 698138351 694974289 691313095 687098694 682328949 677034836 671240158
631F71240158o312561o899872p589569q380890r244652j0140647j1034813j1888047
$$ 671240158 664927597 658027725 650438156 642057266 632812614 622671967 611637154 599749107
639E99749107j2622070j3073845j2976913j2000199r854622o434326j928062L167343
$$ 599749107 587127037 574053192 561076279 549076080 539221458 532787132 530859070 534026413
647E34026413Q157692J2356682J5296058J6845131J7186814J6676178J5664062J4388580
$$ 534026413 542184105 554540787 569836845 586681976 603868790 620544968 636209030 650597610
655F50597610J2973023J1501388J0088883Q879089P962647P285156O636124N752945
$$ 650597610 663570633 675072021 685160904 694039993 702002640 709287796 715923920 721676865
663G21676865M499054K998504J624451Q23975Q70208J682434K835770L758316M010468
$$ 721676865 726175919 729174423 730798874 731622849 732493057 734175491 737011261 740769577 744780045
672G44780045L489379K446671J325760N19714J89972K38037M15802M94004L80554J36261
$$ 744780045 748269424 750716095 752041855 752561569 752751541 752989578 753405380 753899384 754279938 754416199
682G54416199j02463k24915k10723j23978n8670p5073j69220k85645l54080l34091
$$ 754416199 754313736 754088821 753878098 753754120 753695450 753620377 753451157 753165512 752811432 752477341
692G52477341k33383j02921q163M119o9503j88065k87170l14865k62528j72348j15280
$$ 752477341 752243958 752141037 752132874 752136993 752067490 751879425 751592255 751277390 751014862 750842514 750727234
703G50727234j47781k75193m43039n66711n82657m89197l50876k60849k85720m24729
$$ 750727234 750579453 750304260 749861221 749294510 748711853 748222656 747871780 747610931 747325211 746900482
713G46900482o11038p54623p97120p45697o65207o32553o88095q10394r32541r87854
$$ 746900482 746289444 745534821 744737701 743992004 743326797 742694244 742006149 741195755 740263214 739275360
723G39275360r52606q62808p90558p99179r02710j056290j184082j223221j163330
$$ 739275360 738322754 737459946 736669388 735870209 734967499 733911209 732727127 731503906 730340576
732G30340576j054001r75494r92584j114655j291580j440887j499939j462708j388931
$$ 730340576 729286575 728311081 727318497 726203842 724912262 723471375 721971436 720508728 719119797
741G19119797j369019j472626j707611k012710k294541k477874k547303k551422k568969
$$ 719119797 717750778 716278152 714570541 712557831 710263290 707785416 705238113 702686691 700117722
750G00117722k663498k851181l102341l373261l638839l912735m238739m667282n237885
$$ 700117722 697454224 694603043 691500702 688127441 684488602 680575867 676337128 671669846 666431961
759F66431961n972900o877518p932129r061088j0100365j0784531j0789947r831314
$$ 666431961 660459061 653581543 645649414 636588326 626487961 615703430 604913483 595082169
767E95082169p778016m737281j055832K772712O249238R006004J0874405J1872291
$$ 595082169 587304153 582566872 581511040 584283752 590532990 599538994 610413399 622285690
775F22285690J2130165J1808205J1043167R941483Q601455P137223N679245M354858
$$ 622285690 634415855 646224060 657267227 667208710 675810165 682947388 688626633 692981491
783F92981491L256455K418212J813813J374206J017151O79093L36685J3885k33764
$$ 692981491 696237946 698656158 700469971 701844177 702861328 703540421 703877106 703890991 703657227
792G03657227l47214l04260j40076N4321J68457J24054q5144l85971o65894q29772
$$ 703657227 703310013 703005753 702865677 702919998 703088455 703212509 703127365 702741394 702075500 701245728
802G01245728q51212p82700p21359p50885q92639j098785j281281j369324j345062
$$ 701245728 700394516 699611816 698890457 698139572 697246933 696148148 694866867 693497543 692152481
811F92152481j252594j167145j150207j219635j345597j476669j573791j632080j679688
$$ 692152481 690899887 689732742 688582535 687362900 686017303 684540634 682966843 681334763 679655075
820F79655075j756821j887817k066650k261200k433091k563095k666015k785187k972946
$$ 679655075 677898254 676010437 673943787 671682587 669249496 666686401 664020386 661235199 658262253
829F58262253l261795l648300m093781m547424m976540n385322n813218o309242o903648
$$ 658262253 655000458 651352158 647258377 642710953 637734413 632349091 626535873 620226631 613322983
838F13322983p596817q380699r276810j0360642j1733360j3431358j5303536j6927452
$$ 613322983 605726166 597345467 588068657 577708015 565974655 552543297 537239761 520312309
846E20312309j7636642j6688004j3533058q081741q38013P176132J4695969K0587501
$$ 520312309 502675667 485987663 472454605 464372864 463534851 470710983 485406952 505994453
854E05994453K4168892K5353089K4577751K2566643K0054855J7580338J5411987J3599472
$$ 505994453 530163345 555516434 580094185 602660828 622715683 640296021 655708008 669307480
862F69307480J2078171J0766067R605026Q559494P594986O668625N742646M803085
$$ 669307480 681385651 692151718 701756744 710316238 717911224 724579849 730322495 735125580
870G35125580L871078K989579K199935J518097R31168M10614o6528n02243q80204j179580
$$ 735125580 738996658 741986237 744186172 745704269 746635437 747046051 746979523 746477280 745597076 744417496
880G44417496j395264j543121j655808j765365j886673k011490k115479k176971k191544
$$ 744417496 743022232 741479111 739823303 738057938 736171265 734159775 732044296 729867325 727675781
889G27675781k178802k171021k197113k263412k351303k429810k473907k482377k479782
$$ 727675781 725496979 723325958 721128845 718865433 716514130 714084320 711610413 709128036 706648254
898G06648254k501907k575989k708511k887955l098221l336868l616333l958816m381714
$$ 706648254 704146347 701570358 698861847 695973892 692875671 689538803 685922470 681963654 677581940
907F77581940m895096n507431o233368p084427q031769q955154r608650r641190q687935
$$ 677581940 672686844 667179413 660946045 653861618 645829849 636874695 627266045 617624855 608936920
916F08936920o511116l131523J112404N617981R675102J2665978J4231987J4343872
$$ 608936920 602425804 599294281 600406685 606024666 615699768 628365746 642597733 656941605
924F56941605J3259811J1402588R212952P041549N101090L481216K192307J209411
$$ 656941605 670201416 681604004 690816956 697858505 702959595 706440811 708633118 709842529
932G09842529M95148P553l06091n06211o50711p81402r12781j035080j128311j177902
$$ 709842529 710337677 710345230 710039139 709532928 708882217 708100815 707188034 706152954 705024643 703846741
942G03846741j186524j173935j164093j173324j202545j239243j269302j287613j301193
$$ 703846741 702660217 701486282 700322189 699148865 697946320 696707077 695437775 694150162 692848969
951F92848969j324235j364974j418992j469039j495057j487655j453324j414032j392059
$$ 692848969 691524734 690159760 688740768 687271729 685776672 684289017 682835693 681421661 680029602
960F80029602j398773j426087j452865j455689j421966j358109j282806j219635j182404
$$ 680029602 678630829 677204742 675751877 674296188 672874222 671516113 670233307 669013672 667831268
969F67831268j168213j159057j132202j070786r74960q62732p60880o90612o58341
$$ 667831268 666663055 665503998 664371796 663301010 662326050 661463318 660702438 660011826 659353485
978F59353485o49567o41403o15616n73883n37185n35279n87921o92291q22983r47723
$$ 659353485 658703918 658062515 657446899 656873016 656335831 655800552 655212631 654520340 653697357 652749634
988F52749634j046143j121139j198349j307755j468963j679841j919860k163773k395859
$$ 652749634 651703491 650582352 649384003 648076248 646607285 644927444 643007584 640843811 638447952
997F38447952k618904k854118l134995l492469l945771m494095n119705n807953o565857
$$ 638447952 635829048 632974930 629839935 626347466 622401695 617907600 612787895 606979942 600414085
1006F00414085p433853q460655r640884j0833359j1708641j1782265j0553245p717591
$$ 600414085 592980232 584519577 574878693 564045334 552336693 540554428 530001183 522283592
1014E22283592l369407J915168P178383J1346703J3569603J3494148J1365204P927818
$$ 522283592 518914185 520829353 528007736 539354439 552924042 566418190 577783394 585711212
1022E85711212M181328J095085o19888o33354R87281L831978P251091J0490608J2853280
$$ 585711212 589892540 590987625 590367737 589734383 590721664 594553642 601804733 612295341 625148621
1031F25148621J3861732J3377113J1625138R105606O413956M046630K268677J094132
$$ 625148621 639010353 652387466 664012604 673118210 679532166 683578796 685847473 686941605
1039F86941605L68881j03607m59900p43561r36508j019669j011810r71832r65042j024704
$$ 686941605 687310486 687206879 686746979 686003418 685066910 684047241 683035431 682063599 681098557 680073853
1049F80073853j136780j254044j327820j338119j301346j258697j248246j285858j357956
$$ 680073853 678937073 677683029 676355209 675017090 673715744 672457047 671208801 669922943 668564987
1058F68564987j431427j475067j477966j452713j430435j440583j495132j581345j668701
$$ 668564987 667133560 665658493 664180527 662727814 661297379 659856796 658361664 656780319 655111618
1067F55111618j725159j736297j710968j678620j670684j705933j779175j867065j940308
$$ 655111618 653386459 651650162 649939194 648260574 646589890 644883957 643104782 641237717 639297409
1076F39297409j981087j991043j990776k007713k061043k152634k266006k378044k473717
$$ 639297409 637316322 635325279 633334503 631326790 629265747 627113113 624847107 622469063 619995346
1085F19995346k555275k642822k760048k919808l114776l323441l528518l732109l959771
$$ 619995346 617440071 614797249 612037201 609117393 606002617 602679176 599150658 595418549 591458778
1094E91458778m244041m601326n016022n447197n856399o237335o629220p102623p730712
$$ 591458778 587214737 582613411 577597389 572150192 566293793 560056458 553427238 546324615 538593903
1103E38593903q565903r636612j0953522j2498016j4173584j5728607j6705551j6480332
$$ 538593903 530028000 520391388 509437866 496939850 482766266 467037659 450332108 433851776
1111D33851776j4426308j0168609l822479L912277J1876106J8771858K3560677K5763473
$$ 433851776 419425468 409256859 405434380 409346657 421222763 439994621 463555298 489318771
1119D89318771K5546952K3571891K0695572J7668610J4949989J2684250J0800171R150047
$$ 489318771 514865723 538437614 559133186 576801796 591751785 604436035 615236206 624386253
1127F24386253P611771O126251M683495L291931J960068O90918n12925j648483k712402
$$ 624386253 631998024 638124275 642807770 646099701 648059769 648750687 648237762 646589279 643876877
1136F43876877l703308m619141n459595o231041o950721p639008q289108q821259r051971
$$ 643876877 640173569 635554428 630094833 623863792 616913071 609274063 600984955 592163696 583111725
1145E83111725q711167p525215n343437k252388J388550N021439Q056488J0055084
$$ 583111725 574400558 566875343 561531906 559279518 560668068 565689507 573745995 583801079
1153E83801079J0851326J0560493R480858P955475O261673M580421L031960J735496
$$ 583801079 594652405 605212898 614693756 622649231 628910904 633491325 636523285 638258781
1161F38258781Q32253M50478O33659J278992K139740K899322L286667L176956K625733
$$ 638258781 639091034 639541512 640175171 641454163 643593903 646493225 649779892 652956848 655582581
1170F55582581J824188J001739L28369j36184m31519o41327q31909j019821j179047
$$ 655582581 657406769 658408508 658736877 658600693 658169174 657527847 656695938 655676117 654497070
1179F54497070j274948j297989j274795j252365j268540j330337j411515j471862j485138
$$ 654497070 653222122 651924133 650649338 649396973 648128433 646798096 645386581 643914719 642429581
1188F42429581j454087j409645j391601j422386j496048j579400j632957j633224j587067
$$ 642429581 640975494 639565849 638174248 636751862 635255814 633676414 632043457 630410233 628823166
1197F28823166j526756j492539j508713j570396j647072j701126j710129j679992j639862
$$ 628823166 627296410 625803871 624295158 622724762 621077690 619376564 617666435 615986443 614346581
1206F14346581j625062j655464j723518j801987j860580j886292j891060j902694j949654
$$ 614346581 612721519 611066055 609342537 607540550 605679970 603793678 601902618 599999924 598050270
1215E98050270k041702k166825k299423k415313k508164k590256k686882k821502l006249
$$ 598050270 596008568 593841743 591542320 589127007 586618843 584028587 581341705 578520203 575513954
1224E75513954l237037l500290l782731m078903m390259m709930n002899n184364n119515
$$ 575513954 572276917 568776627 564993896 560914993 556524734 551814804 546811905 541627541 536508026
1233E36508026m649505l649064k094154j13182K014275L919029N255737N820885N625305
$$ 536508026 531858521 528209457 526115303 526002121 528016396 531935425 537191162 543012047 548637352
1242E48637352M888000L947373L131332K641487K498894K570343K651711K566337K231827
$$ 548637352 553525352 557472725 560604057 563245544 565744438 568314781 570966492 573532829 575764656
1251E75764656J671486R81712K76680l57628q81385j293602j612015j853790k028199
$$ 575764656 577436142 578417854 578694534 578336906 577455521 576161919 574549904 572696114 570667915
1260E70667915k141113k200508k222138k227706k239113k271614k331353k414627k512626
$$ 570667915 568526802 566326294 564104156 561876450 559637337 557365723 555034370 552619743 550107117
1269E50107117k615357k716751k815933k917137l026848l149223l282967l422966l562393
$$ 550107117 547491760 544775009 541959076 539041939 536015091 532865868 529582901 526159935 522597542
1278E22597542l700180l842240m001617m191818m419289m680710m964332n258561n558776
$$ 522597542 518897362 515055122 511053505 506861687 502442398 497761688 492797356 487538795 481980019
1287D81980019n871392o208419o580010o988640p426147p880326q340339q802719r273110
$$ 481980019 476108627 469900208 463320198 456331558 448905411 441025085 432684746 423882027 414608917
1296D14608917r767990j0313454j0936584j1641808j2368888j2945977j3065452j2313462
$$ 414608917 404840927 394527473 383590889 371949081 359580193 346634216 333568764 321255302
1304C21255302j0270843o666260j526832M742126J1400089J7541638K2335014K5247154
$$ 321255302 310984459 304318199 302791367 307533493 318933582 336475220 358810234 384057388
1312C84057388K6163864K5370217K3409424K0882721J8275299J5859718J3693542J1689148
$$ 384057388 410221252 435591469 459000893 479883614 498158913 514018631 527712173 539401321
1320E39401321R709664P649650N479813L248634J054612r90067k793884m304199n511170
$$ 539401321 549110985 556760635 562240448 565489082 566543694 565553627 562759743 558455544 552944374
1329E52944374o441040p143593p681007q117943q509216q891716r275246r645004r977074
$$ 552944374 546503334 539359741 531678734 523560791 515051575 506159859 496884613 487239609 477262535
1338D77262535j0258255j0506592j0776825j1142120j1666679j2373963j3231811j4153939
$$ 477262535 467004280 456497688 445720863 434578743 422912064 410538101 397306290 383152351
1346C83152351j5010833j5639573j5844345j5399742j4069099j1653538q064537l395672
$$ 383152351 368141518 352501945 336657600 321257858 307188759 295535221 287470684 284075012
1354B84075012K039070P729931J3060456J7440090K0436134K1865768K1818886K0606728
$$ 284075012 286114082 293844013 306904469 324344559 344780693 366646461 388465347 409072075
1362D09072075J8658180J6399536J4159394J2123756J0352974Q835220P547684O486740
$$ 409072075 427730255 444129791 458289185 470412941 480765915 489601135 497148819 503635559
1370E03635559N659561N050698M598693M209748L808517L396874L072471K984200L238411
$$ 503635559 509295120 514345818 518944511 523154259 526962776 530359650 533432121 536416321 539654732
1379E39654732L804855M486427M977379M988594M371338L175507J606216q6860j726227
$$ 539654732 543459587 547946014 552923393 557911987 562283325 565458832 567065048 566978188 565251961
1388E65251961l263512m749527o253586p782478r257431j0552292j1567841j2290077
$$ 565251961 561988449 557238922 550985336 543202858 533945427 523393135 511825294 499535217
1396D99535217j2796821j3216248j3662834j4186592j4756165j5270576j5580597j5506744
$$ 499535217 486738396 473522148 459859314 445672722 430916557 415645981 400065384 384558640
1404C84558640j4855118j3441086j1135559p917900l923226N53818N103798R289322
$$ 384558640 369703522 356262436 345126877 337208977 333285751 333839569 338943367 348232689
1412C48232689J2743301J5240670J6725120J7289124J7121925J6448975J5477867J4362335
$$ 348232689 360975990 376216660 392941780 410230904 427352829 443801804 459279671 473642006
1420D73642006J3186722J1973533J0711098R391365Q042946O736107N557632M559021
$$ 473642006 486828728 498802261 509513359 518904724 526947670 533683777 539241409 543800430
1428E43800430L714829K915611K011948Q89358m62494j934929l349151m550743n496826
$$ 543800430 547515259 550430870 552442818 553332176 552869682 550934753 547585602 543034859 537538033
1437E37538033o282998p095985q106918r367066j0752868j1996041j2780189j2861252
$$ 537538033 531255035 524159050 516052132 506685066 495932198 483936157 471155968 458294716
1445D58294716j2160072j0792237r020729p156257n441323l958473k604637j146050
$$ 458294716 446134644 435342407 426321678 419165421 413724098 409765625 407160988 406014938
1453D06014938O60706K921142N500412Q019791R972458J0922318J0697593R482994
$$ 406014938 406675644 409596786 415097198 423116989 433089447 444011765 454709358 464192352
1461D64192352P759438O106491M964828M472352M451828M551391M455757M049874L459053
$$ 464192352 471951790 478058281 483023109 487495461 491947289 496498680 500954437 505004311 508463364
1470E08463364K944870K739830K907104L310394L696785L835411L632813L159218K583008
$$ 508463364 511408234 514148064 517055168 520365562 524062347 527897758 531530571 534689789 537272797
1479E37272797K059402J642532J264458P90672J14098p67174j725921k556115l066635
$$ 537272797 539332199 540974731 542239189 543029861 543143959 542376785 540650864 538094749 535028114
1488E35028114l178482k977409k688637k580719k834473l440284m183464m737549m831391
$$ 535028114 531849632 528872223 526183586 523602867 520768394 517328110 513144646 508407097 503575706
1497E03575706m409980l694535l099823l033256l676415m871978o175919p067337p196579
$$ 503575706 499165726 495471191 492371368 489338112 485661697 480789719 474613800 467546463 460349884
1506D60349884o546097n423431m292069l544960l337593l562126l947754m221687m228706
$$ 460349884 453803787 448380356 444088287 440543327 437205734 433643608 429695854 425474167 421245461
1515D21245461l962288l515892k999726k485046j992150j515274j053314o25000k64358
$$ 421245461 417283173 413767281 410767555 408282509 406290359 404775085 403721771 403096771 402832413
1524D02832413o676J29128J53274J13525R3995J91154M69360R10759J389008J701393
$$ 402832413 402825737 402954865 403108139 403221664 403315659 403506813 403976173 404886932 406275940 407977333
1534D07977333J651077J154824L07159o36749j362877j640625j425667q76999k78129
$$ 407977333 409628410 410783234 411090393 410453644 409090767 407450142 406024475 405147476 404869347
1543D04869347R2849P6905l20015r57985j645355k229615k656555k981987l336143
$$ 404869347 404962196 405039101 404719086 403761101 402115746 399886131 397229576 394247589 390911446
1552C90911446l856697m613343n549927o478385p133522p280465o832618n918770m856415
$$ 390911446 387054749 382441406 376891479 370413094 363279572 355999107 349166489 343247719 338391304
1561C38391304m030304l726730m008866m694023n449810n963745o087074n894394n621128
$$ 338391304 334361000 330634270 326625404 321931381 316481571 310517826 304430752 298536358 292915230
1570B92915230n527497n763950o304493o978474p570858p932605q042412p996903p942791
$$ 292915230 287387733 281623783 275319290 268340816 260769958 252837353 244794941 236798038 228855247
1579B28855247p995376q185158q452625q687649q783302q674488q348694p826405p132969
$$ 228855247 220859871 212674713 204222088 195534439 186751137 178076649 169727955 161901550 154768581
1588A54768581o278915n259409m072409k740183j319742J02005J434336K610369L607759
$$ 154768581 148489666 143230257 139157848 136417665 135097923 135199928 136634264 139244633 142852392
1597A42852392M454069N207224N928002O648454P353649P983304Q450374Q670254Q584137
$$ 142852392 147306461 152513685 158441687 165090141 172443790 180427094 188877468 197547722 206131859
1606B06131859Q170013P436276O412353N140744L683853K135734O27194o88591j674443
$$ 206131859 214301872 221738148 228150501 233291245 236975098 239110832 239738026 239049435 237374992
1615B37374992k253418k437782k321796k036896j691628j324195q96473l26939M51927
$$ 237374992 235121574 232683792 230361996 228325100 226633472 225309277 224412804 224085865 224537792
1624B24537792J447182K586651L741493M765224N536423N987282O113243N971489N670700
$$ 224537792 225984974 228571625 232313118 237078342 242614765 248602047 254715290 260686779 266357479
1633B66357479N350762N148334N149403N347995N631218N816155N729751N303135M624806
$$ 266357479 271708241 276856575 282005978 287353973 292985191 298801346 304531097 309834232 314459038
1642C14459038L917675L433285L314857L504715L759270L775215L370666K615090J823654
$$ 314459038 318376713 321809998 325124855 328629570 332388840 336164055 339534721 342149811 343973465
1651C43973465J405373J640701K511406L691788M708747N191307N059548M550476M062424
$$ 343973465 345378838 347019539 349530945 353222733 357931480 363122787 368182335 372732811 376795235
1660C76795235L918304M190025M686051N098457N206642N004502M678077M456940M453583
$$ 376795235 380713539 384903564 389589615 394688072 399894714 404899216 409577293 414034233 418487816
1669D18487816M597359M705238M629745M377556M104996M001274M133186M368935M439583
$$ 418487816 423085175 427790413 432420158 436797714 440902710 444903984 449037170 453406105 457845688
1678D57845688M105110L324127K315064J464920J135902J477776K350692L399430M227867
$$ 457845688 461950798 465274925 467589989 469054909 470190811 471668587 474019279 477418709 481646576
1687D81646576M577598M417687L909149L284950K719574K265091J875725J492004J121140
$$ 481646576 486224174 490641861 494551010 497835960 500555534 502820625 504696350 506188354 507309494
1696E07309494Q57925Q35457J134529J713753K405701K986679L281364L247185K988434
$$ 507309494 508167419 509002876 510137405 511851158 514256859 517243538 520524902 523772087 526760521
1705E26760521K692223K525291K542343K657776K692986K473983J930657J150360L58085
$$ 526760521 529452744 531978035 534520378 537178154 539871140 542345123 544275780 545426140 545784225
1714E45784225j68113k14043K72942J146621K112122K843056L121872K932853K460175
$$ 545784225 545616112 545402069 545675011 546821632 548933754 551776810 554898682 557831535 560291710
1723E60291710J983070J719628J707229J784668J701737J287193N80559j59798n88074
$$ 560291710 562274780 563994408 565701637 567486305 569188042 570475235 571055794 570895996 570307922
1732E70307922m63905K01645J140060J964379K373504K300530J923675J539574J382217
$$ 570307922 569844017 570045662 571185722 573150101 575523605 577824135 579747810 581287384 582669601
1741E82669601J496392J735496J873360J754532J389923R46731O48194O48308R54551
$$ 582669601 584165993 585901489 587774849 589529381 590919304 591866035 592514229 593162537 594117088
1750E94117088J435089J895676K175980K211418K039184J753998J454659J208992J049919
$$ 594117088 595552177 597447853 599623833 601835251 603874435 605628433 607083092 608292084 609342003
1759F09342003R94110J050949J218414J458741J685447J778183J634484J232223O66962
$$ 609342003 610336113 611387062 612605476 614064217 615749664 617527847 619162331 620394554 621061516
1768F21061516J32522j56288o3095M01879J080093J737060K164422K262153K060814
$$ 621061516 621194038 621037750 620974655 621376534 622456627 624193687 626358109 628620262 630681076
1777F30681076J683044J276589R58137P89986P84111R13429J115532J294060J336632
$$ 630681076 632364120 633640709 634598846 635388832 636172943 637086372 638201904 639495964 640832596
1786F40832596J158981P57370K39029k02942l74603j79520L17765R08813J340942J437531
$$ 640832596 641991577 642748947 642987976 642785034 642410431 642230911 642548676 643457489 644798431 646235962
1796F46235962J188888P47529L47518J82267L13263O53915J026230J259766J272583
$$ 646235962 647424850 648172379 648519897 648702164 649015427 649669342 650695572 651955338 653227921
1805F53227921J099395Q57926O79779O45447P55615R46197J133271J257782J304779
$$ 653227921 654327316 655185242 655865021 656510468 657266083 658212280 659345551 660603333 661908112
1814F61908112J295547J258774J209946J144561J054612R41162Q19625P07169O04630
$$ 661908112 663203659 664462433 665672379 666816940 667871552 668812714 669632339 670339508 670944138
1823F70944138M96444L65906K23084J15356J07498K38342M82407P49054R26132R46884
$$ 670944138 671440582 671806488 672029572 672144928 672252426 672490768 672973175 673722229 674648361 675595245
1833F75595245Q28476O59714N34592M80652M33349K82135m1961m91028r01871j074600
$$ 675595245 676423721 677083435 677618027 678098679 678532028 678814163 678772202 678281174 677379303 676304703
1843F76304703q88214l81317K59094P90634J039810R82895P36389M77982L40957L53241
$$ 676304703 675416489 675035172 675294266 676084900 677124710 678107605 678843994 679321976 679662933 680016174
1853F80016174M47846N25207N29633M80041M51508N15442O83670Q89740J020584R78165
$$ 680016174 680464020 680989227 681518860 681998901 682450409 682965851 683649521 684539261 685559845 686538010
1863F86538010P40814L86734O4773p2097N8441M25644Q98590J304016J508484J471634
$$ 686538010 687278824 687665558 687730331 687658234 687716675 688142319 689040909 690344925 691853409 693325043
1873F93325043J252441R67407P26242N86167N40466N46188N58243N50919N15976M49753
$$ 693325043 694577484 695544891 696271133 696857300 697397766 697943954 698502197 699053116 699569092 700018845
1883G00018845L45230J98745K7390j29318k20413k17743j33057j6937P0572R6206P0343
$$ 700018845 700364075 700562820 700590210 700460892 700240479 700022736 699889679 699872742 699943314 700039520 700109863
1894G00109863L6011L4714Q1100J55106K22931K61459K69089K57416K31399J83411
$$ 700109863 700145874 700180588 700261688 700416794 700639725 700901184 701170273 701427689 701659088 701842499
1904G01842499J01394o256j02539j35803p4768O1645K02408K59400J78985k2583k62451
$$ 701842499 701943893 701937637 701835098 701699295 701624527 701686172 701888580 702147980 702326965 702304382 702041931
1915G02041931m35181m68215l56904j59912L9521J78146K38800K46658K40784K45361
$$ 702041931 701606750 701138535 700781631 700621719 700661240 700839386 701078186 701324844 701565628 701810989
1925G01810989K58332K56805K17972J35498K7695p2251j30310j30157q2245k2583Q39
$$ 701810989 702069321 702326126 702544098 702679596 702707291 702635040 702504730 702374573 702292328 702269745 702270584
1936G02270584n0049j84707l73459n57785o73981o83746n93262m50134l21656k61154
$$ 702270584 702220535 702035828 701662369 701104584 700430603 699746857 699153595 698703461 698381805 698120651
1946F98120651k85034l68729m63943n24902n29251m81949m03595l12348k12326r3002
$$ 698120651 697835617 697466888 697002945 696478043 695948792 695466843 695063248 694750900 694538574 694445572
1956F94445572N6763K36969M25872N88532O88705P07321O53000N58319M65394M08020
$$ 694445572 694502335 694739304 695165176 695753708 696442413 697149734 697802734 698361053 698826447 699234467
1966F99234467L95736M13132M29382M15268L57361K65808J64261P8430K1363j0605
$$ 699234467 699630203 700043335 700472717 700887985 701245346 701511154 701675415 701753845 701775208 701764603
1976G01764603l2807o0653r9793j44119j79367j97754k03247k13013k49710l27530
$$ 701764603 701731796 701671143 701571350 701427231 701247864 701050110 700846863 700633850 700384140 700056610
1986G00056610m41818n68924o72379p21130p01065o24847n25055m41208m02680m17862
$$ 700056610 699614792 699045868 698373489 697652359 696951294 696326447 695801392 695360184 694957504 694539642
1996F94539642m73022n41458n98297o30646o40564o39801o38580o40259o36978o18210
$$ 694539642 694066620 693525162 692926865 692296219 691655655 691015854 690377274 689737015 689100037 688481827
2006F88481827n76248n14374m44412l84674l49961l46756l69186m03748m34265m48151
$$ 688481827 687905579 687391205 686946793 686562119 686212158 685865402 685496216 685092468 684658203 684210052
2016F84210052m42352m23584m03976l95737m04968m29001m58145m82254m94995m98963
$$ 684210052 683767700 683344116 682940140 682544403 682139435 681710434 681252289 680770035 680275040 679776077
2026F79776077n03692n19486n53741o06537o75049p54700q43963r43833j052704j163330
$$ 679776077 679272385 678752899 678199158 677592621 676917572 676162872 675318909 674375076 673322372 672159042
2036F72159042j262512j334076j368561j369171j352386j339722j345520j365127j372376
$$ 672159042 670896530 669562454 668193893 666824722 665472336 664132614 662787094 661421967 660049591
2045F60049591j327972j197663r69085o60248l18222j450K40860L81699M22134L81546
$$ 660049591 658721619 657523956 656554871 655894623 655576401 655574951 655815811 656197510 656619644 657001190
2055F57001190K87323J59531J0376j54343l26843m94461o41632p56912q38700q97446
$$ 657001190 657288513 657448044 657458420 657304077 656977234 656482773 655841141 655084229 654245529 653348083
2065F53348083r49325j008606j080856j161118j239242j306916j363144j414413j469879
$$ 653348083 652398758 651390152 650309296 649148178 647908936 646602020 645238876 643824463 642354584
2074F42354584j534958j609039j683922j749954j800690j834717j857796j876869j897621
$$ 642354584 640819626 639210587 637526665 635776711 633976021 632141304 630283508 628406639 626509018
2083F26509018j921539j946221j966667j978111j979180j969909j953507j931495j905594
$$ 626509018 624587479 622641258 620674591 618696480 616717300 614747391 612793884 610862389 608956795
2092F08956795j876221j844597j813545j787262j769600j762161j763153j767540j769524
$$ 608956795 607080574 605235977 603422432 601635170 599865570 598103409 596340256 594572716 592803192
2101E92803192j765251j754913j741677j728706j717644j704864j684456j649666j596527
$$ 592803192 591037941 589283028 587541351 585812645 584095001 582390137 580705681 579056015 577459488
2110E77459488j526489j444245j356392j268005j180267j091156r96590q92754p77282
$$ 577459488 575932999 574488754 573132362 571864357 570684090 569592934 568596344 567703590 566926308
2119E66926308o49834n12009l65905k12975n4054J12190K87704M75083O76308Q90731
$$ 566926308 566276474 565764465 565398560 565185585 565131531 565243721 565531425 566006508 566682816 567573547
2129E67573547J115647J345939J576195J802025K020988K231980K434273K626190K802620
$$ 567573547 568689194 570035133 571611328 573413353 575434341 577666321 580100594 582726784 585529404
2138E85529404K957534L084832L181457L247795L286019L300132L290291L254700L189278
$$ 585529404 588486938 591571770 594753227 598001022 601287041 604587173 607877464 611132164 614321442
2147F14321442L092041K965431K816543K656517K494431K334862K176437K014923J849365
$$ 614321442 617413483 620378914 623195457 625851974 628346405 630681267 632857704 634872627 636721992
2156F36721992J686554J541710J432648J372528J359940J378174J401214J405182J378784
$$ 636721992 638408546 639950256 641382904 642755432 644115372 645493546 646894760 648299942 649678726
2165F49678726J328888J273651J232910J215058J212158J206665J181412J131820J068497
$$ 649678726 651007614 652281265 653514175 654729233 655941391 657148056 658329468 659461288 660529785
2174F60529785J010742R74961R64508R66568R60083R28268Q67615P88650P10297O46820
$$ 660529785 661540527 662515488 663479996 664446564 665406647 666334915 667202530 667991180 668701477 669348297
2184F69348297O01807N66406N26352M72717M07944L42865K92892K65503K57187K53906
$$ 669348297 669950104 670516510 671042862 671515579 671923523 672266388 672559280 672824783 673081970 673335876
2194F73335876K39258K04010J52130R8496O1264N2185O9504R7961J17722J14517Q6822
$$ 673335876 673575134 673779144 673931274 674029770 674091034 674143219 674212723 674310684 674428406 674542923 674629745
2205F74629745M5853P935j6022k8458m2953p6828j39542k26135l18375l95736m46091
$$ 674629745 674675598 674683533 674667511 674639053 674596100 674519272 674379730 674153595 673835220 673439484 672993393
2216F72993393m72412m91104n21469n72739o38351o97709p28683p18536o72989o13480
$$ 672993393 672520981 672029877 671508408 670935669 670297318 669599609 668870926 668152390 667479401 666865921
2226F66865921n66788n51834n70144o07758o44608o65969o72074o77032o98777p48367
$$ 666865921 666299133 665747299 665177155 664569397 663924789 663258820 662586746 661909714 661210937 660462570
2236F60462570q21762r01260r67636j009751j033325j057968j104660j184998j293487
$$ 660462570 659640808 658739548 657771912 656762161 655728836 654670868 653566208 652381210 651087723
2245F51087723j410904j514969j593170j649475j698075j756744j831741j914788j986885
$$ 651087723 649676819 648161850 646568680 644919205 643221130 641464386 639632645 637717857 635730972
2254F35730972k027397k024422j978607j898079j788215j642380j442032j164627p99561
$$ 635730972 633703575 631679153 629700546 627802467 626014252 624371872 622929840 621765213 620965652
2263F20965652l62243J03721N34440Q67576J062050J110535J038437Q87336O98777
$$ 620965652 620603409 620707130 621241570 622109146 623171196 624281731 625320168 626207504 626906281
2272F26906281M98542K97013R5672j01890k85225m38881n52139o27442o80275p33528
$$ 626906281 627404823 627701836 627797508 627695618 627410393 626971512 626419373 625791931 625111656 624378128
2282F24378128q04977q98362j001739j093330j152726j168899j143761j088371j015320
$$ 624378128 623573151 622674789 621673050 620579720 619426994 618258095 617114334 616025963 615010643
2291F15010643r31129q34084p15256n66826l86848j85432J7547J99471L41758M36058
$$ 615010643 614079514 613245430 612530174 611963348 611576500 611391068 611408615 611608086 611949844 612385902
2301F12385902M83742M90570M61960L99628L05023J85127N6153n8289j35727j65634
$$ 612385902 612869644 613360214 613822174 614221802 614526825 614711952 614768105 614709816 614574089 614408455
2311F14408455j57967j42250j58615k43111m11949o51397r17054j146011j277084j278878
$$ 614408455 614250488 614108238 613949623 613706512 613294563 612643166 611726112 610580101 609303017 608024139
2321F08024139j167640j007195q84208q66814r65462j122208j236877j220245j046181
$$ 608024139 606856499 605849304 604965096 604098282 603132820 602010612 600773735 599553490 598507309
2330E98507309p66945m85496k96784k39372k89002l94935n33028p24716j004295j349678
$$ 598507309 597740364 597254868 596958084 596718712 596429710 596034775 595501747 594777031 593772736 592423058
2340E92423058j632119j634712j156387j48468J197128K474213L213997L090324K072678
$$ 592423058 590790939 589156227 587999840 587851372 589048500 591522713 594736710 597827034 599899712
2349E99899712M47311j310196k739754l573379l802948l618736l271828k947540k703362
$$ 599899712 600347023 599036827 596297073 592723694 588920746 585302010 582030182 579082642 576379280
2358E76379280k497559k257728j946297j581917j217002q99697o47774m48074k75459
$$ 576379280 573881721 571623993 569677696 568095779 566878777 565979080 565331306 564883232 564607773
2367E64607773j13640L9215J74980K87705L80134M61655N42641O27937P14798P93838
$$ 564607773 564494133 564533348 564708328 564996033 565376167 565837822 566380463 567008400 567723198 568517036
2377E68517036Q52051Q74787Q49151P69425O39839M75578K97470J23787l6049j83639
$$ 568517036 569369087 570243874 571093025 571862450 572502289 572977867 573275337 573399124 573363075 573179436
2387E73179436l24402m61235n89752p01180p88917q54416r06372r52988r93118j012078
$$ 573179436 572855034 572393799 571804047 571102867 570313950 569459534 568553162 567600174 566607056 565594978
2397E65594978r87510r02253p55996n71938l89595k50931j84784j98097k75230l88298
$$ 565594978 564607468 563705215 562949219 562377281 561987686 561736755 561551971 561353874 561078644 560690346
2407E60690346n09491o20384p15905q01544q84781r69810j052590j123733j171913
$$ 560690346 560180855 559560471 558844566 558043022 557158241 556188431 555135841 554012108 552840195
2416E52840195j190338j178856j143608j093598j037330r80340r24301q71315q21685
$$ 552840195 551649857 550471001 549327393 548233795 547196465 546216125 545291824 544420509 543598824
2425E43598824p78542p44476p22504p13196p15141p24678p36923p46003p49206p46346
$$ 543598824 542820282 542075806 541353302 540640106 539924965 539200287 538463364 537717361 536968155 536221809
2435E36221809p42187p43523p56988p84645q24395q69407r13735r54322r92508j031266
$$ 536221809 535479622 534736099 533979111 533194466 532370071 531500664 530586929 529632607 528640099 527608833
2445E27608833j072502j112785j145744j164132j165466j152878j134605j119728j114388
$$ 527608833 526536331 525423546 524277802 523113670 521948204 520795326 519660721 518540993 517426605
2454E17426605j119385j132926j151772j174507j201248j232720j268387j305427j340141
$$ 517426605 516307220 515174294 514022522 512848015 511646767 510414047 509145660 507840233 506500092
2463E06500092j368752j389503j401635j405487j401634j389885j369362j338997j297111
$$ 506500092 505131340 503741837 502340202 500934715 499533081 498143196 496773834 495434837 494137726
2472D94137726j242256j173478j091117r97582q98628q00972p13387o42738n94597
$$ 494137726 492895470 491721992 490630875 489633293 488734665 487933693 487220306 486577568 485982971
2481D85982971n71747n74875o02684o53266p22847q07534r02748j003074j104813j206207
$$ 485982971 485411224 484836349 484233665 483580399 482857552 482050018 481147270 480144196 479039383 477833176
2491D77833176j307335j411743j522217j641007j765899j890183k004623k099762k171135
$$ 477833176 476525841 475114098 473591881 471950874 470184975 468294792 466290169 464190407 462019272
2500D62019272k220078k252464k274017k287407k287789k265739k211723k120819j996270
$$ 462019272 459799194 457546730 455272713 452985306 450697517 448431778 446220055 444099236 442102966
2509D42102966j847038j684074j514473j340371j159362r68743p70607n72548l86200
$$ 442102966 440255928 438571854 437057381 435717010 434557648 433588905 432818298 432245750 431859550
2518D31859550k24151r6016o256M3602N6457L6393j0186p3929j43623k07062k54173
$$ 431859550 431635399 431539383 431533127 431576729 431633186 431669579 431659393 431585464 431441841 431234779 430980606
2529D30980606k79198k80342k59628k19994j63269q9950o87J03073K15607L28598M32739
$$ 430980606 430701408 430421066 430161438 429941444 429778175 429688225 429687538 429790611 430006218 430334816 430767555
2540D30767555N18418N79490O13022O19202N99518N56144M90265M02680K93655J66435
$$ 430767555 431285973 431865463 432478485 433097687 433697205 434253349 434743614 435146294 435439949 435606384
2550D35606384K6474j16729k51809l68194m59786n25818n73043o10695o49834o98280
$$ 435606384 435632858 435516129 435264320 434896126 434436340 433910522 433337479 432726784 432076950 431378670
2560D31378670p60231q36716r27200j030846j146202j270294j397400j520615j633033
$$ 431378670 430618439 429781723 428854523 427823677 426677475 425407181 424009781 422489166 420856133
2569D20856133j731034j816063j892318j966057k040825k116394k189598k254906k309532
$$ 420856133 419125099 417309036 415416718 413450661 411409836 409293442 407103844 404848938 402539406
2578D02539406k351799k383156k405739k420845k428932k429581k421531k403489k373199
$$ 402539406 400187607 397804451 395398712 392977867 390548935 388119354 385697823 383294334 380921135
2587C80921135k327309k262687k175637k066345j935806j788826j629601j460952j284371
$$ 380921135 378593826 376331139 374155502 372089157 370153351 368364525 366734924 365273972 363989601
2596C63989601j099319r04427o98013m78630k43759P515K73475N46608Q11157J046410
$$ 363989601 362890282 361985855 361287842 360809212 360565453 360572968 360846443 361393051 362204208 363250618
2606C63250618J230583J348190J396676J387214J340752J281509J228485J191750J172333
$$ 363250618 364481201 365829391 367226067 368613281 369954033 371235542 372464027 373655777 374828110
2615C74828110J166000J169434J179657J197052J221199J249542J277847J300431J313514
$$ 374828110 375994110 377163544 378343201 379540253 380761452 382010994 383288841 384589272 385902786
2624C85902786J316757J312561J305619J300316J300544J309166J328926J361046J406822
$$ 385902786 387219543 388532104 389837723 391138039 392438583 393747749 395076675 396437721 397844543
2633C97844543J465226J534233J610946J691857J775284J860313J946945K034607K121735
$$ 397844543 399309769 400844002 402454948 404146805 405922089 407782402 409729347 411763954 413885689
2642D13885689K205810K281571K343673K386513K405319K397538K362938K302551K218628
$$ 413885689 416091499 418373070 420716743 423103256 425508575 427906113 430269051 432571602 434790230
2651D34790230K112541J984978J835708J666870J481629J285858J086502Q89511O99082
$$ 434790230 436902771 438887749 440723457 442390327 443871956 445157814 446244316 447133827 447832909
2660D47832909N17501L46642J88293M5701p8927j85508k77138l58086m32777n03426
$$ 447832909 448350410 448697052 448885345 448931046 448852119 448666611 448389473 448031387 447598610 447095184
2670D47095184n68657o26335o76422p21702p68013q22220q87375r62639j042671j122627
$$ 447095184 446526527 445900192 445223770 444502068 443734055 442911835 442024460 441061821 440019150 438896523
2680D38896523j199189j274185j351814j436653j530266j631394j736793j842384j946297
$$ 438896523 437697334 436423149 435071335 433634682 432104416 430473022 428736229 426893845 424947548
2689D24947548k047081k142868k230568k306099k366295k411041k444115k470321k493592
$$ 424947548 422900467 420757599 418527031 416220932 413854637 411443596 408999481 406529160 404035568
2698D04035568k512893k522812k515831k487068k435608k367554k290115k209435k126808
$$ 404035568 401522675 398999863 396484032 393996964 391561356 389193802 386903687 384694252 382567444
2707C82567444k039604j944504j841812j737519j642265j565933j513748j483689j466865
$$ 382567444 380527840 378583336 376741524 375004005 373361740 371795807 370282059 368798370 367331505
2716C67331505j452942j433945j408310j379089j351471j327324j303177j270904j220856
$$ 367331505 365878563 364444618 363036308 361657219 360305748 358978424 357675247 356404343 355183487
2725C55183487j145821j045265r24682p94335o65359n46456m41170l48777k64893j84555
$$ 355183487 354037666 352992401 352067719 351273384 350608025 350061569 349620399 349271622 349006729 348822174
2735C48822174j02463j5602P8201J80474K91176M09202N32189O55670P74231Q83407
$$ 348822174 348719711 348704109 348782310 348962784 349253960 349663162 350195351 350851021 351625252 352508659
2745C52508659R78737J057854J119308J161728J184502J186714J169281J134453J085854
$$ 352508659 353487396 354545250 355664558 356826286 358010788 359197502 360366783 361501236 362587090
2754C62587090J028099R63821Q94279Q19512P39097O54221N68581M87480M16260L58848
$$ 362587090 363615189 364579010 365473289 366292801 367031898 367686119 368254700 368742180 369158440 369517288
2764C69517288L16239K86827K67143K52991K39372K22969K00500J69869J29661Q0452
$$ 369517288 369833527 370120354 370387497 370640488 370879860 371102829 371303329 371473198 371602859 371683311
2774C71683311K2927m1809j11084j83525k55204l22456l80974m28009m63524m89807
$$ 371683311 371706238 371664429 371553345 371369820 371114616 370792160 370411186 369983177 369519653 369029846
2784C69029846n12314n34668n58128n79872n95284n99708n92613n77736n60913n49012
$$ 369029846 368517532 367982864 367424736 366844864 366249580 365649872 365057259 364479523 363918610 363369598
2794C63369598n44891n48363n56030n63354n67055n65109n56870n41000n15519m79545
$$ 363369598 362824707 362276344 361720314 361156960 360589905 360024796 359467926 358926926 358411407 357931862
2804C57931862m31900l73612l05519k28615j41944m5205O0883J72958K84348L89099
$$ 357931862 357499962 357126350 356820831 356592216 356450272 356405067 356465950 356638908 356923256 357312355
2814C57312355M81377N60760O28929O87981P37534P73010P88269P78961P46231O96831
$$ 357312355 357793732 358354492 358983421 359671402 360408936 361181946 361970215 362749176 363495407 364192238
2824C64192238O41899N90515N46684N08767M71534M30451L85475L40576L01209K69012
$$ 364192238 364834137 365424652 365971336 366480103 366951637 367382088 367767563 368108139 368409348 368678360
2834C68678360K41585K10838J68495J09749L5133n0735j40305k28996l14407l96958
$$ 368678360 368919945 369130783 369299278 369409027 369444160 369393425 369253120 369024124 368709717 368312759
2844C68312759m76951n52292o19392o72226p06482p18079p05566o68755o09055n30815
$$ 368312759 367835808 367283516 366664124 365991898 365285416 364567337 363861771 363193016 362583961 362053146
2854C62053146m40559l48358k63481j93672j41755j04484p5989m8904j8616J6785N5999
$$ 362053146 361612587 361264229 361000748 360807076 360665321 360560837 360484848 360435944 360417328 360434113 360490112
2865C60490112R6207J33934J65634J86768J94320J87035J68190J47171J34773J41754
$$ 360490112 360586319 360720253 360885887 361072655 361266975 361454010 361622200 361769371 361904144 362045898
2875C62045898J72463K22626K82974L40843L88947M25071M53568M79393N04684N27268
$$ 362045898 362218361 362440987 362723961 363064804 363453751 363878822 364332390 364811783 365316467 365843735
2885C65843735N41763N43976N33333N14831M95110M79317M67109M52919M29230L90053
$$ 365843735 366385498 366929474 367462807 367977638 368472748 368952065 369419174 369872093 370301323 370691376
2895C70691376L35121K68555J98822J32598P2976J8882l3378q6174j39961j90850k35443
$$ 370691376 371026497 371295052 371493874 371626472 371699448 371718330 371684952 371598778 371458817 371267967 371032524
2906C71032524k71377l00408l27682l57857l93410m30717m62914m80957m78477m54407
$$ 371032524 370761147 370460739 370133057 369775200 369381790 368951073 368488159 368007202 367528725 367074318
2916C67074318m13323l62663l09486k57302k04582j47476q1444n684P5646J54648K22969
$$ 367074318 366660995 366298332 365988846 365731544 365526962 365379486 365298042 365292358 365368004 365522652 365745621
2927C65745621K75840L14065L45039L78456M22020M78172N43251O10428O73866P31850
$$ 365745621 366021461 366335526 366680565 367059021 367481041 367959213 368502464 369112892 369786758 370518608
2937C70518608P85294Q34732Q74748Q92830Q72383P98912O70967N02625L25126J79901
$$ 370518608 371303902 372138634 373013382 373906212 374778595 375577507 376248474 376751099 377076225 377256126
2947C77256126J08147J39465K82517N20744Q12912J102982J331596J452904J444931
$$ 377256126 377364273 377503738 377786255 378306999 379119911 380222893 381554489 383007393 384452324
2956C84452324J314392J091156Q16689N31768K68097M5471j25961k44636l15895l51754
$$ 384452324 385766716 386857872 387674561 388206329 388474426 388519897 388393936 388149300 387833405 387481651
2966C87481651l68995l82958m02527m29191m62303n11780o03676p75948j063308j472588
$$ 387481651 387112656 386729698 386327171 385897980 385435677 384923897 384320221 383544273 382480965 381008377
2976C81008377j970520k484970k925911l210297l280182l104820k673607j991272j084137
$$ 381008377 379037857 376552887 373626976 370416679 367136497 364031677 361358070 359366798 358282661
2985C58282661j7395J095162K101250K846450L224411L209496K860145K284356J591148
$$ 358282661 358265266 359360428 361461678 364308128 367532539 370742035 373602180 375886536 377477684
2994C77477684Q57430J29318n51644j115646j462746j494369j167565n36689K47917
$$ 377477684 378335114 378464432 377912788 376797142 375334396 373840027 372672462 372135773 372383690
3003C72383690R86404J505204J717643J643639J383171J060028P68433N48553L92227
$$ 372383690 373370094 374875298 376592941 378236580 379619751 380679779 381448212 381996765 382388992
3012C82388992K71607J62925O0082l1128j03722j57547j99585k37159k73171l03764
$$ 382388992 382660599 382823524 382883606 382852478 382748756 382591209 382391624 382154465 381881294 381577530
3022C81577530l23792l30658l27835l22494l21961l30314l46985l68462l90472m10118
$$ 381577530 381253738 380923080 380595245 380272751 379950790 379620476 379273491 378905029 378514557 378104439
3032C78104439m25987m38614m48418m56429m64057m72985m87404n10978n47829n99136
$$ 378104439 377678452 377239838 376791420 376334991 375870934 375397949 374910545 374399567 373851738 373252602
3042C73252602o61049p25823p83386q26111q52890q70895q93250r33342r98954j087838
$$ 373252602 372591553 371865730 371082344 370256233 369403343 368532448 367639198 366705856 365706902 364619064
3052C64619064j189842j290741j380081j454773j519661j583404j652985j729317j806869
$$ 364619064 363429222 362138481 360758400 359303627 357783966 356200562 354547577 352818260 351011391
3061C51011391j876602j930886j967163j987915j998253k001533j996689j977425j936188
$$ 351011391 349134789 347203903 345236740 343248825 341250572 339249039 337252350 335274925 333338737
3070C33338737j869087j777534j669159j554108j440201j329460j217880j098366r65156
$$ 333338737 331469650 329692116 328022957 326468849 325028648 323699188 322481308 321382942 320417786
3079C20417786q16422o55556m88300l21617j60904r251J29757K54116L62358M54464
$$ 320417786 319601364 318945808 318457508 318135891 317974987 317965736 318095493 318349609 318711967 319166431
3089C19166431N32990O02245O66657P28569P88154Q42743Q90122R29413R61074R88656
$$ 319166431 319699421 320301666 320968323 321696892 322485046 323327789 324217911 325147324 326108398 327097054
3099C27097054J014175J039162J063461J085167J104278J121979J142121J169014J205520
$$ 327097054 328111229 329150391 330213852 331299019 332403297 333525276 334667397 335836411 337041931
3108C37041931J251526J303215J356125J405411J449547J490097J529312J569214J609115
$$ 337041931 338293457 339596672 340952797 342358208 343807755 345297852 346827164 348396378 350005493
3117C50005493J645813J676865J701584J722412J743355J766357J789284J805954J810951
$$ 350005493 351651306 353328171 355029755 356752167 358495522 360261879 362051163 363857117 365668068
3126C65668068J800880J779557J755256J736222J727676J727295J727791J721496J703301
$$ 365668068 367468948 369248505 371003761 372739983 374467659 376194954 377922745 379644241 381347542
3135C81347542J673965J638756J603661J572837J546784J523323J500854J478882J458931
$$ 381347542 383021507 384660263 386263924 387836761 389383545 390906868 392407722 393886604 395345535
3144C95345535J442566J430054J419678J407127J388626J361160J324692J281510J234855
$$ 395345535 396788101 398218155 399637833 401044960 402433586 403794746 405119438 406400948 407635803
3153D07635803J188965J146851J110649J081428J059151J042633J030197J019859J008568
$$ 407635803 408824768 409971619 411082268 412163696 413222847 414265480 415295677 416315536 417324104
3162D17324104R95293R79996R65957R57451R58100R68895R85870J001549J008072J001625
$$ 417324104 418319397 419299393 420265350 421222801 422180901 423149796 424135666 425137215 426145287 427146912
3172D27146912R84306R64203R52186R55391R74961J004562J034546J056709J068268
$$ 427146912 428131218 429095421 430047607 431002998 431977959 432982521 434017067 435073776 436142044
3181D36142044J072502J075669J082840J094360J105728J110611J104813J088066J064682
$$ 436142044 437214546 438290215 439373055 440467415 441573143 442683754 443788567 444876633 445941315
3190D45941315J039924J017113R95979R72977R45931R14955Q86345Q67576Q65021Q79021
$$ 445941315 446981239 447998352 448994331 449967308 450913239 451828194 452714539 453582115 454447136 455326157
3200D55326157R02786R22584R25713R04312Q59642Q02155P46193P04460O82182O76231
$$ 455326157 456228943 457151527 458077240 458981552 459841194 460643349 461389542 462094002 462776184 463452415
3210D63452415O77567O76079O66771O49872O30722O15425O07071O04477O03141N98870
$$ 463452415 464129982 464806061 465472832 466122704 466753426 467368851 467975922 468580399 469183540 469782410
3220D69782410N89714N77125N64499N55840N53093N56106N63507N72205N79300N82161
$$ 469782410 470372124 470949249 471513748 472069588 472622681 473178787 473742294 474314499 474893799 475475960
3230D75475960N78079N66978N51072N35240N25665N25284N32303N40237N40428N28260
$$ 475475960 476054039 476621017 477172089 477707329 478232994 478758278 479290581 479830818 480371246 480899506
3240D80899506N06172M83932M72985M81338N06706N37682N58968N59692N39093N06744
$$ 480899506 481405678 481889610 482362595 482843933 483350639 483888321 484447289 485006981 485546074 486052818
3250D86052818M77143M61959M64478M79050M94651N02320M98657M86069M71191M59099
$$ 486052818 486529961 486991920 487456398 487935448 488430099 488932419 489431076 489917145 490388336 490847435
3260D90847435M52728M52156M55094M59556M63333M63181M56009M38232M09775L74718
$$ 490847435 491300163 491752319 492207413 492666969 493130302 493593483 494049492 494487724 494897499 495272217
3270D95272217L40767L17383L10592L20625L41645L63121L76396L75938L63007L43323
$$ 495272217 495612984 495930367 496240959 496561584 496903229 497266350 497642746 498018684 498381691 498725014
3280D98725014L23982L10593L05252L06396L10745L15323L18642L21503L25927L32795
$$ 498725014 499048996 499359589 499664841 499971237 500281982 500597305 500915947 501237450 501563377 501896172
3290E01896172L42483L52936L61786L68042L72238L77922L88870M07715M34265M64363
$$ 501896172 502238655 502591591 502953377 503321419 503693657 504071579 504460449 504868164 505302429 505766792
3300E05766792M90876N06362N05906M87823M55055M13285L70407L34091L10020L01209
$$ 505766792 506257668 506764030 507269936 507757759 508212814 508626099 508996506 509330597 509640617 509941826
3310E09941826L05939L18756L31497L35922L26615L03688K70996K35595K02561J74408
$$ 509941826 510247765 510566521 510898018 511233940 511560555 511864243 512135239 512370834 512573395 512747803
3320E12747803J49269J23939R6321O7902M2420K4108J3466P439L81j3237l4065n9280
$$ 512747803 512897072 513021011 513117332 513185234 513227654 513251762 513265228 513272667 513273048 513259811 513225746 513166466
3332E13166466q2360r8648j06506j09749j14860j27564j50451j81084k13127k40097
$$ 513166466 513084106 512985458 512878952 512769203 512654343 512526779 512376328 512195244 511982117 511742020
3342E11742020k57340k63481k61421k56691k55852k64206k83890l13835l48282l80401
$$ 511742020 511484680 511221199 510959778 510703087 510447235 510183029 509899139 509585304 509237022 508856621
3352E08856621m02870m13094m12407m07982m07524m17251m37851m63715m86336m97131
$$ 508856621 508453751 508040657 507628250 507220268 506812744 506395493 505957642 505493927 505007591 504510460
3362E04510460m92439m75121m53720m38423m36363m49791m74625n03464n27878n41763
$$ 504510460 504018021 503542900 503089180 502650757 502214394 501764603 501289978 500786514 500258636 499716873
3372D99716873n42106n29938n08461m83399m60891m46892m44908m53835m67720m75578
$$ 499716873 499174767 498644829 498136368 497652969 497192078 496745186 496300278 495846443 495378723 494903145
3382D94903145m67377m37126l87878l32375k87895k70310k85263l25851l73116m04892
$$ 494903145 494435768 493998642 493610764 493278389 492990494 492720184 492434921 492109070 491735954 491331062
3392D91331062m03595l65562l01132k32392j82762j67923j89590k34299k81181l09181
$$ 491331062 490927467 490561905 490260773 490028381 489845619 489677696 489488106 489253807 488972626 488663445
3402D88663445l06664k75803k29110j84746j56250j48049j54724j64833j67846j59111
$$ 488663445 488356781 488080978 487851868 487667122 487510872 487362823 487208099 487043266 486875420 486716309
3412D86716309j41411j22948j11046j08223j09482j06315q9722n5885p706M5815R3040
$$ 486716309 486574898 486451950 486340904 486232681 486123199 486016884 485927162 485871277 485863571 485909386 486002426
3423D86002426J24703J36642J31378J17302J05210J04789J20735J52054J90659K26173
$$ 486002426 486127129 486263771 486395149 486512451 486617661 486722450 486843185 486995239 487185898 487412071
3433D87412071K48986K55050K47498K34756K24877K20794K19918K14424K00653J82457
$$ 487412071 487661057 487916107 488163605 488398361 488623238 488844032 489063950 489278374 489479027 489661484
3443D89661484J73111J88713K39219L20588M14085M95148N42526N50804N28870M95567
$$ 489661484 489834595 490023308 490262527 490583115 490997200 491492348 492034874 492585678 493114548 493610115
3453D93610115M67873M53453M49905M50478M50210M51088M58641M78478N11055N50384
$$ 493610115 494077988 494531441 494981346 495431824 495882034 496333122 496791763 497270241 497781296 498331680
3463D98331680N86167O07948O08101N84144N39742M87022M42925M26330M48113N03540
$$ 498331680 498917847 499525795 500133896 500718040 501257782 501744804 502187729 502614059 503062172 503565712
3473E03565712N70221O16684O17523N68199M89807M18930L87688M06723M61044N19944
$$ 503565712 504135933 504752617 505370140 505938339 506428146 506847076 507234764 507641487 508102531 508622475
3483E08622475N57289N66215N59235N56335N69191N93949O16569O25801O22254O16493
$$ 508622475 509179764 509745979 510305214 510861549 511430740 512024689 512641258 513267059 513889313 514505806
3493E14505806O19011O27251O25457N95475N31730M50897L85933L67394M05884M83818
$$ 514505806 515124817 515752068 516377525 516973000 517504730 517955627 518341560 518708954 519114838 519598656
3503E19598656N67131O24428O44302O39114O34499O50711O91948P44934P89070Q11424
$$ 519598656 520165787 520790215 521434517 522073631 522708130 523358841 524050789 524795723 525584793 526396217
3513E26396217Q10891P95555P74536P49855P15561O63414N92384N10521M34952L85475
$$ 526396217 527207108 528002663 528777199 529527054 530242615 530906029 531498413 532008934 532443886 532829361
3523E32829361L76701M15688N00564O21109P57905Q83102R66072R83467R32503Q40568
$$ 532829361 533206062 533621750 534122314 534743423 535501328 536384430 537350502 538333969 539266472 540107040
3533E40107040P57447P34024P92045R04732J002121J005020Q69942O22406L51067J66625
$$ 540107040 540864487 541598511 542390556 543295288 544297409 545302429 546172371 546794777 547145844 547312469
3543E47312469J43128K78854M98047O97632Q04710Q13942P78237P65037Q10242R00001
$$ 547312469 547455597 547734451 548232498 548930130 549734840 550548782 551327019 552092056 552902298 553802299
3553E53802299R92547J057853J100006J141663J183586J173020J016845O43730P6104
$$ 553802299 554794846 555852699 556952705 558094368 559277954 560450974 561467819 562111549 562187653
3562E62187653n38445r70077j013413n96046J71165J038933J730652K063141K010536
$$ 562187653 561649208 560679131 559665718 559069672 559240837 560279770 562010422 564073563 566084099
3571E66084099J687164J274490R38836P81517Q28285J040230J327171J558914J591644
$$ 566084099 567771263 569045753 569984589 570766106 571594391 572634621 573961792 575520706 577112350
3580E77112350J321526P47719R880o40946r44252p57713j39274O68907J355743J690254
$$ 577112350 578433876 579181595 579191475 578550529 577606277 576848564 576709290 577378197 578733940 580424194
3590E80424194J622849J283035Q86154O14815N43251O42319Q38890J071892J310615
$$ 580424194 582047043 583330078 584216232 584831047 585374298 586016617 586855507 587927399 589238014
3599E89238014J526604J662407J633835J377258R06258L36685j47095l70369k46544
$$ 589238014 590764618 592427025 594060860 595438118 596344376 596681061 596533966 596163597 595917053
3608E95917053J84059P68624J296386J567116J456032R66034K55585l79906n99785
$$ 595917053 596101112 596869736 598166122 599733238 601189270 602155304 602410889 602030983 601431198
3617F01431198j69067Q85544K209358L216743L342247K336350M40750j670036l181725
$$ 601431198 601262131 602147675 604357033 607573776 610916023 613252373 613693123 612023087 608841362
3626F08841362l514900k589989q36143J047554K431297L009987K857742K294159J681480
$$ 608841362 605326462 602736473 601900330 602947884 605379181 608389168 611246910 613541069 615222549
3635F15222549J275406J181069J380653J764031K133865K219620J748314N90820j098480
$$ 615222549 616497955 617679024 619059677 620823708 622957573 625177193 626925507 627516327 626417847
3644F26417847k851677m041481m166336l119164j273270O79894K062340K520866K150231
$$ 626417847 623566170 619524689 615358353 612239189 610965919 611645813 613708153 616229019 618379250
3653F18379250J380310P13424M77486P24602J283188J897697K344399K479286K236671
$$ 618379250 619759560 620472984 620950470 621675072 622958260 624855957 627200356 629679642 631916313
3662F31916313J623459P34024k44141j074562j573524j713638j650658j631126j824570
$$ 631916313 633539772 634273796 634029655 632955093 631381569 629667931 628017273 626386147 624561577
3671F24561577k187309k454834k288361j477966q5488J565895L041764L982353M216652
$$ 624561577 622374268 619919434 617631073 616153107 616067619 617633514 620675278 624657631 628874283
3680F28874283L758774K730026J291542l61595j963234l172112l649521l205566j924477
$$ 628874283 632633057 635363083 636654625 636293030 634329796 631157684 627508163 624302597 622378120
3689F22378120j75857J516151K683373L087120K767753J966172R85183Q4458n50118
$$ 622378120 622202263 623718414 626401787 629488907 632256660 634222832 635208015 635292473 634742355
3698F34742355p93495n81474M4975Q85391J586190J755371J154175j39771j707649
$$ 634742355 633948860 633367386 633412361 634297752 635883942 637639313 638793488 638653717 636946068
3707F36946068k945824l334503k680969j205254N70488K060738K853813K837677K176285
$$ 636946068 634000244 630665741 627984772 626779518 627350006 629410744 632264557 635102234 637278519
3716F37278519J184501J84326n89332j018028j077385q08449k94075L48816R71031
$$ 637278519 638463020 638647346 638058014 637039986 635962601 635154152 634860077 635208893 636179924
3725F36179924J397095J448517R89723K29j354409k698021l519973l363724k063713
$$ 636179924 637577019 639025536 640015259 640015488 638661079 635963058 632443085 629079361 627015648
3734F27015648Q8386K375794L923416M096260K829857O90918j392021k600556k638817
$$ 627015648 627104034 629479828 633403244 637499504 640329361 641020279 639628258 637027702 634388885
3743F34388885j848487r57489o15158r96705j719780k111701j653824l22800J383362
$$ 634388885 632540398 631582909 630967751 629971046 628251266 626139565 624485741 624162941 625546303
3752F25546303K737121L199044K706527J668854O96221K47383M06417Q99010J301003
$$ 625546303 628283424 631482468 634188995 635857849 636554070 636801453 637207870 638106880 639407883
3761F39407883J294174Q15506M6921p12281j193428j250190q76542j82380O40793J356773
$$ 639407883 640702057 641517563 641564484 640852203 639658775 638408585 637532043 637349663 637990456 639347229
3771F39347229J737289J638413J074905K40937n51987j013184j009826o27137j09863
$$ 639347229 641084518 642722931 643797836 644038773 643486786 642473602 641463776 640836639 640726776
3780F40726776K85263M31519L85208L17459L81927O05240Q78830J045838J017761Q30154
$$ 640726776 641012039 641443558 641828766 642146225 642528152 643133392 644012222 645058060 646075821 646905975
3790F46905975O00739M22134K77176M8676l81241j011124j676788k125931k172012
$$ 646905975 647506714 647928848 648206024 648254700 647873459 646862335 645185547 643059616 640887604
3799F40887604j814270j239968o98623l28369o8169K84500Q98209J737709K528801
$$ 640887604 639073334 637833366 637134743 636806374 636738205 637022705 637920914 639658623 642187424
3808F42187424K890243K560578J565933K22931j032562j872941k220459k219619k074967
$$ 642187424 645077667 647638245 649204178 649427109 648394547 646521606 644301147 642081528 640006561
3817F40006561j880302j563568r77097o4659J030045J995468K515564K452087J929093
$$ 640006561 638126259 636562691 635585594 635520935 636550980 638546448 641062012 643514099 645443192
3826F45443192J253662P28531M72106L63846J44272l94516j248321k174759k811737
$$ 645443192 646696854 647425385 647897491 648261337 648405609 648011093 646762772 644588013 641776276
3835F41776276k875519k311859j313896j98632P80754J561432K252388K979431L689347
$$ 641776276 638900757 636588898 635275002 635076370 635857124 637418556 639670944 642650375 646339722
3844F46339722M064178L625183K012863p14492l942719o649704p810020o865464m026031
$$ 646339722 650403900 654029083 656041946 655327454 651384735 644735031 636925011 630059547 626033516
3853F26033516k24114L267403N372543N640221M363251K352829N09872n79757q33970
$$ 626033516 625809402 629076805 634449348 640089569 644452820 646805649 647315521 646735764 645901794
3862F45901794n91201l36533m09470q40606j378327j664123j445999p10450L14179
$$ 645901794 645310593 644974060 644564590 643723984 642345657 640681534 639235535 638525085 638839264
3871F38839264J280365J883087J985550J646423J054230M18167j16730m93850p11746
$$ 638839264 640119629 642002716 643988266 645634689 646688919 647107086 646990356 646496506 645784760
3880F45784760p77054o90766m68216j74865P5149J73111R2468o7291j17493J09177
$$ 645784760 645007706 644316940 643848724 643673859 643749008 643922119 644014587 643947296 643829803 643938980
3890F43938980O37055J296615J782761J804275J230088J63345j101303k203369k851639
$$ 643938980 644576035 645872650 647655411 649459686 650689774 650853119 649751816 647548447 644696808
3899F44696808k909546k407303j497459l95851O77299J536141K062530K219543K045212
$$ 644696808 641787262 639379959 637882500 637486649 638163948 639700089 641762619 643982162 646027374
3908F46027374J625290J053772M10996k35138q08792j217347j375122j246719q85696
$$ 646027374 647652664 648706436 649117432 648882294 648073502 646856155 645481033 644234314 643348618
3917F43348618m23279j1902K50397L61786L95660M33502M97666N37872M73938K67181
$$ 643348618 642925339 642913437 643163834 643525620 643921280 644354782 644852448 645390320 645864258 646131439
3927F46131439l3569l06168m17480k94876L1509M40521P73545Q98132P61871M11988
$$ 646131439 646097870 645791702 645374222 645079346 645110855 645551376 646324921 647223053 647984924 648396912
3937F48396912k0981l76740n34515m70657k69318p3319m57p1793k04620k73438k01263
$$ 648396912 648375931 647999191 647464676 646994019 646724701 646651382 646650925 646579132 646374512 646101074 645899811
3948F45899811j3504J85165K88086K59934J48010K9068n8212j34430k38114l63006
$$ 645899811 645886307 646071472 646359558 646619492 646767502 646796570 646738358 646603928 646365814 646002808
3958F46002808m42963m01917k32238k3651R3078M9668r8877k14692j97372p4692J5335
$$ 646002808 645559845 645157928 644925690 644902039 644995117 645044785 644945908 644731216 644533844 644459152 644474487
3969F44474487m8294k46582m16717l89405j55944R1400J06125j87684n93872p79113
$$ 644474487 644426193 644179611 643762894 643373489 643217545 643308945 643415070 643227386 642633514 641854401
3979F41854401n66407j32217R3384k11411r28116j516494j448670p41005j04675m59747
$$ 641854401 641287994 641155777 641249161 641037750 640109634 638593140 637144470 636403465 636298790 635839043
3989F35839043k090454m126206m955788l554039r08775m06914o509781k2144508m6254349
$$ 635839043 633748589 629622383 624666595 621112556 620203781 619796867 613287086 591142578 544888229
3998E44888229p3147163r4384460
$$ 544888229 471741066 377356606
4000C77356606
$$ 377356606
##END=$$ End of the data block
