##TITLE=$$ Begin of the data block
##JCAMP-DX=5.00 $$ ACD/SpecManager v 10.08
##SPECTROMETER/DATA SYSTEM=16PC
##DATE=19 Jun 2013 11:59:48
##DATA TYPE=INFRARED SPECTRUM
##DATA CLASS=XYDATA
##ORIGIN=
##OWNER=
##NPOINTS=3601
##FIRSTX=400.00000000
##LASTX=4000.00000000
##MAXX=4000.00000000
##MINX=400.00000000
##MAXY=84.44392395
##MINY=9.19515991
##XFACTOR=1.0000000000
##YFACTOR=0.000000100000000
##FIRSTY=48.52767563
##DELTAX=1.00000000
##XUNITS=1/CM
##YUNITS=TRANSMITTANCE
##XYDATA=(X++(Y..Y))
400D85276756J23192787R5594330O0693665K9702682R996872K665100L566208O760636
$$ 485276756 608469543 704063873 764757538 794460220 804457092 807122192 810688400 817449036
408H17449036P995376O306839L297119J116944P52411J631698K443772K274856J171189
$$ 817449036 825444412 831751251 835048370 836165314 836917725 838549423 840993195 843268051 844439240
417H44439240j44654r82284j182557j075439j059723j231766j364669j185151o56890
$$ 844439240 844294586 843312302 842129745 841054306 839994583 838762817 837398148 836212997 835556107
426H35556107k0295M15726N19180L96729K46048J59531O0272j77613n52139q77151
$$ 835556107 835535812 835951538 836470718 836867447 837113495 837273026 837333298 837155685 836603546 835726395
436H35726395r03550n20172J34201P51114J050720R53904N98373K13547l7460j23749
$$ 835726395 834822845 834302673 834436874 835187988 836238708 837192612 837790985 838004532 837967072 837843323
446H37843323j02158l0136P3929J99814K90298K43988j5564m53262r05609j163941
$$ 837843323 837741165 837711029 837784958 837984772 838275070 838519058 838503494 838050232 837144623 835980682
456H35980682j100692p50809k85874R6512K85645K96402K22778J52893J18561J03455
$$ 835980682 834879990 834129181 833843307 833939819 834225464 834521866 834744644 834897537 835016098 835119553
466H35119553Q4991O8054P8049J30615K14997K99911L63998M05732M32434M37088L89938
$$ 835119553 835204544 835272598 835350647 835481262 835696259 835996170 836360168 836765900 837198334 837635422 838025360
477H38025360K67563Q9645o4849r4071O0043L58658O67115Q18939P09076L53088j17722
$$ 838025360 838292923 838382568 838317719 838223648 838283691 838642349 839309464 840128403 840837479 841190567 841072845
488H41072845n25436p33108p06940n19180l01438j74942j93100l25241m75311n37796
$$ 841072845 840547409 839814301 839107361 838588181 838286743 838111801 837918701 837593460 837118149 836580353
498H36580353m51584k29340M9591K83966M03138M01764L32260K69851K65427L23715
$$ 836580353 836128769 835899429 835949020 836232986 836636124 837037888 837370148 837639999 837905426 838229141
508H38229141M10156M79584M98352M56391L56063K06833K1744j71509l33328m24347
$$ 838229141 838639297 839118881 839617233 840073624 840429687 840636520 840658264 840486755 840153427 839729080
518H39729080m25949l55072k54288j63650r8648m3335K1591R2926J31302Q3237p7057
$$ 839729080 839303131 838948059 838693771 838530121 838431473 838388138 838409729 838502655 838633957 838717194 838640137
529H38640137l17002n51300o79702o39573m38385j49307J28784L15934L81469L49274
$$ 838640137 838323135 837771835 837092133 836452560 836014175 835864868 835993652 836309586 836691055 837040329
539H37040329K76871K24838K29034K84043L45382L47825K42919K8534k34375m43954
$$ 837040329 837317200 837542038 837771072 838055115 838400497 838748322 838991241 839019775 838785400 838341446
549H38341446n03769l77731j16272J62735L33099L26614J66550m7912j99585k20795
$$ 838341446 837837677 837459946 837343674 837506409 837839508 838166122 838332672 838284760 838085175 837864380
559H37864380j27564n645M4860l1356k11029m05121n06745m52270k54669M425K18124
$$ 837864380 837736816 837731171 837776031 837744675 837533646 837128525 836621780 836169510 835914841 835919266 836137390
570H36137390L12424K83356J88980J10397R6588J35574J65635J21841j7395k09274
$$ 836137390 836449814 836733170 836922150 837032547 837129135 837264709 837430344 837552185 837534790 837325516
580H37325516l72925m38156l90320k79770j88827j82114k70462m06036n14527n34592
$$ 837325516 836952591 836514435 836124115 835844345 835655518 835473404 835202942 834796906 834282379 833747787
590H33747787m45022k71225o7291J06506K01645J95007R2545o8283k29187l29438l29589
$$ 833747787 833302765 833031540 832964249 833070755 833272400 833467407 833559952 833491669 833262482 832933044 832603455
601H32603455k30484p3319Q1482J77765J90201J24588J2130j10015k11487k71301k83738
$$ 832603455 832372971 832299652 832381134 832558899 832749100 832873688 832885818 832775803 832564316 832293015 832009277
612H32009277k60467k29492k29874k89230m04740n31158n95932n35355l32870l4561
$$ 832009277 831748810 831519318 831289444 831000214 830595474 830064316 829468384 828933029 828600159 828565598
622H28565598K66952M76914N40161M59442K82364P1945j23596k78168l84750m41590
$$ 828565598 828832550 829309464 829849625 830309067 830591431 830663376 830539780 830261612 829876862 829435272
632H29435272m50668m16031l50342k71225j95694j38015j10169j24206j92338l14178
$$ 829435272 828984604 828568573 828218231 827947006 827751312 827613297 827503128 827378922 827186584 826872406
642H26872406m66843o02951o71615o43997n33677l91845k76184k14844j95084j76544
$$ 826872406 826405563 825802612 825130997 824487000 823953323 823561478 823285294 823070450 822875366 822698822
652H22698822j27945n2338J6633M4326K6932k441l434L1586N4321k2125k68707o82373
$$ 822698822 822570877 822518539 822535172 822579498 822606430 822603989 822600555 822632141 822686462 822664337 822395630 821713257
664H21713257j163178j542282j656723j425781r01642k56958K86942N52978M89197
$$ 821713257 820550079 819007797 817351074 815925293 815023651 814766693 815053635 815606613 816095810
673H16095810J86844j70746m06876m45861l45917k50931k90833m93087p63016r49249
$$ 816095810 816282654 816111908 815705032 815259171 814913254 814662323 814371490 813878403 813115387 812166138
683H12166138r46198p62558n09338l21961k72216l40882m59137n79300p08236q82569
$$ 812166138 811219940 810457382 809948044 809626083 809353867 809012985 808553848 807974548 807266312 806383743
693H06383743j106262j329956j486511j564636j647339j860428k269058k806931l316421
$$ 806383743 805277481 803947525 802461014 800896378 799249039 797388611 795119553 792312622 788996201
702G88996201l685685l969497m384995n141449o249695p485504q608246r718170j1472015
$$ 788996201 785310516 781341019 776956024 771814575 765564880 758079376 749471130 739752960 728280945
711G28280945j4885178k0696716k8590088l6766472m2250213m1953583l4077950j9196968
$$ 728280945 713395767 692699051 664108963 627342491 585092278 543138695 509060745 489863777
719D89863777m66804J7218475K8834496L0985145K3163948Q055077r233399k2775764
$$ 489863777 489396973 506615448 535449944 566435089 589599037 597654114 588420715 565644951
727E65644951k7763634k2124214p247620J2502671L1362304M4232750M8425751M4354019
$$ 565644951 537881317 515757103 508509483 521012154 552374458 596607208 645032959 689386978
735F89386978L4935532K4076385J4998169R200821O411972N349961M714279L844986
$$ 689386978 724322510 748398895 763397064 772597885 779009857 784359818 789074097 792919083
743G92919083K786026J908111J468125J405716J451034J369553J122741Q39386O62613
$$ 792919083 795705109 797613220 799081345 800487061 801938095 803307648 804430389 805269775 805932388
752H05932388O21796O28586N74951M34723K75345J86844J96838K51617K69013K15225
$$ 805932388 806554184 807182770 807757721 808192444 808467789 808654633 808851471 809103088 809372101 809587326
762H09587326J32828R8190J50986K54974L25394K95792J65939n34j25427j66169j31988
$$ 809587326 809720154 809818344 809969330 810224304 810549698 810845490 811011429 811010895 810885468 810719299 810587311
773H10587311n7297L2501J31836K39029L37067L87649L60642K61688J39694O1417O8436
$$ 810587311 810530014 810562515 810694351 810933380 811270447 811658096 812018738 812280426 812420120 812481537 812549973
784H12549973J51519K57645L26080L21961K52914J50757M6158m7226j25351j74637
$$ 812549973 812701492 812959137 813285217 813607178 813860092 814010849 814057007 814009781 813884430 813709793
794H13709793j53198j145L24479Q01010J310882J653977J617660J080170R4910j090622
$$ 813709793 813556595 813555450 813879929 814680939 815991821 817645798 819263458 820343628 820438538 819347916
804H19347916k116623k660446k583390j987304j147461l53089K39868O55747J014862
$$ 819347916 817231293 814570847 811987457 810000153 808852692 808499603 808739471 809395218 810410080
813H10410080J383820J676483J683120J218338K89612q47549j787186k182236j924209
$$ 810410080 811793900 813470383 815153503 816371841 816661453 815813904 814026718 811844482 809920273
822H09920273j186066l06473M06876Q16956R71832R98993R78546Q87756O50406K33917
$$ 809920273 808734207 808427734 808834610 809651566 810623398 811622391 812600937 813488693 814139099 814373016
832H14373016k80227p22657r30557q47397n54504k18430J2284Q3313M6463N798L9749
$$ 814373016 814092789 813370132 812439575 811592178 811037674 810819244 810831528 810914841 810961304 810967102 811006851
843H11006851J56021K95029L75290L42636J96762j2817k14234l43780l66135k83279
$$ 811006851 811162872 811457901 811833191 812175827 812372589 812359772 812145538 811801758 811435623 811152344
853H11152344j29547M2343J77078K38495K17056J28708N875j21613k32620l16086l62854
$$ 811152344 811022797 811065140 811242218 811480713 811697769 811826477 811832352 811710739 811478119 811162033 810799179
864H10799179l61557l03574j89437m1657J00708J94702K11792J51825M2801p4234j62964
$$ 810799179 810437622 810134048 809944611 809902954 810003662 810198364 810410156 810561981 810604782 810530548 810367584
875H10367584k05383k04620j79139j51748j39771j51520j83105k21329k42996k23618
$$ 810367584 810162201 809957581 809778442 809626694 809486923 809335403 809152298 808930969 808687973 808464355
885H08464355j44882n417J72196L45688M66537M99649M39377L12882J67770N2414n341
$$ 808464355 808319473 808314056 808486252 808831940 809298477 809798126 810237503 810550385 810718155 810770569 810765228
896H10765228o180K4338N1041M7531M807o6376j40228j90125j95465j49841o4850L4332
$$ 810765228 810759048 810783386 810834427 810881958 810886765 810820389 810680161 810490036 810294571 810144730 810079880 810114212
908H10114212J17340J58768J50070J00021L3341k4567n7754o4926n6229m1351k5101
$$ 810114212 810231552 810390320 810540390 810640411 810673752 810649185 810591431 810526505 810470276 810428925 810403824
919H10403824l204K8610O7062R8496J07116Q3008L3112j9760m9439l8757P629O5766
$$ 810403824 810400620 810429230 810496292 810594788 810701904 810784912 810818024 810798264 810748825 810710068 810717697 810783463
931H10783463J01852R0790K6474p1945j70670k33765k37655j79749p8049L8605J40000
$$ 810783463 810885315 810976105 811002579 810930634 810759964 810526199 810288544 810108795 810030746 810069351 810209351
942H10209351K03628K20108J90888J25274L8224n2948j29776j77536j90888j76315
$$ 810209351 810412979 810633087 810823975 810949249 810987473 810934525 810804749 810627213 810436325 810260010
952H10260010j52893j41678j54648j86844k18353k26135j99585j48697j01700q5220
$$ 810260010 810107117 809965439 809810791 809623947 809405594 809179459 808979874 808831177 808729477 808644257
962H08644257j09101j55716j89590j76392j04904K976J02615J49689J23291L8681n9281
$$ 808644257 808535156 808379440 808189850 808013458 807908554 807911530 808014145 808163834 808287125 808325806 808266525
973H08266525j22833j21994o1798K1820Q4000R1629M2038m1657j22986j73645j87073
$$ 808266525 808143692 808021698 807959900 807981720 808065720 808157349 808199387 808157730 808034744 807861099 807674026
984H07674026j74026j54724j42059j33896j21842r6512o1493l1509k2278m1275p8430
$$ 807674026 807500000 807345276 807203217 807069321 806947479 806850967 806789474 806757965 806735687 806694412 806615982
995H06615982j12076j19629r0255k9297M2801J02157J30005J20468P7744J5030n4169
$$ 806615982 806503906 806384277 806294022 806264725 806307526 806409683 806539688 806660156 806737900 806752930 806698761
1006H06698761j18942j75019k22778k63977k97241l15552l06244k57797j68076n0811
$$ 806698761 806579819 806404800 806182022 805918045 805620804 805305252 804999008 804741211 804573135 804522324
1016H04522324O6757J50757J74942J32904M0054p2098j68991k24380k28272j84479
$$ 804522324 804589081 804739838 804914780 805047684 805087738 805015640 804846649 804622269 804393997 804209518
1026H04209518j09634k3651N1422R8267J06353P5684J5411n6686j23825j73111k00577
$$ 804209518 804099884 804076233 804127655 804225922 804332275 804407959 804423370 804366684 804242859 804069748 803869171
1037H03869171k08282k02103j88522j74637j71662j92565k49329l41339m49219n36194
$$ 803869171 803660889 803458786 803270264 803095627 802923965 802731400 802482071 802140732 801691513 801155319
1047H01155319n60760m92935l35236j22376Q9493K44293L09220K84500J97678Q8958
$$ 801155319 800594559 800101624 799766388 799644012 799733505 799977798 800287018 800571518 800769196 800858154
1057H00858154p324p2250j03684j09253r9716q5678p7896q5068j12762j59073k14234
$$ 800858154 800850830 800778580 800674896 800565643 800465927 800380249 800302353 800217285 800104523 799945450 799731216
1068G99731216k62451k91748l00216k95563k92130k96936l03726k95029k51617j64337
$$ 799731216 799468765 799177017 798876801 798581238 798289108 797992172 797688446 797393417 797141800 796977463
1078G96977463m3488Q4610J89896K49481K58255K29721J84250J42746J16577J05896
$$ 796977463 796933975 797018585 797208481 797457962 797716217 797945938 798130188 798272934 798389511 798495407
1088G98495407J04981J05362J01547R6054R5901J11618J50376K10113K76642L26920
$$ 798495407 798600388 798705750 798807297 798903351 798999252 799110870 799261246 799471359 799748001 800074921
1098H00074921L37295K95487K07672R7198m120p1792r8801r4910q0795p2403p4692
$$ 800074921 800412216 800707703 800915375 801012573 801008453 800936661 800837860 800742950 800662155 800589752 800515060
1109H00515060p9269p5302o1112m5623m6921p8278j35727j97067k29797k09351j32675
$$ 800515060 800435791 800360489 800299377 800253754 800206833 800128555 799992828 799795761 799565964 799356613 799223938
1120G99223938k3499P7439J30691J17035M3869n8670j53885k14691k33154k18811j89591
$$ 799223938 799200439 799277878 799408569 799525604 799569473 799510803 799356918 799142227 798909073 798690262 798500671
1131G98500671j60064j35193j12457q5679n2642j7624J0986K3880J4954j8692p4616
$$ 798500671 798340607 798205414 798092957 798007278 797954636 797937012 797947998 797971878 797986832 797968140 797893524
1142G97893524j47629k29416l09829l78266m25338m46167m39682m08173l54614k84271
$$ 797893524 797745895 797516479 797206650 796828384 796403046 795956879 795517197 795109024 794754410 794470139
1152G94470139k03705j24283o0349k4414k0828m1809o8665q0947o8207l2959Q011L7002
$$ 794470139 794266434 794142151 794081802 794057388 794036560 793994751 793926086 793845139 793776932 793743973 793751984 793788986
1164G93788986M3717L0594O790k2202n8746j10321j78299k46887k83738k52914j36642
$$ 793788986 793832703 793863297 793870087 793847885 793789139 793678818 793500519 793253632 792969894 792716980 792580338
1175G92580338N0354K61535M36859N28717N23377M41665L24707K13547J29166P1106
$$ 792580338 792630692 792892227 793329086 793857803 794381180 794822845 795147552 795361099 795490265 795561371
1185G95561371K6779j7242o4774j11237j48391j73111j88904k03018k22473k50702
$$ 795561371 795588150 795570908 795506134 795394897 795246506 795073395 794884491 794681473 794459000 794208298
1195G94208298k87171l29361l75671m24652m73557n14831n37338n29709m84162m03366
$$ 794208298 793921127 793591766 793216095 792791443 792317886 791803055 791265717 790736008 790251846 789848480
1205G89848480k96249j79444o8054K8153J04446J60294J95846K10038K00729J70059
$$ 789848480 789552231 789372787 789304733 789332886 789437332 789597626 789793472 790003510 790204239 790374298
1215G90374298J24970P6370L5248N569j4572l2578n2490p2861q7051q9569q1635p3394
$$ 790374298 790499268 790575638 790610886 790616455 790601883 790569305 790516815 790443954 790356903 790267334 790185699 790112305
1227G90112305p4921q8348j04294j01624o5155O104R3002J62430J86081J51596P2479
$$ 790112305 790037384 789949036 789844742 789743118 789677963 789684067 789777069 789939499 790125580 790277176 790349655
1238G90349655k1744r9792j38931j36261j04447o2485k8533j2818j5106k7695l9901
$$ 790349655 790327911 790228119 790089188 789952927 789848480 789785995 789757462 789744644 789729538 789701843 789661942
1249G89661942m3641l9520l6392m8599q7052j51977k30789l01972l47061l57208l38669
$$ 789661942 789618301 789578781 789542389 789493790 789406738 789254761 789023972 788722000 788374939 788017731 787679062
1260G87679062l05176k72522k47269k30712k16523k02560j90735j84174j85012j90049
$$ 787679062 787373886 787101364 786854095 786623383 786406860 786204300 786013565 785829391 785644379 785454330
1270G85454330j91116j81732j59454j30768j07117r9258j12839j45493j88293k30713
$$ 785454330 785263214 785081482 784922028 784791260 784684143 784584885 784472046 784326553 784138260 783907547
1280G83907547k64893k90069l13187l42636l85513m39987m96445n41077n65033n68695
$$ 783907547 783642654 783352585 783039398 782696762 782311249 781871262 781374817 780833740 780268707 779700012
1290G79700012n66177n74570o05697o56205p06482p32422p14035o48498n50919m43725
$$ 779700012 779133835 778559265 777953568 777297363 776590881 775858459 775144424 774495926 773945007 773501282
1300G73501282l45993k62451j84327r6054J3657J44195K85492M23966N48324O53534
$$ 773501282 773155289 772892838 772708511 772612457 772626114 772770309 773055801 773479767 774028091 774681625
1310G74681625P37305P95975Q21609Q09250P60727O91223O24008N81818N72662N84031
$$ 774681625 775418930 776214905 777036514 777845764 778606491 779297714 779921722 780503540 781076202 781660233
1320G81660233N90286N63659M91562L82996K64740J64642R9106O1798K9145k9831j38627
$$ 781660233 782250519 782814178 783305740 783688736 783953476 784118118 784217224 784279022 784308167 784278336 784139709
1331G84139709l04183n13459p37076r38644j084976j156769j155853j104508j038437
$$ 784139709 783835526 783322067 782584991 781646347 780561371 779404602 778248749 777144241 776105804
1340G76105804r95559j001206j060257j158142j265716j349716j381455j339416j213913
$$ 776105804 775110245 774109039 773048782 771890640 770624924 769275208 767893753 766554337 765340424
1349G65340424j006470p32956m24576j27182J07193K28653K03400K3117k90222o87027
$$ 765340424 764333954 763600998 763176422 763049240 763156433 763385086 763588486 763611603 763321381 762634354
1359G62634354j100693j461411j711654j814804j753617j527099j142426o18439L510
$$ 762634354 761533661 760072250 758360596 756545792 754792175 753265076 752122650 751504211 751507721
1368G51507721O51169J223297J614609J760406J671372J446304J240539J203309J411666
$$ 751507721 752158890 753382187 754996796 756757202 758428574 759874878 761115417 762318726 763730392
1377G63730392J830368K324753K714310K847137K661210K204818J613846J055832O65283
$$ 763730392 765560760 767885513 770599823 773446960 776108170 778312988 779926834 780982666 781647949
1386G81647949M95911N06210N87769O17370N17121K87780N036k25144l24325k79923
$$ 781647949 782143860 782650070 783237839 783855209 784372330 784660110 784665146 784440002 784115677 783835754
1396G83835754j47857j4725M9896K5940n6228j45951k04544k24304k23846k30332k58179
$$ 783835754 783687897 783673172 783723068 783749008 783692780 783546829 783342285 783117981 782894135 782663803 782405624
1407G82405624l03573l48053l73383l76358l77350m19998n54046q04215j145859j497421
$$ 782405624 782102051 781753998 781380615 781004257 780626907 780206909 779652863 778848648 777702789 776205368
1417G76205368j746750j816559j711960j540222j463928j617966k036666k635804l263702
$$ 776205368 774458618 772642059 770930099 769389877 767925949 766307983 764271317 761635513 758371811
1426G58371811l785858m143753m360810m494476m585876m639512m638977m576339m453507
$$ 758371811 754585953 750442200 746081390 741586914 737001038 732361526 727722549 723146210 718692703
1435G18692703m263153l978271l574753l080292k609482k327499k355194k680893l156967
$$ 718692703 714429550 710451279 706876526 703796234 701186752 698859253 696504059 693823166 690666199
1444F90666199l617173m025115m546204n447083o881866q727722j0639038j2333718
$$ 690666199 687049026 683023911 678477707 673030624 666148758 657421036 646781998 634448280
1452F34448280j3940162j6116524j9757996k5363273l2398911l9084205m2834893m1268081
$$ 634448280 620508118 604391594 584633598 559270325 526871414 487787209 444952316 403684235
1460D03684235l3334198k0040779m397164R466286J7689209J8081016J1023178m77256
$$ 403684235 370350037 350309258 345912094 355378380 373067589 391148605 402171783 401694527
1468D01694527j1653557j7542458j4744720k746773J5752449L5733872N1674461N9572334
$$ 401694527 390040970 372498512 357753792 355007019 370759468 406493340 458167801 517740135
1476E17740135N8302574M9736710L7633209K5900803J7104568J1859589R237671P764587
$$ 517740135 576042709 625779419 663412628 689313431 706417999 718277588 727515259 735279846
1484G35279846O362915M756317L276825K359619K134705K349091K574463K495574K060853
$$ 735279846 741642761 746399078 749675903 752035522 754170227 756519318 759093781 761589355 763650208
1493G63650208J443252Q91342N90821O09817R01108J326446J683808J755371J405716
$$ 763650208 765093460 765984802 766575623 767185440 768086548 769412994 771096802 772852173 774257889
1502G74257889O77795j72806p73239q21533k64587O57730J537246K021866J991730
$$ 774257889 774935684 774762878 773989639 773168106 772903519 773561249 775098495 777120361 779112091
1511G79112091J584015J067200O60858M28085K93350J46866n5084k65045l95737l88031
$$ 779112091 780696106 781763306 782424164 782852249 783145599 783292465 783237381 782972336 782576599 782188568
1521G82188568k46200k2126K23923M43039N92804O29044N22155K88849J2360j86463
$$ 782188568 781942368 781920242 782144165 782587204 783180008 783809052 784331207 784620056 784632416 784445953
1531G84445953k21176j08795J8082j9379l29895q68378j434402j767044j675186j132965
$$ 784445953 784224777 784115982 784134064 784114685 783784790 782916412 781482010 779714966 778039780 776906815
1541G76906815k92511N90896J267166J585465J540451J251144R05457O75049O41250
$$ 776906815 776614304 777205200 778472366 780057831 781598282 782849426 783754883 784429932 785071182
1550G85071182P55158Q52279P32804K71377m90951j329651j917496j972885j403198
$$ 785071182 785826340 786678619 787411423 787682800 787191849 785862198 783944702 781971817 780568619
1559G80568619l69721P69577J607895J867142J511841P51953o5155o15616p41653n05143
$$ 780568619 780198898 780968475 782576370 784443512 785955353 786707306 786642151 786026535 785284882 784779739
1569G84779739j33285J08490N9433k60697o70166r31625q84705n27038p630M63181
$$ 784779739 784646454 784754944 784814377 784553680 783883514 782951889 782067184 781540146 781532516 781995697
1579G81995697P27692P52945O21872M66003L79715L79028M17023M31824L94668L19596
$$ 781995697 782723389 783476334 784098206 784564209 784943924 785322952 785739975 786171799 786566467 786886063
1589G86886063K43225J92566J70593J61667J49154J28022J03149Q2245P1182P3700
$$ 786886063 787129288 787321854 787492447 787654114 787803268 787931290 788034439 788116684 788187866 788261566
1599G88261566R2468J24207J53122J51672R9564N264q1711r1171J7777K15454L96881
$$ 788261566 788354034 788478241 788631363 788783035 788882599 788887863 788806152 788714981 788732758 788948212 789345093
1610G89345093M30298K39486j36108n45883p99485p73544m79507n9967K88925M20761
$$ 789345093 789775391 790014877 789878769 789332886 788533401 787759857 787280350 787220383 787509308 787930069
1620G87930069L05939L4637k42538l89633l38822j05362K33231N66330P77511P69959
$$ 787930069 788236008 788270645 788028107 787638474 787299652 787194290 787427521 787993851 788771362 789541321
1630G89541321M95834j2436o25610j138153j333542j078796m05655M74929J239548
$$ 789541321 790037155 790024719 789399109 788260956 786927414 785848618 785442963 785917892 787157440
1639G87157440J588669J387939P46155k3880n53207o03409k02713L59955O83746M84772
$$ 787157440 788746109 790134048 790880203 790856323 790303116 789699707 789496994 789856949 790540695 791025467
1649G91025467k25067j116257j700211j596679p55310M95071J610794K117920J859665
$$ 791025467 790800400 789684143 787983932 786387253 785631943 786127014 787737808 789855728 791715393
1658G91715393J062241J86386l41873l57132r690L71170N00260L06396n9967l56445
$$ 791715393 792777634 792964020 792622147 792265015 792255325 792626495 793126755 793433151 793373184 793016739
1668G93016739m26941k94266j14136m0893j00708j71738q7204K24457O49948R36585
$$ 793016739 792589798 792295532 792181396 792140503 792039795 791868057 791780853 792005310 792655258 793591843
1678G93591843Q40149K85797n55802j338272j709747j490631p59812J92643J013412
$$ 793591843 794431992 794717789 794161987 792823715 791113968 789623337 788863525 789056168 790069580
1687G90069580J447983J436386J095734O27288J99662j21231l67203n99747q42972
$$ 790069580 791517563 792953949 794049683 794676971 794876633 794755402 794388199 793788452 792945480
1696G92945480j044922j107406r50775n77545r0180L51639O07910O29807M82406L06091
$$ 792945480 791900558 790793152 789842377 789264832 789174652 789526291 790134201 790764008 791246414 791552505
1706G91552505K35596L26920N24139O86417O61621L64990j68152p85522j273117j440506
$$ 791552505 791788101 792115021 792639160 793325577 793987198 794352188 794184036 793398514 792125397 790684891
1716G90684891j203842o27442R2926P07703J021957R79309O87332L53318J68228J94092
$$ 790684891 789481049 788853607 788946533 789654236 790676193 791655502 792342834 792696152 792864380 793058472
1726G93058472L29895L75747J62430l25241r17435j343078j381302r94568l52554K56729
$$ 793058472 793388367 793764114 793926544 793601303 792683868 791340790 789959488 788964920 788612366 788869095
1736G88869095N89599N72815L23410O1112l4256P4997K80990M11911L46604Q9264k42157
$$ 788869095 789458694 790031509 790354919 790416031 790381775 790456772 790737762 791149673 791496277 791585541 791343384
1747G91343384m86832n31616l62625n8899K56653M79736N57022M94461L37296J42517
$$ 791343384 790856552 790324936 789962311 789903412 790160065 790639801 791196823 791691284 792028580 792171097
1757G92171097l4104j48239j68152q1787R5597L14254M94156N49927M20990J09482
$$ 792171097 792136993 791988754 791820602 791738815 791834412 792148666 792642822 793192749 793613739 793723221
1767G93723221l07694o97937r21096q88520o06613j71204K68784N79376O89316O07910
$$ 793723221 793415527 792717590 791796494 790907974 790301361 790130157 790398941 790978317 791667633 792275543
1777G92275543M01306J54419n9662j93252k20795j38778K8457K17896L37448L02124
$$ 792275543 792676849 792831268 792771606 792578354 792357559 792218781 792247238 792465134 792802582 793104706
1787G93104706Q2321k61536n93109p60498o77185l73459J2131L02124L74603K21176
$$ 793104706 793187027 792925491 792332382 791571884 790894699 790521240 790533371 790835495 791210098 791431274
1797G91431274n3024k91519l72543k65122l5629J95694L21731K96021J46713m8904
$$ 791431274 791378250 791086731 790714188 790449066 790413437 790609131 790930862 791226883 791373596 791324692
1807G91324692k08512k82211k68402k03552j33896q8501o7902n0659j5259M3259J09177
$$ 791324692 791116180 790833969 790565567 790362015 790228119 790139618 790071716 790021057 790005798 790049057 790158234
1818G90158234J58920J79596J75934J62506J48086J24741P4615p095r7885j50070j21155
$$ 790158234 790317154 790496750 790672684 790835190 790983276 791108017 791182632 791175537 791077652 790927582 790806427
1829G90806427m578J56784K92206L46833L16619K48642K01493J98135K02103J44195
$$ 790806427 790801849 790958633 791250839 791597672 791914291 792162933 792364426 792562561 792764664 792908859
1839G92908859k3346k77176n19790o30646n37338k64054P8965L54385M70581M22592
$$ 792908859 792885513 792608337 792088547 791457901 790920563 790656509 790735474 791089859 791560440 791983032
1849G91983032K78702J30005L5400l128k3956o5765j36033k03628k21253j60064l1739
$$ 791983032 792261734 792391739 792427139 792424011 792400055 792334290 792198257 791994629 791773376 791613312 791581573
1860G91581573J10322J93252J62506P782k24838m48227n72052n41382l65448j13830
$$ 791581573 791691895 791885147 792047653 792055435 791830597 791382370 790810318 790268936 789903488 789789658
1870G89789658J16119K42386K36358J28022j6251j33591j92718k00958j85700j75247
$$ 789789658 789905777 790148163 790384521 790512543 790496292 790362701 790169983 789969025 789783325 789608078
1880G89608078j81503k06452k50549l17001m09851n20173o23550o88324o92825o40412
$$ 789608078 789426575 789220123 788969574 788652573 788242722 787722549 787098999 786410675 785717850 785077438
1890G85077438n54733m64554l84216l06244k12555r2316M2878J65786K50473K88697
$$ 785077438 784522705 784058151 783673935 783367691 783155136 783062820 783105698 783271484 783521957 783810654
1900G83810654K95791K93579K95258K94952K77253K35672J84249J54191J70516K33841
$$ 783810654 784106445 784400024 784695282 784990234 785267487 785503159 785687408 785841599 786012115 786245956
1910G86245956L11509L56521L33328K40860J12992k747p1716q8501p4082n4550m1809
$$ 786245956 786557465 786913986 787247314 787488174 787601166 787598419 787526703 787438202 787364120 787309570 787267761
1921G87267761k6474J0681Q2169J75629K58407K93732K60315J66092M8294m7531q4610
$$ 787267761 787241287 787251968 787334137 787509766 787768173 788061905 788322220 788488312 788536606 788489075 788404465
1932G88404465n3788K4186J09253J58462J45874P2251l5630j36413j92185j83105j17340
$$ 788404465 788350677 788374863 788484116 788642578 788788452 788860703 788825073 788688660 788496475 788313370 788196030
1943G88196030k4491N8441J02463R9945O6758K8533Q316J4115L5400N2338M8981K1209
$$ 788196030 788171539 788229980 788332443 788432388 788499146 788527679 788535995 788550110 788585510 788637848 788686829 788708038
1955G88708038j9073n3406o6147n3406k6016j678N035r384l4332n0431m0741J53O0959
$$ 788708038 788688965 788635559 788569412 788516006 788489990 788488312 788493347 788483963 788449631 788399200 788358459 788358612 788419571
1968G88419571J18637J47552J34354Q2016J0224n3940r1095r6665q0642o0883n0278
$$ 788419571 788538208 788685760 788820114 788902130 788912354 788858414 788767319 788670654 788590012 788529129 788478851
1979G88478851m8904m7684l4714o713K8457N2796N0811J7090l7765r5291j36948j52817
$$ 788478851 788429947 788382263 788347549 788340836 788369293 788422089 788472900 788489990 788452225 788356934 788219986 788067169
1991G88067169j48773j38474j35726j47858j71509j94626k07519k04163j90964j82190
$$ 788067169 787918396 787779922 787644196 787496338 787324829 787130203 786922684 786718521 786527557 786345367
2001G86345367j93176k35748l10211m07639n13077o12259o98318p70721q33436q86535
$$ 786345367 786152191 785916443 785606232 785198593 784685516 784073257 783374939 782604218 781770782 780884247
2011G80884247r20105r18884q64029p46308n71823l62396j50147L5172J75171K67639
$$ 780884247 779964142 779045258 778181229 777434921 776863098 776500702 776350555 776385727 776560898 776828537
2021G76828537L22571L55911L81012M03137M20609M28467M22821M04281L77350L49045
$$ 776828537 777151108 777507019 777888031 778291168 778711777 779140244 779563065 779967346 780344696 780693741
2031G80693741L22952K99759K76794K49100K14691J75476J39695J17111J15967J36413
$$ 780693741 781016693 781316452 781593246 781842346 782057037 782232513 782372208 782489319 782605286 782741699
2041G82741699J70899K04162K20795K11945J80740J37710J00174P8431P5607Q3160
$$ 782741699 782912598 783116760 783337555 783549500 783730240 783867950 783968124 784046555 784122162 784205322
2051G84205322R0637Q8578P6751O1112N0278M8828N5084O1111O0273N0659L6697K7008
$$ 784205322 784295959 784384537 784461288 784522400 784572678 784621506 784676590 784737701 784797974 784848633 784885330 784912338
2063G84912338K8534M2038O2866Q3390R7503J02845J01623R4833Q1635N9509K4872
$$ 784912338 784940872 784982910 785045776 785129166 785226669 785329514 785431137 785525970 785607605 785667114 785691986
2074G85691986j9302o2180r0408r0027n6992r15N9128J00326J08261Q3466M0359L06
$$ 785691986 785672684 785610504 785520096 785430069 785373077 785372162 785431290 785531616 785639877 785723343 785763702 785764008
2086G85764008j9913j6556Q39J5869J6861L739j2665j9226r461R995K2507J3580k0142
$$ 785764008 785744095 785727539 785728378 785744247 785761108 785764847 785752182 785732956 785723495 785733490 785755997 785769577 785749435
2099G85749435o6604j04675j14670q9951m0512J3733N1651O1111M3107N187m0359q3542
$$ 785749435 785682831 785578156 785463486 785373535 785333023 785346756 785398407 785459518 785502625 785507812 785467453 785383911
2111G85383911j17187j36109j36947j19782q8425n1956k1972p554j1672l0442n4092
$$ 785383911 785266724 785130615 784993668 784873886 784785461 784733505 784711533 784703979 784692307 784661865 784607773
2122G84607773p3929q3160q1482p4311o8740p3166r3918j30615j76697k18811k42081
$$ 784607773 784533844 784450684 784369202 784294891 784226151 784152985 784059067 783928452 783751755 783532944 783290863
2133G83290863k35748j98746j43661r0027n7145n6304q4000j27564j69982j98822k08970
$$ 783290863 783055115 782856369 782712708 782622681 782565536 782509232 782425232 782297668 782127686 781928864 781719894
2144G81719894k01339j80054j47018j02997n0659M501N2719Q5449R7656R1324P5989
$$ 781719894 781518555 781338501 781191483 781088486 781037827 781042328 781095047 781180496 781278152 781369476 781445465
2155G81445465O0654N2948TN6762N8899N6687N1956M8065M8447N1269N2567M6768L1815
$$ 781445465 781506119 781559067 781612015 781668777 781727676 781784363 781836319 781884384 781932831 781984100 782036667 782083435 782115250
2168G82115250J0376j0224k0523j5564L967K9603M9362N2871L5019j526m7378q9188
$$ 782115250 782125626 782115402 782094879 782079315 782083282 782112885 782162247 782215118 782250137 782248611 782201233 782112045
2180G82112045j16806j23672j09635q0261m3564p095K2507M0970M6691M0665K5635
$$ 782112045 781995239 781871567 781761932 781681671 781638107 781631012 781653519 781694489 781741180 781781845 781807480
2191G81807480O027j1673k1896k1820j2055K289J4496J7395P782j1444l5095n6229
$$ 781807480 781813507 781801834 781779938 781758118 781746063 781748352 781762848 781780243 781788025 781776581 781741486 781685257
2203G81685257o9580p3929p3013o8665o3553n5313m1733k2430j526J2207J0224j1292
$$ 781685257 781615677 781541748 781468735 781400070 781336517 781281204 781239471 781217041 781215515 781227722 781237946 781226654
2215G81226654m7760q5983j11542j13068q9798n0125q468K2430L5248L2196J9684N493
$$ 781226654 781178894 781092911 780981369 780868301 780778503 780728378 780719910 780742340 780777588 780809784 780829468 780834961
2227G80834961o714j8387l2425n4779q7585j33362j92642k63138l38669m07028m53262
$$ 780834961 780828247 780809860 780777435 780722656 780635071 780501709 780309067 780045929 779707260 779300232 778846970
2238G78846970m61426m22058l37754k22549r9335Q774Q4152J19705J19553R3155N4550
$$ 778846970 778385544 777963486 777625732 777403183 777303848 777312622 777396774 777516479 777636032 777729187 777783737
2249G77783737J7548p477j4038k289J7777L3798L0823O10n3940j19476j76773k09275
$$ 777783737 777801285 777793808 777779770 777777481 777795258 777829056 777859879 777860489 777806549 777687073 777510300 777301025
2261G77301025k09808j85089j52588j32599j42975j90506k66418l52097m21371m50592
$$ 777301025 777091217 776906128 776753540 776620941 776477966 776287460 776021042 775668945 775247574 774796982
2271G74796982m27628l56064k55813j52359p0114j9913K441J0682K1133M0054O2485
$$ 774796982 774369354 774013290 773757477 773605118 773535004 773515091 773517532 773528214 773549347 773589401 773651886
2282G73651886P5836O5918K7619l4485j06201j71891k18658k41165k39716k20642j92032
$$ 773651886 773727722 773793640 773821259 773786774 773680573 773508682 773290024 773048859 772809143 772588501 772396469
2293G72396469j63269j44653j43814j65024k05994k55966k99377l21808l17154k93274
$$ 772396469 772233200 772088547 771944733 771779709 771573715 771317749 771018372 770696564 770379410 770086136
2303G70086136k69852Tl08074l80021m62722n23072n34591m91333m14200l43857l22800
$$ 770086136 769816284 769546432 769238358 768858337 768395615 767872543 767337952 766846619 766432419 766088562 765765762
2314G65765762l79638n15442p03736r00573j057282j138000j129227j044159r17816
$$ 765765762 765386124 764870682 764166946 763266373 762209091 761071091 759941864 758897705 757979889
2323G57979889p92770p01218o52847o30951o08368n61981m94156m25110l79105l65143
$$ 757979889 757187119 756485901 755833054 755202103 754593735 754031754 753537598 753112488 752733383 752368240
2333G52368240l69110l71322l75367m18701n55115q03222j095047j267929j119004
$$ 752368240 751999130 751627808 751252441 750833740 750278625 749475403 748380356 747112427 745993423
2342G45993423n13763N16510J741791K803268L358917L230439K482147J378326K61155
$$ 745993423 745479660 745996170 747737961 750541229 753900146 757130585 759612732 760991058 761252213
2351G61252213n98984j090470j259918j236419j141434j033325r08738p45239n38177
$$ 761252213 760653229 759562759 758302841 757066422 755924988 754891663 753982925 753237686 752699509
2360G52699509l14331j12305M5776J68457K82593M10385N51911O83517P77741Q20922
$$ 752699509 752385178 752272873 752318649 752487106 752769699 753180084 753731995 754415512 755193253 756014175
2370G56014175Q23288Q15049Q27179Q79898R76410J103134J236877J350708J417618
$$ 756014175 756837463 757652512 758479691 759359589 760335999 761439133 762676010 764026718 765444336
2379G65444336J416168J337662J187668R87549P69424N63202L92609K67105J86538
$$ 765444336 766860504 768198166 769385834 770373383 771142807 771706009 772098618 772365723 772552261
2388G72552261J42594J23596J18256J14669J04599Q4458N3863J8158j9378n6992r4376
$$ 772552261 772694855 772818451 772936707 773051376 773155975 773240433 773294296 773312454 773293076 773236084 773141708
2399G73141708j30462j60141j76773j74790j56784j33667j20468j27411j54190j88217
$$ 773141708 773011246 772851105 772674332 772499542 772342758 772209091 772088623 771961212 771807022 771618805
2409G71618805k12250k14157j92795j57623j22604r5673p6599n7602l0365N951M6921
$$ 771618805 771406555 771192398 770999603 770841980 770719376 770623703 770547104 770489502 770459137 770465088 770512009
2420G70512009Q2626J08643J25808J40381J59073J82343K03170K11563K00425J69677
$$ 770512009 770594635 770703278 770829086 770969467 771128540 771310883 771514053 771725616 771926041 772095718
2430G72095718J26648Q3466M8065K4185Q087m653j6709k8458l5552l5782k9526j7700
$$ 772095718 772222366 772305832 772353897 772378082 772386169 772381516 772364807 772336349 772300797 772265015 772235489 772217789
2442G72217789l968Q316J8769K5863K8611K5787J6861L052j5488l7918o6071j00097
$$ 772217789 772213821 772222137 772240906 772266769 772295380 772321167 772338028 772341080 772325592 772287674 772221603 772121506
2454G72121506j38779j74942j97372j98365j77002j43356j17493j18332j55258k24304
$$ 772121506 771982727 771807785 771610413 771412048 771235046 771091690 770974197 770855865 770700607 770476303
2464G70476303l06473l78418m19693m20456l83758l19824k44294j70898j10931o8894
$$ 770476303 770169830 769791412 769371719 768951263 768567505 768247681 768003387 767832489 767721558 767652664
2474G67652664m4174l1967k5482j9303j3275r918j3886k5940m2419n7831o7520p1716
$$ 767652664 767608490 767576523 767551041 767531738 767518463 767508545 767494659 767468719 767426300 767368469 767300949 767229233
2486G67229233p5989q5449j02463j24435j44883j58844j65100j65863j63879j57929
$$ 767229233 767153244 767067795 766965332 766840897 766696014 766537170 766372070 766206207 766042328 765884399
2496G65884399j46255j26724j02387p9727o6605o5383p1717p8125q0414q2321r4986
$$ 765884399 765738144 765611420 765509033 765429306 765362701 765297318 765225601 765147476 765067062 764984741 764889755
2507G64889755j29471j87454k57797l19977l54767l55758l31726l05329k96478l16544
$$ 764889755 764760284 764572830 764315033 763995056 763640289 763284531 762952805 762647476 762350998 762034454
2517G62034454l58810m04663m31442m23279l77350l04947k21710j45645q4687l7765
$$ 762034454 761675644 761270981 760839539 760416260 760038910 759733963 759512253 759366608 759281921 759244156
2527G59244156L967M9286J01318J54114J94016K06833J84860J30691N4932k9602j13449
$$ 759244156 759248123 759297409 759398727 759552841 759746857 759953690 760138550 760269241 760324173 760294571 760181122
2538G60181122j93558k69470l40424l99856m37928m46701m23965l73840l08228k38190
$$ 760181122 759987564 759718094 759377670 758977814 758539886 758093185 757669220 757295380 756987152 756748962
2548G56748962j75399j27030r9029r2850j05515j27487j46408j51825j42441j28631
$$ 756748962 756573563 756446533 756347504 756254654 756149139 756021652 755875244 755723419 755580978 755452347
2558G55452347j28632j56784k14233k85492l46070l74908l66821l34320k99149k79083
$$ 755452347 755323715 755166931 754952698 754667206 754321136 753946228 753579407 753245087 752945938 752666855
2568G52666855k79160k89612k97698k95716k88544k89917l10974l54766m09546m56314
$$ 752666855 752387695 752098083 751800385 751504669 751216125 750926208 750615234 750260468 749850922 749394608
2578G49394608m78898m70809m38614l98560l69339l64075l85131m27018m75692n16358
$$ 749394608 748915710 748444901 748006287 747607727 747238388 746874313 746489182 746062164 745586472 745070114
2588G45070114n40008n45655n40161n34057n34440n39016n38636n22308m86450m38767
$$ 745070114 744530106 743984451 743444290 742910233 742375793 741836777 741298141 740775833 740289383 739850616
2598G39850616l98712l86429m13208m72793n45273o05621o36673o37512o24085o19125
$$ 739850616 739451904 739065475 738652267 738179474 737634201 737028580 736391907 735754395 735130310 734511185
2608G34511185o42243o97937p75070q51593r05228r22241r04770q67538q31146q14057
$$ 734511185 733868942 733171005 732395935 731544342 730639114 729716873 728812103 727944565 727113419 726299362
2618G26299362q24127q56171q98666r38339r68628r91898j014633j040497j066894
$$ 726299362 725475235 724619064 723720398 722782059 721813431 720821533 719806900 718766403 717699509
2627G17699509j079178j059647r92965q73337p08313n15900l17535j33591K3117J46408
$$ 717699509 716620331 715560684 714567719 713694382 712986069 712470169 712152634 712019043 712042160 712188568
2637G12188568K35748K94571L25928L32184L15857K78930K26822J64795J00251L7994
$$ 712188568 712424316 712718887 713044815 713376999 713692856 713971786 714198608 714363403 714463654 714501648
2647G14501648k0981p9422j42517k12479k82669l40347l67889l52478k91901j98364
$$ 714501648 714480667 714401245 714258728 714046249 713763580 713423233 713055344 712702866 712410965 712212601
2657G12212601r3231J297P1487J17187J51749J93710K58713L51410M62647N73501O61392
$$ 712212601 712119370 712120667 712192154 712309341 712461090 712654800 712913513 713264923 713727570 714301071 714962463
2668G14962463P09763P13730O81839O31714N83114N49088N29938N15365M90418M45633
$$ 714962463 715672226 716385956 717067795 717699509 718282623 718831711 719361649 719877014 720367432 720813065
2678G20813065L81851L11889K51542K13089J97296J95694J95388J86921J68838J47553
$$ 720813065 721194916 721506805 721758347 721971436 722168732 722364426 722559814 722746735 722915573 723063126
2688G23063126J27563J10016Q7662N1117o562q4076j71814k57492l31039l87421m29916
$$ 723063126 723190689 723300705 723388367 723439484 723432922 723348846 723177032 722919540 722588501 722201080 721771164
2699G21771164m62112m87137n04151n10254n03006m82330m50516m13818l77197l44849
$$ 721771164 721309052 720821915 720317764 719807510 719304504 718822174 718371658 717957840 717580643 717235794
2709G17235794l18756l00217k89612k87857k97699l22113l61328m11377m64630n07736
$$ 717235794 716917038 716616821 716327209 716039352 715741653 715419540 715058212 714646835 714182205 713674469
2719G13674469n30548n29404n10406m88434m79126m91791n22766n59769n86242n93338
$$ 713674469 713143921 712614517 712104111 711615677 711136551 710644760 710121994 709562225 708975983 708382645
2729G08382645n83573n68084n58625n58395n58090n41840m95224m14123l09601k01416
$$ 708382645 707799072 707230988 706672363 706113968 705555878 705014038 704518814 704104691 703795090 703593674
2739G03593674j10627n1574k4796k3956l5706n0048o4774q3542j14517j65329k39258
$$ 703593674 703483047 703431473 703406677 703382721 703347015 703296967 703232193 703148651 703034134 702868805 702629547
2750G02629547l32641m34723n34897o24161o99005p61643q15353q60596q92563r05227
$$ 702629547 702296906 701862183 701327286 700703125 700004120 699242477 698427124 697566528 696673965 695768738
2760F95768738q95767q69065q40759q29010q49457r07669r95560j098709j201019j290054
$$ 695768738 694872971 694003906 693163147 692334137 691484680 690577011 689581451 688482742 687281723 685991669
2770F85991669j363678j423340j475449j525116j577224j636200j704789j786117j882095
$$ 685991669 684627991 683204651 681729202 680204086 678626862 676990662 675285873 673499756 671617661
2779F71617661j990967k110825k237854k367554k496261k617722k726898k818375k889099
$$ 671617661 669626694 667515869 665278015 662910461 660414200 657796478 655069580 652251205 649362106
2788F49362106k938461k967377k978668k972603k952041k922402k892952k876549k883300
$$ 649362106 646423645 643456268 640477600 637504997 634552956 631630554 628737602 625861053 622977753
2797F22977753k918206k975120l042259l104325l153572l193855l239174l308449l416519
$$ 622977753 620059547 617084427 614042168 610937843 607784271 604590416 601351242 598042793 594626274
2806E94626274l567047l749847l946267m137115m310417m466591m619331m789582m997749
$$ 594626274 591059227 587309380 583363113 579225998 574915581 570448990 565829659 561040077 556042328
2815E56042328n256043n563850n911713o287498o685791p112656p583999q115387q715096
$$ 556042328 550786285 545222435 539310722 533023224 526337433 519224777 511640778 503525391 494810295
2824D94810295r379387j0096588j0862122j1686553j2599106j3640633j4847374j6239700
$$ 494810295 485430908 475334320 464472198 452785645 440186539 426545906 411698532 395458832
2832C95458832j7812691j9536323k1350403k3151360k4774742k5989685k6519127k6101150
$$ 395458832 377646141 358109818 336759415 313608055 288833313 262843628 236324501 210223351
2840B10223351k4572945k1952229j8468399j4525604j0601540p116622m325657k272501
$$ 210223351 185650406 163698177 145229778 130704174 120102634 112986012 108660355 106387854
2848A06387854q18129K83690J294307K424660L804998N485649P448254R611921J1838961
$$ 106387854 105569725 105853415 107147722 109572382 113377380 118863029 126311283 135923204 147762165
2857A47762165J3940182J5700054J6915626J7442132J7224235J6306362J4810086J2898864
$$ 147762165 161702347 177402401 194318027 211760159 228984394 245290756 260100842 272999706
2865B72999706J0736790Q459949O163407L904190J713695l87630k378731m229412n902996
$$ 272999706 283736496 292196445 298359852 302264042 303977737 303590107 301211376 296981964 291078968
2874B91078968p357407q553505r463424j0074635j0391941j0439606j0256118r893399
$$ 291078968 283721561 275168056 265704632 255629997 245238056 234798450 224542332 214648933
2882B14648933r409122q859634q290444p729683p185173o650600o116486n579805n052395
$$ 214648933 205239811 196380177 188089733 180360050 173174877 166524277 160407791 154827986 149775591
2891A49775591m556694m116650l748579l451023l210201l006430k824945k663756k531557
$$ 149775591 145218897 141102247 137353668 133902645 130692444 127686014 124861069 122197313 119665756
2900A19665756k441273k399520k399369k421379k436085k417049k346468k216186k031107
$$ 119665756 117224483 114824963 112425594 110004215 107568130 105151081 102804613 100588427 98557320
2909I8557320j799803j532765j241550r37662o36244l53060j04637R9096K57245L79419
$$ 98557320 96757517 95224752 93983202 93045540 92409296 92056236 91951599 92050695 92307940 92687359
2919I2687359M82187N83906O98366Q34141R94082J183176J410064J693097K058954
$$ 92687359 93169546 93753452 94451818 95285959 96280041 97463217 98873281 100566378 102625332
2928A02625332K541790L177309L997459N023785O259956P690840R280291J0975561
$$ 102625332 105167122 108344431 112341890 117365675 123625631 131316471 140596762 151572323
2936A51572323J2713203J4422283J6026574J7443866J8586197J9365597J9709282J9578972
$$ 151572323 164285526 178707809 194734383 212178249 230764446 250130043 269839325 289418297
2944B89418297J8988190J8010101J6766243J5404587J4065437J2859459J1855354J1081696
$$ 289418297 308406487 326416588 343182831 358587418 372652855 385512314 397367668 408449364
2952D08449364J0538864J0212326J0074425J0087547J0203438J0364341J0514832J0609474
$$ 408449364 418988228 429200554 439274979 449362526 459565964 469930305 480445137 491054611
2960D91054611J0623360J0551414J0402527J0192871R936447R645386R326515Q985215
$$ 491054611 501677971 512229385 522631912 532824783 542761230 552406616 561733131 570718346
2968E70718346Q625526Q248940P855606P448043P030030O608734O195030N797997N424156
$$ 570718346 579343872 587592812 595448418 602896461 609926491 616535225 622730255 628528252 633952408
2977F33952408N075416M749413M440842M142761L849945L559570L273850L002395K757798
$$ 633952408 639027824 643777237 648218079 652360840 656210785 659770355 663044205 666046600 668804398
2986F68804398K553482K394104K274475K178726K087097J984558J864472J729889J588745
$$ 668804398 671357880 673751984 676026459 678205185 680292282 682276840 684141312 685871201 687459946
2995F87459946J449051J316452J198196J101074J034851J004334J005020J022415J035385
$$ 687459946 688908997 690225449 691423645 692524719 693559570 694563904 695568924 696591339 697626724
3004F97626724J025772R86176R22088Q47474P74231P08465O49262N92575N36346M82025
$$ 697626724 698652496 699638672 700560760 701408234 702182465 702890930 703540192 704132767 704669113 705151138
3014G05151138M34723L95813L67127L48510L42255L51791L81165M24957M72794N08957
$$ 705151138 705585861 705981674 706348801 706697311 707039566 707391357 707772522 708197479 708670273 709179230
3024G09179230N20630N09796M87747M74777M85687N24598N83038O46973P06787P60879
$$ 709179230 709699860 710209656 710697403 711172180 711657867 712182465 712765503 713412476 714119263 714880142
3034G14880142Q15277Q77228R44061J006775J049576J061554J043167J004868R63897
$$ 714880142 715695419 716572647 717516708 718523483 719573059 720634613 721677780 722682648 723646545
3043G23646545R32846R13926R00573Q80967Q46328P95594P34405O72302O16455N73273
$$ 723646545 724579391 725493317 726393890 727274857 728121185 728916779 729651184 730323486 730939941 731513214
3053G31513214N45120N36270N48172N78156O16837O45828O46057O06842N32532M43725
$$ 731513214 732058334 732594604 733142776 733720932 734337769 734983597 735629654 736236496 736769028 737212753
3063G37212753L68042L26538L23868L45993L68958L72543L48740L03497K51389K03704
$$ 737212753 737580795 737907333 738231201 738577194 738946152 739318695 739667435 739970932 740222321 740426025
3073G40426025J66855J39618J21155J14670J26266J61667K19650K89383L56064M04434
$$ 740426025 740592880 740732498 740853653 740968323 741094589 741256256 741475906 741765289 742121353 742525787
3083G42525787M29535M37393M42048M61273N06668N84106O86951Q03146R15070J007614
$$ 742525787 742955322 743392715 743834763 744296036 744802704 745386810 746073761 746876907 747791977 748799591
3093G48799591J071243J103211J108856J096420J071015J033859R81369R07898Q13141
$$ 748799591 749870834 750974045 752082901 753179321 754250336 755284195 756265564 757173462 757986603
3102G57986603P02743N88532M83551L98254L36914K99301K80838K78473K86866L00140
$$ 757986603 758689346 759277878 759761429 760159683 760496597 760795898 761076736 761355209 761642075 761942215
3112G61942215L10898L10821K94266K61154K17972J75400J43661J28937J30844J44654
$$ 761942215 762253113 762563934 762858200 763119354 763337326 763512726 763656387 763785324 763916168 764060822
3122G64060822J65100J88140K11792K35138K52839K56652K37427J88751J13984K8381
$$ 764060822 764225922 764414062 764625854 764860992 765113831 765370483 765607910 765796661 765910645 765939026
3132G65939026m6463q9646q9874n1040J0376P2021J15509J34201J31302J16730J00784
$$ 765939026 765892563 765802917 765713043 765662003 765672379 765744400 765859909 765994110 766125412 766242142 766342926
3143G66342926Q7509P6981O6452N4321M1504L1509K5711K5788L0289L7384M6386N3787
$$ 766342926 766430435 766507416 766573868 766628189 766669693 766701202 766726913 766752701 766782990 766820374 766866760 766920547
3155G66920547N6382M7912K5177j0833n3330q7814j02844r1629n6534r995L3646O1874
$$ 766920547 766976929 767024841 767050018 767039185 766985855 766898041 766795197 766703568 766647034 766637039 766670685 766732559
3167G66732559P0038O1493M2877K0905r16k2659m4022o3553p5912p5684o0348l3646
$$ 766732559 766802597 766864090 766906967 766927872 766926956 766904297 766860275 766796722 766720810 766645126 766584778 766551132
3179G66551132n798J2436J3046k289k4261l9139l7003j6708J3733M1351N7526O0501
$$ 766551132 766545334 766557770 766570816 766568527 766544266 766505127 766468124 766451416 766465149 766506500 766564026 766624527
3191G66624527N5237M7912L9673K6779M044k6779n5771o6834m9057o332M2648P0420
$$ 766624527 766679764 766727676 766767349 766794128 766798172 766771393 766715622 766648788 766599731 766593399 766636047 766706467
3203G66706467N8746P477o2180j16958j30463r6130k7924M5242R6283J11008R2010
$$ 766706467 766765213 766772690 766710510 766593552 766463089 766366959 766339035 766384277 766480560 766591568 766683578
3214G66683578N2033O027l4942o4316p9804p8430n7831k0828K2888N8747P2708N8670
$$ 766683578 766735611 766741638 766706696 766642380 766562576 766484146 766426315 766405487 766428375 766487122 766559830 766618500
3226G66618500K3498j5106l9520l8986j4725K0218N1422O8970P0724O0501M1123J3275
$$ 766618500 766641998 766626892 766587372 766548386 766533661 766553879 766605301 766674271 766744995 766805496 766846619 766859894
3238G66859894k3957o8740j12305j40991j43814j19782q0948m6615l3799m4937o6604
$$ 766859894 766835937 766767197 766654892 766513901 766370087 766250305 766169357 766122742 766088943 766044006 765977402
3249G65977402p6828n8441j1216M3869P9651P1640J6098o8512j50146j96991j91956
$$ 765977402 765900574 765842133 765830917 765874786 765954437 766026077 766042175 765973663 765823517 765626526 765434570
3260G65434570j40991o7367k366K9908K0218k2431p6904j20545j37786j26648r4834
$$ 765434570 765293579 765226212 765223846 765253754 765273972 765251541 765174637 765054092 764916306 764789658 764694824
3271G64694824n6610k3193J678J8006K8839L3874K8000O561l0899p7820j20086j45188
$$ 764694824 764638214 764615021 764616699 764634705 764663544 764697418 764725418 764731979 764701080 764623260 764503174 764357986
3283G64357986j46255j27640j00174p5989o2179n5008m6921k8992K594M2267P9346
$$ 764357986 764211731 764084091 763983917 763907928 763845749 763790741 763743820 763714828 763717422 763759689 763839035
3294G63839035J01090R7656O5765P401o6910j42746k00958k25296k05384j43509n8288
$$ 763839035 763940125 764037781 764103546 764110947 764044037 763901291 763700333 763475037 763269653 763126144 763067856
3305G63067856K2201O8665O2256M883q2856j67312k17819k16828j66626q6975m806
$$ 763067856 763090057 763158722 763220978 763225861 763143005 762975693 762757874 762541046 762374420 762287445 762282639
3316G62282639N4245P5454N5466M425o1951j23748j64490j73645j51825j10169o6986
$$ 762282639 762336884 762412338 762467804 762472229 762410278 762286530 762122040 761948395 761796570 761686401 761619415
3327G61619415m0130l7766n6686q1787r7275r4223p5379n3939m4022n2948p4615r5902
$$ 761619415 761579285 761541519 761484833 761403046 761305771 761211548 761136169 761082230 761038208 760985260 760910645 760814743
3339G60814743j00861q1939m4251j144K9144L5324J5717k2125o5766j02920j27182
$$ 760814743 760713882 760631943 760587692 760586548 760615692 760651016 760666733 760644608 760578842 760475922 760348740
3350G60348740j36872j34277j22681j06964r1400q1329q3695j01013j29700j58462
$$ 760348740 760211868 760077591 759954910 759847946 759756546 759675217 759591522 759490509 759360809 759202347
3360G59202347j72119j59073j18866o5003j9073J602p400l3646n5771n4779k5558K2735
$$ 759202347 759030228 758871155 758752289 758687286 758668213 758669815 758662415 758628769 758572998 758518219 758492661 758515396
3372G58515396P2785J08871J24512J19858R5901N2261j1902r1552j68610k14767k05155
$$ 758515396 758588181 758697052 758821564 758941422 759037323 759089584 759077682 758986130 758817520 758602753 758397598
3383G58397598j31607j2131J13373K00501K21252J74179Q3466j5259r1705j31150j33514
$$ 758397598 758265991 758253860 758367233 758567734 758788986 758963165 759046631 759031372 758939667 758808517 758675003
3394G58675003j07346o1645l052O0578J18637J55487J58386J23215N9509j1902o7291
$$ 758675003 758567657 758506012 758502960 758563538 758682175 758837662 758996048 759119263 759178772 759166870 759099579
3405G59099579r1324q1177m7302o485K8839N1422O2180O1493M7302J4954l8758j07650
$$ 759099579 759008255 758927078 758879776 758873291 758902130 758953552 759015732 759077225 759124527 759139481 759100723 758993073
3417G58993073j74943k17895k17667j70669r2011j0376M4175N5923K5940k5635p4234
$$ 758993073 758818130 758600235 758382568 758211899 758119888 758109512 758153687 758209610 758235550 758209915 758135681
3428G58135681j00784r8953p4768m1047j0070J1367K2049K3957K0828J5640J1597J2207
$$ 758135681 758034897 757935944 757861176 757820129 757810059 757821426 757843475 757867432 757888260 757903900 757915497 757927704
3440G57927704K0599L9215O5308R3231J12229J13906R3460N6382J5106j4649k1896
$$ 757927704 757948303 757987518 758052826 758146057 758258286 758372192 758465652 758522034 758537140 758522491 758500595
3451G58500595o180K0523M0589M0207J8005j4877m0055m6310l2959j3199k823q087
$$ 758500595 758494415 758514938 758555527 758595734 758613739 758598862 758558807 758512497 758479538 758466339 758463516 758455429
3463G58455429k4033l6087l0899p629K3422M8676O0501O1493N9128N4397L7918o027
$$ 758455429 758431396 758395309 758364410 758356781 758380203 758428879 758489380 758550873 758610001 758664398 758702316 758696289
3475G58696289q2703j75933k47651k57492j87988n8899P6981J61590J65940J03302
$$ 758696289 758613586 758437653 758190002 757932510 757744522 757685623 757762604 757924194 758090134 758193436
3485G58193436K0446l0059k4491K4567Q0032J06888R5825O1798L0442J4877P019j2207
$$ 758193436 758213882 758183823 758159332 758183899 758263931 758370819 758466644 758528442 758558884 758573761 758580780 758568573
3497G58568573n3864j08490j50146j54877j20697p1869m4632o3095j21689j86691k14004
$$ 758568573 758514709 758406219 758256073 758101196 757980499 757908630 757863998 757800903 757679214 757492523 757278519
3508G57278519j74713o8894P1259K00729K79236K86331K27966J30768K9297m7913q9111
$$ 757278519 757103806 757034912 757106171 757306900 757586136 757872467 758100433 758231201 758260498 758212585 758123474
3519G58123474j02844j13678j44348k01645k66190l01285k71911j67771j6860J26495
$$ 758123474 758020630 757906952 757762604 757560959 757294769 756993484 756721573 756553802 756536942 756663437
3529G56663437K07901K00271J21155K2965l6698k4185N0278J38168J80741J38549J6022
$$ 756663437 756871338 757071609 757192764 757215729 757179031 757154846 757205124 757343292 757524033 757662582 757678604
3540G57678604j42975k75039l30353l00675k18353j39465j07956j27945j66168j72119
$$ 757678604 757535629 757260590 756930237 756629562 756411209 756271744 756163788 756035843 755869675 755697556
3550G55697556j16349q850J08643J94702K41089K73590L24707L87878L99094K61154
$$ 755697556 755581207 755572357 755681000 755875702 756116791 756390381 756715088 757102966 757502060 757763214
3560G57763214q8959o16607j173325j551666j583634j231765o10810O1951N71289P94144
$$ 757763214 757674255 757057648 755884323 754332657 752749023 751517258 750906448 750968399 751539688 752333832
3570G52333832P34253M93927K10800R15p2326K899J87378L99704N23681M42963R4376
$$ 752333832 753068085 753562012 753772812 753773727 753701401 753704300 753891678 754291382 754815063 755258026 755352402
3581G55352402m80957j126786j622161j781922j549148j031723m51050l4104Q7510
$$ 755352402 754871445 753744659 752122498 750340576 748791428 747759705 747308655 747274551 747362061
3590G47362061p6371m11148p75680j069794j257629j338044j309661j156617q71963
$$ 747362061 747285690 746874542 746098862 745029068 743771439 742433395 741123734 739967117 739095154
3599G39095154m94538j19705J31836J76239J8387k38037m35486m34418j77612K83966
$$ 739095154 738600616 738480911 738612747 738788986 738807373 738569336 738133850 737699432 737521820 737805786
3609G37805786Q07953J210556J330566J090088N41993j20087o08368o48651j17951
$$ 737805786 738613739 739824295 741154861 742244949 742786942 742666855 742058487 741409836 741291885
3618G41291885Q51441J876907K464600K240448J153641m61503k015838k933579k915344
$$ 741291885 742143326 744020233 746484833 748725281 749878922 749417419 747401581 744468002 741552658
3627G41552658k060089p82318M10232J151429J336975J094894O64292K66189M4403
$$ 741552658 739492569 738710251 739120483 740271912 741608887 742703781 743368073 743634262 743678665
3636G43678665O2637L17383P27158J112747J222153Q28399j23519j421128k621307
$$ 743678665 743741302 744058685 744785843 745898590 747120743 747949142 747825623 746404495 743783188
3645G43783188l236313k979050j926117m90722P82699J482773J510391J073075N29251
$$ 743783188 740546875 737567825 735641708 735150986 735933685 737416458 738926849 739999924 740529175
3654G40529175J91726J98670N09415R78622J440735J757049J826630J593857J078796
$$ 740529175 740720901 740919571 741428986 742407608 743848343 745605392 747432022 749025879 750104675
3663G50104675L96424k63596p18765q98133q91265r03778j116944j555481k041702
$$ 750104675 750501099 750237503 749518738 748620605 747729340 746825562 745708618 744153137 742111435
3672G42111435k281036k029801j235351o7978J164016K160416K729721K811432K428436
$$ 742111435 739830399 737800598 736565247 736497269 737661285 739821701 742551422 745362854 747791290
3681G47791290J636887N27496p39746j912460k688599k828750k275086j203155M1351
$$ 747791290 749428177 749955673 749215927 747303467 744614868 741786118 739511032 738307877 738349228
3690G38349228J087341J683426J770935J454010R12171L18222j93406n14450n54885
$$ 738349228 739436569 741119995 742890930 744344940 745257111 745575333 745381927 744867477 744312592
3699G44312592k67792K90069R25827J346054J278916O21490m70657j619339k380447
$$ 744312592 744044800 744334869 745260696 746606750 747885666 748507156 748036499 746417160 744036713
3708G44036713k444077j773300o12259O35376J582489K003784J880493J359864O57425
$$ 744036713 741592636 739819336 739207077 739842453 741424942 743428726 745309219 746669083 747326508
3717G47326508k5864n44891q18329q12836n34668l7460N73806J140137J470108J385346
$$ 747326508 747300644 746755753 745937424 745124588 744589920 744552460 745126266 746266403 747736511 749121857
3727G49121857P86895k70538j536331k597427l004914k469177j042709Q31146K454529
$$ 749121857 749908752 749638214 748101883 745504456 742499542 740030365 738987656 739818802 742273331
3736G42273331L178100K715149J303482m01840j665497k054748j644821r37424n27344
$$ 742273331 745451431 748166580 749470062 749068222 747402725 745347977 743703156 742765732 742238388
3745G42238388p32956j411590k065735k167664j490478k45362J047745J864395J959381
$$ 742238388 741505432 740093842 738028107 735860443 734369965 734124603 735172348 737036743 738996124
3754G38996124J466065P75757K93045K17590M77829Q16803R63898P76138K88849l29743
$$ 738996124 740462189 741237946 741530991 741748581 742226410 743043213 744007111 744783249 745072098 744742355
3764G44742355q67691j151581j096496p19071j27868M99573R66339J117401R03702
$$ 744742355 743874664 742723083 741626587 740907516 740779648 741279221 742245560 743362961 744266663
3773G44266663M11529j65329o06460p66526o38199l44390o1341Q3924P5912M807r842
$$ 744266663 744678192 744512863 743906403 743139877 742501678 742157288 742095947 742179871 742255783 742260590 742250748
3784G42250748R7656L00217N02319O18286O29044N82046N39246N02014L95203J17263
$$ 742250748 742348404 742648621 743150940 743769226 744398270 744980316 745519562 746021576 746416779 746534042
3794G46534042l68881r73358j506424j780624j727066j437989j096496q45719o83059
$$ 746534042 746165161 745191803 743685379 741904755 740177689 738739700 737643204 736797485 736114426
3803G36114426m62494j9608O80237J465149K022324K073059J539154N98068m14581
$$ 736114426 735651932 735632324 736312561 737777710 739800034 741873093 743412247 744010315 743595734
3812G43595734j184845j573792j642456j553726j430817j270675r73053m53415K55203
$$ 743595734 742410889 740837097 739194641 737640915 736210098 734939423 733966370 733512955 733768158
3821G33768158R79080J490402J637726J437226J058349P15866N36881M83703L87650
$$ 733768158 734747238 736237640 737875366 739312592 740370941 741086807 741623688 742107391 742495041
3830G42495041O7367n35888j296540j951141k236481k029266j414413o28128Q5907
$$ 742495041 742562408 742026520 740729980 738778839 736542358 734513092 733098679 732470551 732556458
3839G32556458O21032J053620J553726K207413K870864L163300K645569J096496j266327
$$ 732556458 733177490 734231110 735784836 737992249 740863113 744026413 746671982 747768478 746502151
3848G46502151l771972n532227n834427m487381j940918Q97599L064117L944855L503189
$$ 746502151 742730179 737197952 731363525 726876144 724935226 725832825 728896942 732841797 736344986
3857G36344986K214661P78427k33536o06995n01403k79007k61689n58624j037826j430588
$$ 736344986 738559647 739338074 739104538 738497543 737996140 737717133 737455444 736896820 735858994 734428406
3867G34428406j494675j142197m72259K91901R10644J227493J211396R37652N30396
$$ 734428406 732933731 731791534 731319275 731611176 732521820 733749313 734960709 735898361 736428757
3876G36428757J04828k64359n37720o94427p16553o00357l75595j17416P4234J25732
$$ 736428757 736533585 736269226 735731506 735037079 734320526 733720169 733344574 733227158 733301392 733427124
3886G33427124M2877p5836q1406J36185N65567J052475J358566J278839P46613j23367
$$ 733427124 733470001 733394165 733312759 733448944 734014511 735066986 736425552 737704391 738451004 738327637
3896G38327637j082993j856003k241058k168884j700516r80225j82800N29404J036911
$$ 738327637 737244644 735388641 733147583 730978699 729278183 728297958 728115158 728644562 729681473
3905G29681473J281433J273727J082230P98874M98352K15530m7378k86866m69970n43900
$$ 729681473 730962906 732236633 733318863 734117737 734616089 734831619 734784241 734497375 734027405 733483505
3915G33483505m72488k79541n1651J09711J51824J07346O4316R3155J85013K52685
$$ 733483505 733011017 732731476 732679825 732789536 732941360 733048706 733113022 733206177 733391190 733643875
3925G33643875J96533r536k85111m80270m72946k41623J23520M75006O87484P05872
$$ 733643875 733840408 733830872 733545761 733065491 732592545 732350922 732474442 732949448 733636932 734342804
3935G34342804N48019K76337k9983k86561m20227l93905k34070l5782Q4839O0730p5607
$$ 734342804 734890823 735167160 735137177 734850616 734430389 734036484 733802414 733766632 733851471 733912201 733836594
3946G33836594k12098k37579j25503M5471J57547J47857N4779k5711l5095q087m1885
$$ 733836594 733624496 733386917 733261414 733306885 733464432 733612289 733667068 733641357 733606262 733598175 733556290
3957G33556290j92414m07028n48858n15519l36837j65482j51444l08227m91333n21469
$$ 733556290 733363876 732956848 732407990 731892471 731555634 731390152 731238708 730930481 730439148 729917679
3967G29917679l49732j16729l6240k01721m81873o25229m87289j80359K365j46408
$$ 729917679 729567947 729451218 729414978 729213257 728731384 728106155 727618866 727438507 727440872 727294464
3977G27294464n32226q10166o92520k55661N7831j89972r85565j759186j817627j020813
$$ 727294464 726762238 725952072 725259552 725003891 725061722 724871750 723886185 722126999 720309372 719288559
3987G19288559r7427j94474j859436m270782n544129m243240j199570j97296o563034
$$ 719288559 719191132 718996658 717137222 712866440 707322311 703079071 701879501 701682205 695119171
3996F95119171k4051056n1748428q3093529j08053474
$$ 695119171 671068115 619319687 536226158 428172684
4000D28172684
$$ 428172684
##END=$$ End of the data block
