##TITLE=$$ Begin of the data block
##JCAMP-DX=5.00 $$ ACD/SpecManager v 10.08
##SPECTROMETER/DATA SYSTEM=16PC
##DATE=11 Jun 2013 09:54:20
##DATA TYPE=INFRARED SPECTRUM
##DATA CLASS=XYDATA
##ORIGIN=
##OWNER=
##NPOINTS=3601
##FIRSTX=400.00000000
##LASTX=4000.00000000
##MAXX=4000.00000000
##MINX=400.00000000
##MAXY=70.14770508
##MINY=1.61394036
##XFACTOR=1.0000000000
##YFACTOR=0.000000100000000
##FIRSTY=36.77980804
##DELTAX=1.00000000
##XUNITS=1/CM
##YUNITS=TRANSMITTANCE
##XYDATA=(X++(Y..Y))
400C67798080R3989449P2315483M5165062K1335068O432113J038208J732026L926010
408F13731499M579849L274078J407967N12314R99107K083817K635345K117615Q96416
417F32238007j91422n45387j96610L41912N53054K93694j89171n41839n96009m50744
427F30715485l21236l44963n02701o97174q69827j035004j215553j366997j385078
436F22976952j204071q87795o18935n77087q02078j153832j413154j437874j257248
445F13624878j036415r42650j027222j205558j336213j331100j208000j064530j005592
454F03467598j087494j303673j606483j928787k197380k345162k339058k210007k058067
463E86391487k011108k150116k451821k793655l024826l059311k926292k742501k628593
$$ y = [367798080, 461787529, 534103012, 579268074, 600603142, 607035255, 608073463, 609805489, 613731499, 618311348, 621585426, 622993393, 623505707, 624504814, 626588631, 629223976, 631341591, 632238007, 632046585, 631501198, 631304588, 631646500, 632199554, 632493248, 632304077, 631762238, 631166229, 630715485, 630394249, 630049286, 629546585, 628849411, 627979584, 626944580, 625729027, 624362030, 622976952, 621772881, 620885086, 620266151, 619689064, 618886986, 617733154, 616320000, 614882126, 613624878, 612588463, 611645813, 610618591, 609413033, 608076820, 606745720, 605537720, 604473190, 603467598, 602380104, 601076431, 599469948, 597541161, 595343781, 592998619, 590659561, 588449554, 586391487, 584380379, 582230263, 579778442, 576984787, 573959961, 570900650, 567974358, 565231857, 562603264]
472E62603264k629738k686195k680321k509346k151566j680145j228981r31282q62999
481E45242691j008339j265221j487541j553116j427841j191177j001015j007538j263122
490E34037781j683502k085305k286529k203942j891822j502381j194839j055527j069183
499E19064751j152001j213836j209183j151848j096725j105004j212158j413155j661224
508E07849617j887169k031555k077026k065850k084655k220459k510949k917404l345184
517D86709366l696709l928108m070129m204522m410438m720726n109520n519257n900421
526D45149536o237106o548577o868362p218246p593728p962265q271751q465881q498535
535C77485085q348580q028526p578545p054405o501465n943374n379448m799767m202785
$$ y = [562603264, 559973526, 557287331, 554607010, 552097664, 549946098, 548265953, 547036972, 546105690, 545242691, 544234352, 542969131, 541481590, 539928474, 538500633, 537309456, 536308441, 535300903, 534037781, 532354279, 530268974, 527982445, 525778503, 523886681, 522384300, 521189461, 520133934, 519064751, 517912750, 516698914, 515489731, 514337883, 513241158, 512136154, 510923996, 509510841, 507849617, 505962448, 503930893, 501853867, 499788017, 497703362, 495482903, 492971954, 490054550, 486709366, 483012657, 479084549, 475014420, 470809898, 466399460, 461678734, 456569214, 451049957, 445149536, 438912430, 432363853, 425495491, 418277245, 410683517, 402721252, 394449501, 385983620, 377485085, 369136505, 361107979, 353529434, 346475029, 339973564, 334030190, 328650742, 323850975, 319648190]
544C19648190l602982l026085k494392k015496j581573j175919p82814l93543p744
553C04567642L68538P21016J029263J269626J424751J490708J477070J398811J262741
562C15010166J061077P76902L98349o6013n82981j104317j583843j989803k313672
571C09605865k562046k748584k883072k964535k978725k901326k706775k383118j943970
580B85533714j432399r09482m33654l9406K70004N16129P22580Q99887J038971J119556
590B87285900J126633J059761R32293P60574N51777K96841k6150m40102r55734j559734
600B89032059k215462k867622l461190l955803m338131m617996m815807m943447m992237
609B52824364m935799m743080m396591l905392l302402k635270j950168j283188o55842
$$ y = [319648190, 316045208, 313019123, 310524731, 308509235, 306927662, 305751743, 304968929, 304575386, 304567642, 304936180, 305657196, 306686459, 307956085, 309380836, 310871544, 312348614, 313747425, 315010166, 316071243, 316848145, 317246494, 317180481, 316597500, 315493183, 313909340, 311919537, 309605865, 307043819, 304295235, 301412163, 298447628, 295468903, 292567577, 289860802, 287477684, 285533714, 284101315, 283191833, 282758179, 282718773, 282988777, 283504906, 284227486, 285127373, 286166344, 287285900, 288412533, 289472294, 290404587, 291165161, 291716938, 292013779, 291987629, 291547527, 290591793, 289032059, 286816597, 283948975, 280487785, 276531982, 272193851, 267575855, 262760048, 257816601, 252824364, 247888565, 243145485, 238748894, 234843502, 231541100, 228905830, 226955662, 225672474, 225016632]
618B25016632p8640M44508R09900J311207J637783J875820K014218K051391K000046
627B37182865J887436J747379J609917J494541J406117J340522J291237J256581J241703
636B50458298J257477J313114J410179J535091J661301J757717J804123J805210J790543
645B64793053J801071J864929J979809K112980K224579K290535K319812K345200K400989
654B84132957K507134K666683K881336L158703L501110L878384M209633M381790M310226
663C15627956M006024L604774L321076L342704L722916M338608M942665N288963N249520
672C53445206M866829M307861L760719L341904L060455K853089K651252K428208K203216
681C82918739K009278J855583J716728J551628J335411J079216Q23326O12793M70200
$$ y = [225016632, 224937992, 225382500, 226292400, 227603607, 229241390, 231117210, 233131428, 235182819, 237182865, 239070301, 240817680, 242427597, 243922138, 245328255, 246668777, 247960014, 249216595, 250458298, 251715775, 253028889, 254439068, 255974159, 257635460, 259393177, 261197300, 263002510, 264793053, 266594124, 268459053, 270438862, 272551842, 274776421, 277066956, 279386768, 281731968, 284132957, 286640091, 289306774, 292188110, 295346813, 298847923, 302726307, 306935940, 311317730, 315627956, 319633980, 323238754, 326559830, 329902534, 333625450, 337964058, 342906723, 348195686, 353445206, 358312035, 362619896, 366380615, 369722519, 372782974, 375636063, 378287315, 380715523, 382918739, 384928017, 386783600, 388500328, 390051956, 391387367, 392466583, 393289909, 393902702, 394372902]
690C94372902L84674L20587K37236J09101o2752k54860m32167n65758o47049o92635
700C92769279p36694q13713r37729j094246j244507j347999j384201j365853j334075
709C82510262j333542j392441j506043j642913j761322j831742j848030j827316j799355
718C67567558j790733j814423j865425j926231j974869j996651j990165j966896j946068
727C50296097j942597j960983j990929k014770k017250j995125j958580j924248j903953
736C32587662j896630j886825j854057j784668j681672j563835j456794j378994j333771
745C17750416j306172j272525j211338j112671r82399q38280p00932n87577n04399
754C09234123m45308l94669l33595k47479j32980j717J24398K21824K74334K77081
$$ y = [394372902, 394757576, 395078163, 395315399, 395424500, 395361748, 395106888, 394674721, 394108963, 393461914, 392769279, 392032585, 391218872, 390281143, 389186897, 387942390, 386594391, 385210190, 383844337, 382510262, 381176720, 379784279, 378278236, 376635323, 374874001, 373042259, 371194229, 369366913, 367567558, 365776825, 363962402, 362096977, 360170746, 358195877, 356199226, 354209061, 352242165, 350296097, 348353500, 346392517, 344401588, 342386818, 340369568, 338374443, 336415863, 334491615, 332587662, 330691032, 328804207, 326950150, 325165482, 323483810, 321919975, 320463181, 319084187, 317750416, 316444244, 315171719, 313960381, 312847710, 311865311, 311027031, 310326099, 309738522, 309234123, 308788815, 308394146, 308060551, 307813072, 307680092, 307678375, 307802773, 308024597, 308298931, 308576012]
764C08576012K30884J30177m8886l47442q09727j452846k238923l060436l754330m140663
774B93083820m079971l527184k560768j372661k21005O45619J063156J000938N69001
783B84600945k4453n45215q06446p20024l05233L40404J088867J829300K492161L050232
793B91000538L502998L857498M118958M290848M383335M418106M425487M435025M464340
802C28897133M511757M562225M594917M595566M562683M505005M434929M361763M288139
811C69314117M212227M130860M041633L942299L828163L693657L535996L360328L180695
820D03239975L014870K875900K764587K669983K577095K478524K376289K278938K189026
829D26465187K095413J976242J811982J601829J370392J157455R96590Q93669Q19359
$$ y = [308576012, 308806896, 308937073, 308888187, 308540745, 307731018, 306278172, 304039249, 300978813, 297224483, 293083820, 289003849, 285476665, 282915897, 281543236, 281322231, 281967850, 283031006, 284031944, 284600945, 284576492, 284031277, 283224831, 282504807, 282199574, 282539978, 283628845, 285458145, 287950306, 291000538, 294503536, 298361034, 302479992, 306770840, 311154175, 315572281, 319997768, 324432793, 328897133, 333408890, 337971115, 342566032, 347161598, 351724281, 356229286, 360664215, 365025978, 369314117, 373526344, 377657204, 381698837, 385641136, 389469299, 393162956, 396698952, 400059280, 403239975, 406254845, 409130745, 411895332, 414565315, 417142410, 419620934, 421997223, 424276161, 426465187, 428560600, 430536842, 432348824, 433950653, 435321045, 436478500, 437475090, 438368759, 439188118]
838D39188118P21741N50995K83012p1678m79889r08127j344070j803017k315521k904396
848D30917168l563843m250603m892311n407791n727539n805130n618363n159111m425239
857C86067238l415909k137642o12678J111488K962990M852371O686058Q380013R869461
866D13763390J1112022J2087402J2788849J3217964J3377037J3267365J2892227J2267723
874E14773979J1434593J0463639R450035Q492126P665329O997986O466866O012992
882E81757545N573655N112953M638100M191131L822289L559188L390007L267785L134307
891F18446960K950364K715835K467003K257919K129708K086944K094116K092438K026901
900F39268188J875000J657563J427994J245117J142425J110993J100540J045685Q95309
$$ y = [439188118, 439909859, 440460854, 440743866, 440672188, 440192299, 439284172, 437940102, 436137085, 433821564, 430917168, 427353325, 423102722, 418210411, 412802620, 407075081, 401269951, 395651588, 390492477, 386067238, 382651329, 380513687, 379901009, 381012497, 383975487, 388827858, 395513916, 403893929, 413763390, 424875412, 436962814, 449751663, 462969627, 476346664, 489614029, 502506256, 514773979, 526208572, 536672211, 546122246, 554614372, 562279701, 569277687, 575744553, 581757545, 587331200, 592444153, 597082253, 601273384, 605095673, 608654861, 612044868, 615312653, 618446960, 621397324, 624113159, 626580162, 628838081, 630967789, 633054733, 635148849, 637241287, 639268188, 641143188, 642800751, 644228745, 645473862, 646616287, 647727280, 648827820, 649873505, 650768814]
909F50768814O36139K94418q4228m64096q41065j247101j725311k300186k949905l600083
919F38487396m146271m493141m595527m483948m258118m049530l961983m010391m085998
928F00402489l969879l397141k163849k28195K233543M851265P167855Q786125R496803
937F23179016R332008Q522072P384415O196518N118408M185028L361588K615585J958389
946F71853027J441651J111908R67483R40628R26361Q30918O21719L40118P5531q4915
956F79024429j05362k2354P6676R6588j2284k29644m75769o53611p02056o27976n03082
967F75865555m25949m69971o43387q87985j109619j228333j221389j130448j039276
976F67709198j027603j130295j321106j529083j678696j728592j694336j638488j639786
$$ y = [650768814, 651404953, 651699371, 651615143, 651151047, 650309982, 649062881, 647337570, 645037384, 642087479, 638487396, 634341125, 629847984, 625252457, 620768509, 616510391, 612460861, 608498878, 604488487, 600402489, 596432610, 593035469, 590871620, 590643425, 592876968, 597728233, 604896088, 613682213, 623179016, 632511024, 641033096, 648417511, 654614029, 659732437, 663917465, 667279053, 669894638, 671853027, 673294678, 674406586, 675374069, 676314697, 677241058, 678071976, 678693695, 679033813, 679109344, 679024429, 678919067, 678896713, 678973389, 679069977, 679057693, 678828049, 678352280, 677698669, 676996613, 676368637, 675865555, 675439606, 674969635, 674326248, 673438263, 672328644, 671100311, 669878922, 668748474, 667709198, 666681595, 665551300, 664230194, 662701111, 661022415, 659293823, 657599487, 655960999, 654321213]
985F54321213j748657j967087k246018k514724k719346k852706k958069l108597l370361
994F30835648l772126m295272m889832n507774o135636o808929p599869q573952r739914
1003E73512344j1003379j2153626j2895966j2926368j2031899j0181999p573852m608307
1011D90136948j797295L71323J564521J684304Q71887n66025k272758l960572n480308
1020D80552025o824608q066444r267693j0401535j1327744j1832351j1716309j0884857
1028D00230484r399109p464180n364189l378105j722870n39551P9727N8670o70547
1037C71830330k138901m285507o918831r720535j2298432j4276390j5379200j5482273
1045B91330261j4613113j2907906j0551529p721901m557914j157017K405681O044503
$$ y = [654321213, 652572556, 650605469, 648359451, 645844727, 643125381, 640272675, 637314606, 634206009, 630835648, 627063522, 622768250, 617878418, 612370644, 606235008, 599426079, 591826210, 583252258, 573512344, 562508965, 550355339, 537459373, 524533005, 512501106, 502319107, 494745255, 490136948, 488339653, 488710976, 490275497, 491959801, 492831688, 492265663, 489992905, 486032333, 480552025, 473727417, 465660973, 456393280, 445991745, 434664001, 422831650, 411115341, 400230484, 390831375, 383367195, 378003006, 374624901, 372902031, 372362480, 372442207, 372500877, 371830330, 369691429, 365405922, 358487091, 348766556, 336468124, 322191734, 306812534, 291330261, 276717148, 263809242, 253257713, 245535812, 240977898, 239820881, 242226562, 248271065]
1053B48271065R633445J2994099J5902615J8125553J9464779J9801636J9123687J7523651
1061C80840530J5175782J2300262R126473N865211K690735k71111k947082n314369
1069D17466431p389107r205170j0789070j2143707j3243447j4046020j4512634j4622917
1077C21514359j4381676j3809929j2933350j1771373j0334778q635235o694622m553852
1085B38399544k276058N9967K367363M563503O577797Q356380R860916J1063042J1936283
1094B90908737J2452679J2586231J2321854J1670837J0673981R400749P933006O346360
1102C74294434M699401L032341J376191k31247j735421l062019m122429m829368n115052
1111C64306831m953918m385033l518028k520905j573600q03681k23045L01628J019707
$$ y = [248271065, 257904510, 270898609, 286801224, 304926777, 324391556, 344193192, 363316879, 380840530, 396016312, 408316574, 417443047, 423308258, 425998993, 425727882, 422780800, 417466431, 410077324, 400872154, 390083084, 377939377, 364695930, 350649910, 336137276, 321514359, 307132683, 293322754, 280389404, 268618031, 258283253, 249648018, 242953396, 238399544, 236123486, 236183453, 238550816, 243114319, 249692116, 258048496, 267909412, 278972454, 290908737, 303361416, 315947647, 328269501, 339940338, 350614319, 360015068, 367948074, 374294434, 378993835, 382026176, 383402367, 383171120, 381435699, 378373680, 374251251, 369421883, 364306831, 359352913, 354967880, 351449852, 348928947, 347355347, 346551666, 346328621, 346630249, 347649956]
1120C47649956K212486M077683O631698R670830J2808571J5579071J7561912J8486634
1128D34678841J8279686J7052040J5038986J2524948R780045P018470M384423J953010
1136E20710449k56920k265815m112130n828285p419014q850441j0053901j0946846
1144D70977097j1462212j1572266j1300697j0711823r891777q925781p886009o832771
1152C92393761n823212m916191m168968l619309l266945l061752k910271k700157k337875
1161C59589081j779976j052589k43836N24864J140061J539421J737327J827851J962700
1170C65244904K308845L001061M102935N584641P330017R162521J0888596J2339668
1178D19963188J3402977J4032746J4240798J4072686J3586654J2838707J1884537J0790482
$$ y = [347649956, 349862442, 353940125, 360571823, 370242653, 383051224, 398630295, 416192207, 434678841, 452958527, 470010567, 485049553, 497574501, 507354546, 514373016, 518757439, 520710449, 520453529, 518187714, 514075584, 508247299, 500828285, 491977844, 481923943, 470977097, 459514885, 447942619, 436641922, 425930099, 416038322, 407112541, 399226532, 392393761, 386570549, 381654358, 377485390, 373866081, 370599136, 367537384, 364627113, 361926956, 359589081, 357809105, 356756516, 356512680, 357037544, 358177605, 359717026, 361454353, 363282204, 365244904, 367553749, 370554810, 374657745, 380242386, 387572403, 396734924, 407623520, 419963188, 433366165, 447398911, 461639709, 475712395, 489299049, 502137756, 514022293, 524812775]
1186E24812775R637680Q518295P513542O667595N973015N376739M806786M211006L580933
1195E81098366K953872K387887J926002J568604J271438R67522O03103J65863l07617
1204E92635040p50923j100502j326027j442947j501808j562424j667519j827774k027359
1213E79427757k244072k469253k717476l015976l377037l771019m112854m274330m119339
1222E49326401l553276k561341j225700K91977J790390L081932M035263M597740M789963
1231E60573349M680367M352531L878136L306045K666359J985054J296387O46133Q5297
1240E83469658l47672o35070p87239q30880p92846o84281m92859j91536K41585Q00667
1250E79749527J436844K061539K568664K867966K916450K733536K391014J983795J593819
$$ y = [524812775, 534450455, 542968750, 550482292, 557149887, 563122902, 568499641, 573306427, 577517433, 581098366, 584052238, 586440125, 588366127, 589934731, 591206169, 592173691, 592776794, 592942657, 592635040, 591884117, 590783615, 589457588, 588014641, 586512833, 584950409, 583282890, 581455116, 579427757, 577183685, 574714432, 571996956, 568980980, 565603943, 561832924, 557720070, 553445740, 549326401, 545773125, 543211784, 541986084, 542278061, 544068451, 547150383, 551185646, 555783386, 560573349, 565253716, 569606247, 573484383, 576790428, 579456787, 581441841, 582738228, 583384361, 583469658, 583121986, 582486916, 581699677, 580868797, 580075951, 579391670, 578898811, 578707275, 578948860, 579749527, 581186371, 583247910, 585816574, 588684540, 591600990, 594334526, 596725540, 598709335, 600303154]
1259F00303154J263542R90219P41272M81682J96724j03073l89824o42815q65783j092568
1269F00882530j375770j764107k280388k911873l614502m335556n032997n688324o302719
1278E67576294o876640p392769p807236q065529q133049q025169p819748p638474p604560
1287D98213120p793046q197937q728027r233398r547081r530144r103165q262443p080765
1296D20737114n697250m293290l062553k175903j748429j819572k339401l164711m061013
1305C92374992m712791m759140l859634j794663J434746N543632R983025J4054222
1313D08264389J7091255J8645668J8606072J7201500J4893951J2210159R582978P264099
1321E23760071N323906L720131K378997J250763L16163m38996j050072j578826k089615
$$ y = [600303154, 601566696, 602556915, 603298187, 603779869, 603976593, 603873520, 603483696, 602840881, 601975098, 600882530, 599506760, 597742653, 595462265, 592550392, 588935890, 584600334, 579567337, 573879013, 567576294, 560699654, 553306885, 545499649, 537434120, 529301071, 521275902, 513456154, 505817680, 498213120, 490420074, 482222137, 473494110, 464260712, 454713631, 445183487, 436080322, 427817879, 420737114, 415039864, 410746574, 407684021, 405508118, 403759689, 401940117, 399600716, 396436005, 392374992, 387662201, 382903061, 379043427, 377248764, 378683510, 384227142, 394210167, 408264389, 425355644, 444001312, 462607384, 479808884, 494702835, 506912994, 516495972, 523760071, 529083977, 532804108, 535183105, 536433868, 536750031, 536311035, 535260963, 533682137, 531592522]
1330E31592522k621117l170586l706207m199104m647789n082474n546074o065979o644440
1339D89908752p267684p928315q639335r422455j0279923j1166649j1985778j2612000
1347D10606613j2929840j2862663j2383766j1510468j0298729q849945p313309n877075
1355C28580818m716072l921280l432464l026715k381763j205788O18477K937832N330696
1364C18783741P223644Q087921P650948O035690L755760J544075O3859l80021J3237
1373C52778854O31409P62940j1216j550827l176765l993073l354110j233559J712151
1382C42565804M421463N900383N640678L776741R31931k128449m831085o955643q581810
1391C40740013r910774j1094475j2164116j3067322j3750190j4212952j4508820j4698143
$$ y = [531592522, 528971405, 525800819, 522094612, 517895508, 513247719, 508165245, 502619171, 496553192, 489908752, 482641068, 474712753, 466073418, 456650963, 446371040, 435204391, 423218613, 410606613, 397676773, 384814110, 372430344, 360919876, 350621147, 341771202, 334457893, 328580818, 323864746, 319943466, 316511002, 313484287, 311102524, 309896736, 310515213, 313453045, 318783741, 326007385, 334095306, 341746254, 347781944, 351537704, 353081779, 353145638, 352765617, 352778854, 353410263, 354173203, 354161987, 352611160, 349434395, 345441322, 342087212, 340853653, 342565804, 346987267, 352887650, 358528328, 362305069, 363237000, 361108551, 356277466, 349321823, 340740013, 330829239, 319734764, 307570648, 294503326, 280753136, 266540184, 252031364, 237333221]
1399B37333221j4807720j4816398j4674473j4333553j3764077j2959490j1932201j0709209
1407A29336100r333201p859020o343384m831219l347215j901064n00193Q35886K077294
1416I8133984L196182M189949N093889N981970O948109Q077411R420653J0972614J2666712
1425A64681473J4381161J5957412J7226734J8040276J8293762J7948208J7033882J5644188
1433B99207096J3910904J1972828R942474P886849N830269L782386J771126j35460
1441C54168472j837349l241691m308892n081062n676079o246566o929779p808476q893089
1450C04145489j0124016j1375427j2465744j3176937j3301392j2707787j1402950r549045
1458B10042191p412472n256901l228416j296025P17354L023777N734997Q770561J1854534
$$ y = [237333221, 222525501, 207709103, 193034630, 178701077, 164937000, 151977510, 140045309, 129336100, 120002899, 112143879, 105800495, 100969276, 97622061, 95720997, 95220804, 96056690, 98133984, 101330166, 105520115, 110614004, 116595974, 123544083, 131621494, 141042147, 152014761, 164681473, 179062634, 195020046, 212246780, 230287056, 248580818, 266529026, 283562908, 299207096, 313118000, 325090828, 335033302, 342920151, 348750420, 352532806, 354303932, 354168472, 352331123, 349089432, 344780540, 339699478, 334023399, 327776833, 320847054, 313038578, 304145489, 294021473, 282646046, 270180302, 257003365, 243701973, 230994186, 219591236, 210042191, 202629719, 197372818, 194144402, 192848377, 193565731, 196589508, 202324505, 211095066, 222949600]
1467B22949600J4598179J6629429J7707558J7785511J6998787J5604000J3892402J2114983
1475C48280449J0437889Q937454P624321O480561N489273M643669L936348L340149
1483C99170113K801666K255401J655121J005745L68500j65253n25245p09267p99026
1492D05057755r25942j204567j663437k217178k699776k948913k903138k651710k407799
1501C85435295k409630k797470l533706m415932n173073n599022n647049n435486n169525
1510C45254402n028190n085907n304490n589828n865135o110707o353836o626873o929092
1519B92360344p221489p451477p584972p619553p577877p488518p376728p265797p181701
1528B25592232p147656p167263p212410p231045p178878p056866o923141o867066o953907
$$ y = [222949600, 237547779, 254177208, 271884766, 289670277, 306669064, 322273064, 336165466, 348280449, 358718338, 367655792, 375280113, 381760674, 387249947, 391893616, 395829964, 399170113, 401971779, 404227180, 405882301, 406888046, 407256546, 407091293, 406566048, 405856781, 405057755, 404131813, 402927246, 401263809, 399046631, 396346855, 393397942, 390494804, 387843094, 385435295, 383025665, 380228195, 376694489, 372278557, 367105484, 361506462, 355859413, 350423927, 345254402, 340226212, 335140305, 329835815, 324245987, 318380852, 312270145, 305916309, 299289436, 292360344, 285138855, 277687378, 270102406, 262482853, 254904976, 247416458, 240039730, 232773933, 225592232, 218444576, 211277313, 204064903, 196833858, 189654980, 182598114, 175674973, 168807907, 161854000]
1537A61854000p178116p455797p663450p704153p554093p268276o941709o654711o437369
1546I6996326o269292o105223n906706n660305n372744n061488m744577m437819m154029
1555D9284143l900170l669143l438661l178463k867894k511639k142103j804948j535213
1564B4235909j339514j196521j071601r39171p93885o48722n21347m21158l44871k81384
1574A6677735k20437j59453j01183m9999p259K8982O2361R4895J27433J60561J95601
1585A6809237K33239K74104L15659L55340L92157M27635M64413N03675N42706N74193
1595B0892358N90470N86974N62997N23219M73030M18541L64607L16746K81174K65012
1605B5275128K74217L11916L78151M71120N89361P30896Q95009J079929J282372J499522
$$ y = [161854000, 154675884, 147220087, 139556637, 131852484, 124298391, 117030115, 110088406, 103433695, 96996326, 90727034, 84621811, 78715105, 73054800, 67682056, 62620568, 57875991, 53438172, 49284143, 45383973, 41714830, 38276169, 35097706, 32229812, 29718173, 27576070, 25771122, 24235909, 22896395, 21699874, 20628273, 19689102, 18895217, 18246495, 17725148, 17303990, 16959119, 16677735, 16457298, 16297845, 16196662, 16146663, 16139404, 16168386, 16230747, 16325642, 16453075, 16613636, 16809237, 17042476, 17316580, 17632239, 17987579, 18379736, 18807371, 19271784, 19775459, 20318165, 20892358, 21482828, 22069802, 22632799, 23156018, 23629048, 24047589, 24412196, 24728942, 25010116, 25275128, 25549345, 25861261, 26239412, 26710532, 27299893, 28030789, 28925798, 30005727, 31288099, 32787621]
1615C2787621J730142J974330K233185K506030K788506L072562L348479L608298L848315
1624E7897468M068827M273887M467025M650740M823852M981480N115594N219050N289373
1633A00787296N334025N370741N423250N508804N627651N756321N855666N890226N848799
1642A51402779N755586N658369N601921N594445N594291N525246N317402M952984M487495
1651A99890518M031239L695125L531895L504581L502846L403492L136444K723160K262783
1660B29682083J874771J633930J536103J513881J487999J422120J341304J308499J372776
1669B43173466J531849J730384J900788K013168K101536K240601K491188K845554L211269
1678B63239803L453904L467388L238544K862225K498207K293758K315617K525177K810402
$$ y = [32787621, 34517763, 36492093, 38725278, 41231308, 44019814, 47092376, 50440855, 54049153, 57897468, 61966295, 66240182, 70707207, 75357947, 80181799, 85163279, 90278873, 95497923, 100787296, 106121321, 111492062, 116915312, 122424116, 128051767, 133808088, 139663754, 145553980, 151402779, 157158365, 162816734, 168418655, 174013100, 179607391, 185132637, 190450039, 195403023, 199890518, 203921757, 207616882, 211148777, 214653358, 218156204, 221559696, 224696140, 227419300, 229682083, 231556854, 233190784, 234726887, 236240768, 237728767, 239150887, 240492191, 241800690, 243173466, 244705315, 246435699, 248336487, 250349655, 252451191, 254691792, 257182980, 260028534, 263239803, 266693707, 270161095, 273399639, 276261864, 278760071, 281053829, 283369446, 285894623, 288705025]
1687B88705025L047447L159943L143119L045273K926254K817517K709522K569580K374382
1696C14498062K138348J916103J777191J770478J894226K093277K285423K402763K427292
1705C33203163K399941K397079K488098K693024K965698L210106L323326L246346K995872
1714C58922653K665329K389298K287750K413483K727890L116188L444061L621483L647537
1723C85235672L606071L611680L734588L948288M135475M154816L929672L508263L049316
1732D18913841K742348K705231K919578L246689L509903L595352L505593L344764L242302
1741D47725601L270035L404884L549767L598099L494339L261985K982178K750206K631493
1750D76668587K641792K751961K907867L053131L142395L148918L067437K913589K722893
$$ y = [288705025, 291752472, 294912415, 298055534, 301100807, 304027061, 306844578, 309554100, 312123680, 314498062, 316636410, 318552513, 320329704, 322100182, 323994408, 326087685, 328373108, 330775871, 333203163, 335603104, 338000183, 340488281, 343181305, 346147003, 349357109, 352680435, 355926781, 358922653, 361587982, 363977280, 366265030, 368678513, 371406403, 374522591, 377966652, 381588135, 385235672, 388841743, 392453423, 396188011, 400136299, 404271774, 408426590, 412356262, 415864525, 418913841, 421656189, 424361420, 427280998, 430527687, 434037590, 437632942, 441138535, 444483299, 447725601, 450995636, 454400520, 457950287, 461548386, 465042725, 468304710, 471286888, 474037094, 476668587, 479310379, 482062340, 484970207, 488023338, 491165733, 494314651, 497382088, 500295677, 503018570]
1759E03018570K545471K435761K436905K560119K770691K986183L099556L021698K727700
1768E27602654K282752J823960J503410J417923J563454J840248K109489K262535K266388
1777E44672813K159462K011376J878052J782035J725693J713295J757317J860237J989136
1786E61549416K069282K018585J799012J455993J108971Q94890Q93020J081810J349373
1795E74220352J556130J606140J490860J281700J083603R80758J002007J116829J261024
1804E85599403J367569J393929J335106J220321J096955J009674R81941J008759J065788
1813E96079445J124344J167488J193771J209450J219482J221657J213913J199341J185989
1822F06814880J177292J160050J107902R99336Q41866O80161N78117N80597O82678
$$ y = [503018570, 505564041, 507999802, 510436707, 512996826, 515767517, 518753700, 521853256, 524874954, 527602654, 529885406, 531709366, 533212776, 534630699, 536194153, 538034401, 540143890, 542406425, 544672813, 546832275, 548843651, 550721703, 552503738, 554229431, 555942726, 557700043, 559560280, 561549416, 563618698, 565637283, 567436295, 568892288, 570001259, 570896149, 571789169, 572870979, 574220352, 575776482, 577382622, 578873482, 580155182, 581238785, 582219543, 583221550, 584338379, 585599403, 586966972, 588360901, 589696007, 590916328, 592013283, 593022957, 594004898, 595013657, 596079445, 597203789, 598371277, 599565048, 600774498, 601993980, 603215637, 604429550, 605628891, 606814880, 607992172, 609152222, 610260124, 611259460, 612101326, 612781487, 613359604, 613940201, 614622879]
1831F14622879Q30002R54132J018639J040916J073494J152801J259499J317749J243744
1840F24513855J007538O67381L47672J72996J99700L88450O33087Q23059Q99544Q73108
1850F30526390P97310P26700O84814O62346O37818O02111N69077N67856O22062P33033
1860F37129517Q74023R96933J050720J002045Q52051O40945M34647K99530K72674L45841
1870F43898926M71267N90439O62384O80466O65665O43310O23398N99060N61371N16968
1880F49913254M90341N06515N66178O36444O64520O11191M80118L20968K03476J76392
1890F54569397K40631L52478M50134M91639M71649M17099L65982L44085L57666L97873
1900F58458633M49067M94232N15899M99497M38614L47442K62299K27737K74430L93295
$$ y = [614622879, 615452881, 616407013, 617425652, 618466568, 619540062, 620692863, 621952362, 623270111, 624513855, 625521393, 626188774, 626536446, 626709442, 626909142, 627297592, 627930679, 628753738, 629653282, 630526390, 631323700, 632050400, 632735214, 633397560, 634035378, 634637489, 635206566, 635774422, 636396484, 637129517, 638003540, 639000473, 640051193, 641053238, 641905289, 642546234, 642980881, 643280411, 643553085, 643898926, 644370193, 644960632, 645623016, 646303482, 646969147, 647612457, 648235855, 648834915, 649396286, 649913254, 650403595, 650910110, 651476288, 652112732, 652777252, 653388443, 653868561, 654189529, 654393005, 654569397, 654810028, 655162506, 655612640, 656104279, 656575928, 656993027, 657359009, 657703094, 658060760, 658458633, 658907700, 659401932, 659917831, 660417328, 660855942, 661203384, 661465683, 661693420, 661967850, 662361145]
1910F62361145N34897O29425O25687N19714L59192K17132J50452J70517K40555L03497
1920F66112213L16544K77786K21252J93406K19955K93427L74298M18930M02832L35388
1930F69166031K53372K01111K08054K73666L68805M49829M76837M32129L25699J92108
1940F72347641P5531J0605J1978O7596J47477K17895K54593K53677K27280J96610J78985
1951F73989868J79825J92413K04468K05612J93863J78299J71967J86004K21939K70844
1961F75995102L15170L36838L25165K81753K20871J65177J35345J42670J81961K33841
1971F78333893K71911K74201K34299J64260R0790M2343L6545P1564J27563J78223K03781
1982F80029373K00653J82495J68686J72730J92871K13547K14309J85547J33820Q1405
$$ y = [662361145, 662896042, 663525467, 664151154, 664670868, 665030060, 665247192, 665397644, 665568161, 665808716, 666112213, 666428757, 666706543, 666927795, 667121201, 667341156, 667634583, 668008881, 668427811, 668830643, 669166031, 669419403, 669620514, 669828568, 670102234, 670471039, 670920868, 671397705, 671829834, 672155533, 672347641, 672423172, 672433777, 672445755, 672513351, 672660828, 672878723, 673133316, 673386993, 673614273, 673810883, 673989868, 674169693, 674362106, 674566574, 674772186, 674966049, 675144348, 675316315, 675502319, 675724258, 675995102, 676310272, 676647110, 676972275, 677254028, 677474899, 677640076, 677775421, 677918091, 678100052, 678333893, 678605804, 678880005, 679114304, 679278564, 679369354, 679411697, 679448242, 679519806, 679647369, 679825592, 680029373, 680230026, 680412521, 680581207, 680753937, 680946808, 681160355, 681374664, 681560211, 681694031, 681775436]
1992F81775436N5542P3929J33591K13242K81372L10516K91061K33536J65939J18256
2002F83652420J11084J44959K01492K51312K69699K48718K00654J53427J32446J48239
2012F85514450J90430K31399K44370K17666J62735J08643Q5678J08032J66779K32620
2022F87262802K73285K68402K21024J55029J00479Q0338R8953J40457J79596J93787
2032F88974152J74102J28174P5913L8223K8000M3564P1792R3994R5826P5302M0588
2043F89839630Q011p782l05K5253N5313P4158P1335M6463R155k5482m3411l8376j4496
2056F89999466J5564L5934L3341L967m4250r6207j32675j39694j13907o4926j1902
2067F89484711K3346K6779l815n4169j01623j24970j14059p6599l2807p095j3885m9820
$$ y = [681775436, 681830978, 681904907, 682038498, 682251740, 682533112, 682843628, 683134689, 683368225, 683534164, 683652420, 683763504, 683908463, 684109955, 684361267, 684630966, 684879684, 685080338, 685233765, 685366211, 685514450, 685704880, 685936279, 686180649, 686398315, 686561050, 686669693, 686755371, 686863403, 687030182, 687262802, 687536087, 687804489, 688025513, 688180542, 688281021, 688361359, 688460312, 688600769, 688780365, 688974152, 689148254, 689276428, 689352341, 689390564, 689418564, 689462128, 689533920, 689627914, 689723740, 689799042, 689839630, 689847641, 689839859, 689839554, 689864807, 689920120, 689994278, 690065613, 690112076, 690121231, 690095749, 690052338, 690013962, 689999466, 690015030, 690050964, 690084305, 690088272, 690044022, 689947815, 689815140, 689675446, 689561539, 689496613, 689484711, 689508057, 689534836, 689531021, 689476852, 689375229, 689250259, 689136200, 689059601, 689026794, 689019699, 689005814, 688955994]
2079F88955994r6436j27792j27030r4757n0583k1362k8610p4616j42822k03934k32391
2090F87755661k18964j75933j29776j08643j26572j75628k29721k57111k37503j72272
2100F85923538q6059j4344J4191p324o0044j07879j19934q5449k1744L5171M9591P019
2112F85526733p6751j63956k15607k12249j65024j10321q8501j23444k08130l09067
2122F83853683l84292m05121l70560l09372k62527k64053l22876m18473n12695n68161
2132F80035553n69077n27648m78135m57687m87366n59616o43997p01904p08313o66275
2142F74235535o03257n59387n63125o18821p03964p82013q21838q13751p73163p31125
2152F67265091p17316p44858q05511q75168r26514r44595r31091r03397q83789q88061
$$ y = [688955994, 688859558, 688731766, 688604736, 688509979, 688459396, 688438034, 688409424, 688334808, 688191986, 687988052, 687755661, 687536697, 687360764, 687230988, 687122345, 686995773, 686820145, 686590424, 686333313, 686095810, 685923538, 685837479, 685823135, 685837326, 685830002, 685769958, 685662079, 685542145, 685456696, 685434952, 685470123, 685519714, 685526733, 685449982, 685286026, 685070419, 684858170, 684693146, 684582825, 684494324, 684370880, 684162750, 683853683, 683469391, 683064270, 682693710, 682384338, 682121811, 681857758, 681534882, 681116409, 680603714, 680035553, 679466476, 678938828, 678460693, 678003006, 677515640, 676956024, 676312027, 675610123, 674901810, 674235535, 673632278, 673072891, 672509766, 671890945, 671186981, 670404968, 669583130, 668769379, 667996216, 667265091, 666547775, 665802917, 664997406, 664122238, 663195724, 662251129, 661320038, 660416641, 659532852, 658644791]
2162F58644791r16901r57413r89074r95484r70001r21783q68607q28857q12226q15964
2172F49568481q25347q22831p95898p42645o72989o01731n42297m99573m70276m43573
2182F43151321m09317l61785l02964k40402j85165j45493j24817j19705j21002j18561
2192F41022110j03073p2556l3111L280K2965J6937j2131n3100q7052r9487q6059n5771
2204F40462952k6703j6403l2196o6529j00708j14593r8114n7450j1558J6479J2932
2215F39968109k0637o7292j03759j13488r4528o0654l4332l4370o6338j18599j68991
2226F39085121j95007j86501j49955j06583q1139q9493j29470j82343k21748k27242
2236F37515640j94473j37787q2512n2070n6000q6060j20735j37710j25809r0103m9897
$$ y = [658644791, 657727890, 656770477, 655781403, 654785919, 653815918, 652894135, 652025528, 651196671, 650384445, 649568481, 648743134, 647920303, 647124405, 646381760, 645708771, 645107040, 644564743, 644065170, 643594894, 643151321, 642742004, 642380219, 642077255, 641836853, 641651688, 641506195, 641381378, 641261673, 641140671, 641022110, 640919037, 640846481, 640813370, 640816650, 640839615, 640856552, 640844421, 640791321, 640704269, 640604782, 640518723, 640462952, 640436249, 640419846, 640387650, 640321121, 640220413, 640105820, 640007706, 639950256, 639938698, 639955177, 639968109, 639947472, 639880180, 639776421, 639662933, 639568405, 639507751, 639473419, 639439049, 639372711, 639254112, 639085121, 638890114, 638703613, 638553658, 638447075, 638365936, 638276443, 638146973, 637964630, 637742882, 637515640, 637321167, 637183380, 637100868, 637048798, 636992798, 636906738, 636786003, 636648293, 636522484, 636432381, 636382484]
2247F36382484k7923l7346p5569j25084j62888j71776j51062j15280q7242q6059j17112
2258F35225143j68724k19955k49214k47269k19192j82457j56861j53351j69906j91345
2268F33266869j98861j79290j33400p6065k9183r537j9264m2496n4054l2882K4490
2279F32516327R8495J56594J67350J18332K1744r0370j84860k39716k52533k38457
2289F32072906k17475k04964k07329k21252k38839k50701k49749k31781j98173j57013
2299F29895630j21346j05133j17721j60523k27165l07541l91273m68331n27076n53971
2309F26915550n37719m76037l85780l02544k72483l36037n08499p70111j065941j319466
2319F20940933j457290j436348j266137j013031p78732o57692o91070q39081r99031
$$ y = [636382484, 636354561, 636317215, 636241646, 636116562, 635953674, 635781898, 635630836, 635515556, 635428314, 635342255, 635225143, 635056419, 634836464, 634587250, 634339981, 634120789, 633938332, 633781471, 633628120, 633458214, 633266869, 633068008, 632888718, 632755318, 632679253, 632650070, 632640533, 632621269, 632578773, 632524719, 632491837, 632516327, 632614822, 632771416, 632938766, 633057098, 633078842, 632988472, 632803612, 632563896, 632311363, 632072906, 631855431, 631650467, 631443138, 631221886, 630983047, 630732346, 630482597, 630250816, 630052643, 629895630, 629774284, 629669151, 629551430, 629390907, 629163742, 628856201, 628464928, 627996597, 627469521, 626915550, 626377831, 625901794, 625516014, 625213470, 624940987, 624604950, 624096451, 623326340, 622260399, 620940933, 619483643, 618047295, 616781158, 615768127, 614989395, 614331703, 613640633, 612801552, 611802521]
2328F11802521j055947r48410p02781m15917j96991j04637j27029k14882l37601n13725
2338F07184601p74536j085053j282387j101989l07923J132584K942886M582253N451889
2347F16742325N163803L728790J559715p13539k515220l538361l801727l550301l077354
2356F09998131k581368k122650j670456j185875o71539j66817K88124O86341J052704
2365F03626595J417121J785241K132454K422027K631035K766457K857704K938919L029823
2374F25607376L132362L233185L313904L356667L343582L259430L095398K853317K548447
2383F53743668K205124J848983J500778J175614Q86764O47507M70276L59726L06930
2392F63145370K91367K87476K75726K50473K18048J91116J78757J82190J96076K12326
$$ y = [611802521, 610746574, 609798164, 609095383, 608679466, 608482475, 608377838, 608250809, 608035927, 607698326, 607184601, 606410065, 605325012, 604042625, 602940636, 602632713, 603765297, 606708183, 611290436, 616742325, 621906128, 625634918, 627194633, 626481094, 623965874, 620427513, 616625786, 613075485, 609998131, 607416763, 605294113, 603623657, 602437782, 601766243, 601599426, 601887550, 602573891, 603626595, 605043716, 606828957, 608961411, 611383438, 614014473, 616780930, 619638634, 622577553, 625607376, 628739738, 631972923, 635286827, 638643494, 641987076, 645246506, 648341904, 651195221, 653743668, 655948792, 657797775, 659298553, 660474167, 661360931, 662008438, 662478714, 662838440, 663145370, 663436737, 663724213, 663999939, 664250412, 664468460, 664659576, 664838333, 665020523, 665216599, 665428925]
2402F65428925K25601K34298K39029K40937K40402K36587K30790K24838K21710K22702
2412F67745819K27280K30865K28272K15912J93328J65635J39694J22146J14594J13373
2422F69496918J10550R8724P7362N2719L6240L8070O1646R9869J38702J63956J66855
2433F70541611J49231J22299J01623R8343J16272J47782J78375J93787J87530J64719
2443F72001572J39236J27640J37176J62583J86386J89056J61057J08795N3177J8997
2453F73285675J9608M9972Q7052J03530Q1253K3270m8141j02616j17798r1247m2191
2464F73248367p63O562k7314q8119j46408j73111j54114r8724l3417J1520J6404j6556
2476F72544327o6452j04904j09940p9041k8152J5717L0593Q698l7766q5220j10168
$$ y = [665428925, 665654526, 665888824, 666127853, 666368790, 666609192, 666845779, 667076569, 667301407, 667523117, 667745819, 667973099, 668203964, 668432236, 668648148, 668841476, 669007111, 669146805, 669268951, 669383545, 669496918, 669607468, 669706192, 669783554, 669836273, 669872513, 669910583, 669972229, 670072098, 670210800, 670374756, 670541611, 670690842, 670813141, 670914764, 671013107, 671129379, 671277161, 671455536, 671649323, 671836853, 672001572, 672140808, 672268448, 672405624, 672568207, 672754593, 672943649, 673104706, 673213501, 673266678, 673285675, 673305283, 673355255, 673442307, 673545837, 673627090, 673650360, 673602219, 673499603, 673381805, 673290558, 673248367, 673247604, 673254166, 673226852, 673138733, 672992325, 672819214, 672665100, 672566376, 672532959, 672544479, 672560883, 672544327, 672477875, 672372971, 672263031, 672183990, 672155838, 672171555, 672202148, 672210846, 672173080, 672087860, 671977692]
2487F71977692j02692p0724l5248j8997l3722p2098j13297j30691j07727m6234L5019
2498F71281281J08795J53579J62888J47858J30005J28936J52588J92948K32544K53219
2508F72944641K48032K23388J96762J86005J99967K33840K71531K94342K91595K64511
2518F75354614K26593J93863J77994J80511J92872K03170K02942J90659J72272J57394
2528F77252884J53046J61743J80587K03171K22245K31933K30713K19116K04010J93329
2538F79252777J94473K11106K40249K72293K95868L03803K95410K79083K67716K70691
2548F81883469K90451L19671L45612L56827L48358L24325K95792K75421K71073K82363
2558F84993362L01514L15323L12958K88620K45285J94244J48468J19934J10550J13678
$$ y = [671977692, 671875000, 671804276, 671769028, 671750031, 671716309, 671644211, 671530914, 671400223, 671292496, 671246262, 671281281, 671390076, 671543655, 671706543, 671854401, 671984406, 672113342, 672265930, 672458878, 672691422, 672944641, 673192673, 673416061, 673612823, 673798828, 673998795, 674232635, 674504166, 674798508, 675090103, 675354614, 675581207, 675775070, 675953064, 676133575, 676326447, 676529617, 676732559, 676923218, 677095490, 677252884, 677405930, 677567673, 677748260, 677951431, 678173676, 678405609, 678636322, 678855438, 679059448, 679252777, 679447250, 679658356, 679898605, 680170898, 680466766, 680770569, 681065979, 681345062, 681612778, 681883469, 682173920, 682493591, 682839203, 683196030, 683544388, 683868713, 684164505, 684439926, 684710999, 684993362, 685294876, 685610199, 685923157, 686211777, 686457062, 686651306, 686799774, 686919708, 687030258, 687143936]
2568F87143936J15891J04675P6446L9444J2055J2283M9286J15814J90659K48184K70767
2579F88379440K57721K25067J96686J92108K14463K50702K78091K77100K42538J86996
2589F90700912J33896J05515J11923J45950J87836K15912K18582J99890J77002J70975
2599F92368393J94015K43836L03955L51486L69415L54691L19290K84424K68784K80761
2609F95339050L12043L44924L58735L42407K99377K45438K00043J76849J77231J88598
2619F97984695J93787J79825J45111J00784O3858M9286O0806R0027J20926J37558J31836
2630F99258499J07346P5454N1346M4556N5695P7362R8114J07803J02844Q7586O9961
2641G00136566N8518N7525O4545P3013P4997O6910M9210K8076J1596O638J5869L6469
$$ y = [687143936, 687259827, 687364502, 687440948, 687480392, 687492447, 687504730, 687554016, 687669830, 687860489, 688108673, 688379440, 688637161, 688862228, 689058914, 689251022, 689465485, 689716187, 689994278, 690271378, 690513916, 690700912, 690834808, 690940323, 691052246, 691198196, 691386032, 691601944, 691820526, 692020416, 692197418, 692368393, 692562408, 692806244, 693110199, 693461685, 693831100, 694185791, 694505081, 694789505, 695058289, 695339050, 695651093, 695996017, 696354752, 696697159, 696996536, 697241974, 697442017, 697618866, 697796097, 697984695, 698178482, 698358307, 698503418, 698604202, 698668060, 698717346, 698778152, 698868179, 698989105, 699126663, 699258499, 699365845, 699441299, 699492645, 699537201, 699592896, 699670258, 699768372, 699876175, 699979019, 700066605, 700136566, 700195084, 700252609, 700317154, 700390167, 700465164, 700532074, 700581284, 700609360, 700620956, 700627594, 700643463, 700679932]
2653G00679932O1340P9040Q1254O4086L2425j525k2583k1210K517L5706N9128N8441
2665G01108551L0899r537m0817m3106j0376M5090R8800J25351J11237O0959p248o8512
2677G01401291j05820j14898j06278r7961j06888j40152j90201k39792k69089k65503
2687F99764709k32162j85852j51749j49460j82952k38572k90298l14789l02963k66953
2697F97448959k31933k23770k53601l10822l69644m01917l94516l55148l09143k85568
2707F94312897l01361l52707m18396m70429m90875m78134m47922m22897m20075m41436
2717F90068665m73481m93927m83780m36248l60184k77176k10571j76926j77841k00653
2727F86777878k25754k35291k23007j97220j76544j80053k17514k82517l54843m09622
$$ y = [700679932, 700741272, 700820312, 700901566, 700965652, 700998077, 700996552, 700973969, 700952759, 700955276, 700990982, 701050110, 701108551, 701139450, 701129913, 701089096, 701045990, 701035614, 701080704, 701179504, 701304855, 701416092, 701477051, 701469803, 701401291, 701295471, 701180573, 701074295, 700976334, 700869446, 700729294, 700539093, 700299301, 700030212, 699764709, 699532547, 699346695, 699194946, 699045486, 698862534, 698623962, 698333664, 698018875, 697715912, 697448959, 697217026, 696993256, 696739655, 696428833, 696059189, 695657272, 695262756, 694907608, 694598465, 694312897, 694011536, 693658829, 693240433, 692770004, 692279129, 691800995, 691353073, 690930176, 690510101, 690068665, 689595184, 689101257, 688617477, 688181229, 687821045, 687543869, 687333298, 687156372, 686978531, 686777878, 686552124, 686316833, 686093826, 685896606, 685720062, 685540009, 685322495, 685039978, 684685135, 684275513]
2737F84275513m29077m11377l71094l32489l17688l34778l77197m25110m58679m67453
2747F80350571m56620m42962m46472m77982n34210n98145o48422o69784o59867o32019
2757F74784088o04095n92347o02951o28814o56815o73446o72226o54908o30111o08139
2767F68460236n96314n95703o02264o07148o02798n85404n57937n29022n11246n13611
2777F62758789n38559n78766o21185o51856o64444o62536o59332o70472p05642p63932
2787F56242065q33129q95844r36737r51233r47494r40781r48105r78622j028290j082077
2797F46699753j122055j136475j125641j104049j092148j105423j146622j202392j250840
2806F36414108j271629j258316j221008j181717j163597j177788j218796j267815j304092
$$ y = [684275513, 683846436, 683435059, 683063965, 682731476, 682413788, 682079010, 681701813, 681276703, 680818024, 680350571, 679893951, 679450989, 679004517, 678526535, 677992325, 677394180, 676745758, 676075974, 675416107, 674784088, 674179993, 673587646, 672984695, 672355881, 671699066, 671025620, 670353394, 669698486, 669068375, 668460236, 667863922, 667268219, 666665955, 666058807, 665456009, 664870605, 664312668, 663783646, 663272400, 662758789, 662220230, 661641464, 661020279, 660368423, 659703979, 659041443, 658382111, 657711639, 657005997, 656242065, 655408936, 654513092, 653576355, 652625122, 651677628, 650736847, 649788742, 648810120, 647781830, 646699753, 645577698, 644441223, 643315582, 642211533, 641119385, 640013962, 638867340, 637664948, 636414108, 635142479, 633884163, 632663155, 631481438, 630317841, 629140053, 627921257, 626653442, 625349350]
2815F25349350j315422j305618j291085j290741j314430j357078j399422j418762j400948
2824F13255844j346474j271247j198693j148453j128425j132889j146469j152763j142083
2833F02588348j115417j083260j060180j056443j075248j109162j147194j180076j206703
2842E92554665j237832j288528j372147j490020j628647j764679j874237j945687j983871
2851E77969017k007866k040443k097206k178307k272148k360153k429047k476730k510338
2860E57596779k542877k583123k630462k675858k704811k706108k676887k623826k559623
2869E33893204k495652k435722k374000k297631k193107k055779j891136j714172j543351
2878E14892654j392555j267891j166076j079216j000367r26246q58841q03528p67021
$$ y = [625349350, 624033928, 622728310, 621437225, 620146484, 618832054, 617474976, 616075554, 614656792, 613255844, 611909370, 610638123, 609439430, 608290977, 607162552, 606029663, 604883194, 603730431, 602588348, 601472931, 600389671, 599329491, 598273048, 597197800, 596088638, 594941444, 593761368, 592554665, 591316833, 590028305, 588656158, 587166138, 585537491, 583772812, 581898575, 579952888, 577969017, 575961151, 573920708, 571823502, 569645195, 567373047, 565012894, 562583847, 560107117, 557596779, 555053902, 552470779, 549840317, 547164459, 544459648, 541753540, 539076653, 536452827, 533893204, 531397552, 528961830, 526587830, 524290199, 522097092, 520041313, 518150177, 516436005, 514892654, 513500099, 512232208, 511066132, 509986916, 508986549, 508060303, 507201462, 506397934, 505630913]
2887E05630913p55425p73849q24814r10111j028099j174964j345101j532516j730919
2896D95555115j935845k142753k347222k544937k731476k904968l064728l213730l355560
2905D71313896l494072l632240l769875l905143m034272m154052m262619m362641m458809
2914D35240173m557342m661255m769859m876786m974708n056992n115776n138244n097886
2923C90991325m950256m640617m122010l379325k450181j428642m46243L63693R04884
2932C70842628J148797J137695R70917P68737O38543O47735Q11272J096916J439209
2941C79502449J759682J987152K071609J990929J748352J364479Q65021K70729m04549
2950C91155853j151886j958313k797432l623161m371757m971543n359497n501327n403977
$$ y = [505630913, 504875488, 504101639, 503276825, 502366714, 501338615, 500163651, 498818550, 497286034, 495555115, 493619270, 491476517, 489129295, 486584358, 483852882, 480947914, 477883186, 474669456, 471313896, 467819824, 464187584, 460417709, 456512566, 452478294, 448324242, 444061623, 439698982, 435240173, 430682831, 426021576, 421251717, 416374931, 411400223, 406343231, 401227455, 396089211, 390991325, 386041069, 381400452, 377278442, 373899117, 371448936, 370020294, 369574051, 369937744, 370842628, 371991425, 373129120, 374100037, 374868774, 375507317, 376155052, 376966324, 378063240, 379502449, 381262131, 383249283, 385320892, 387311821, 389060173, 390424652, 391289673, 391560402, 391155853, 390003967, 388045654, 385248222, 381625061, 377253304, 372281761, 366922264, 361420937, 356016960]
2959C56016960n120697m738159m353523m047013l858795l781700l769112l751144l656712
2968C18940105l426265l019066k417126j626777o84777L37792J340656K208500K837524
2977C14490566L161907L169823K903862K441826J869469J255760O39229L3111n60798
2986C29404755j135865j669540k128181k478333k701778k805481k819062k783203k730770
2995C08152542k672901k593155k452850k205544j814899j266327n75218K13718J033230
3004B95818596J804981K450581K905788L130570L115577K883473K482452J975308J426277
3013C17993603Q89911M03557j4705l62530o48079q84342j082726j250915j393414j511688
3023C12138672j607781j685409j750202j807900j861553j911068j953220j984291k002449
$$ y = [356016960, 350896263, 346158104, 341804581, 337757568, 333898773, 330117073, 326347961, 322596817, 318940105, 315513840, 312494774, 310077648, 308450871, 307766094, 308103886, 309444542, 311653042, 314490566, 317652473, 320822296, 323726158, 326167984, 328037453, 329293213, 329932442, 329965553, 329404755, 328268890, 326599350, 324471169, 321992836, 319291058, 316485577, 313666515, 310883312, 308152542, 305479641, 302886486, 300433636, 298228092, 296413193, 295146866, 294571648, 294785366, 295818596, 297623577, 300074158, 302979946, 306110516, 309226093, 312109566, 314592018, 316567326, 317993603, 318883514, 319287071, 319272366, 318909836, 318261757, 317377415, 316294689, 315043774, 313650360, 312138672, 310530891, 308845482, 307095280, 305287380, 303425827, 301514759, 299561539, 297577248, 295574799]
3032B95574799k011033k015476k023582k039814k064686k093887k121239k141762k153778
3041B76909542k159691k163811k171020k183113k200298k218743k235374k246895k251759
3050B57078838k251510k248612k246799k249546k257099k267228k275638k278557k275124
3059B36728725k268924k265816k270718k283992k300644k312489k311993k297954k274990
3068B16141205k251549k235146k228717k229920k232914k232551k226773k216472k204037
3077A96083126k191410k178726k165947k152443k138634k125435k113590k101917k090435
3086A76824589k077694k063542k048320k032090k014885j996459j976166j954861j933317
3095A58727255j913958j897640j884232j872615j860247j844406j823607j797905j769256
$$ y = [295574799, 293563766, 291548290, 289524708, 287484894, 285420208, 283326321, 281205082, 279063320, 276909542, 274749851, 272586040, 270415020, 268231907, 266031609, 263812866, 261577492, 259330597, 257078838, 254827328, 252578716, 250331917, 248082371, 245825272, 243558044, 241282406, 239003849, 236728725, 234459801, 232193985, 229923267, 227639275, 225338631, 223026142, 220714149, 218416195, 216141205, 213889656, 211654510, 209425793, 207195873, 204962959, 202730408, 200503635, 198287163, 196083126, 193891716, 191712990, 189547043, 187394600, 185255966, 183130531, 181016941, 178915024, 176824589, 174746895, 172683353, 170635033, 168602943, 166588058, 164591599, 162615433, 160660572, 158727255, 156813297, 154915657, 153031425, 151158810, 149298563, 147454157, 145630550, 143832645, 142063389]
3104A42063389j740818j716061j697206j683913j673841j664286j652021j636954j620044
3113A26978245j603422j588622j575574j562405j547642j530342j511230j491671j472826
3122A13094511j454372j435585j415425j394443j374827j359548j350155j344872j340761
3131A00624523j333685j321707j306638j291943j281614j276426j273623j269197j259432
3140H9010258j244145j226310j210137j198902j192913j189566j185722j178274j165486
3149G8218803j147341j124525j098071j071009j045623j024632j007882r93347r77134
3158F8729239r55906r29265q99663q70085q43473q18753p93223p63798p29785o93312
3168F0431976o57139o23869n93343n63712n33595n03636m75783m52356m34151m19226
$$ y = [142063389, 140322571, 138606510, 136909304, 135225391, 133551550, 131887264, 130235243, 128598289, 126978245, 125374823, 123786201, 122210627, 120648222, 119100580, 117570238, 116059008, 114567337, 113094511, 111640139, 110204554, 108789129, 107394686, 106019859, 104660311, 103310156, 101965284, 100624523, 99290838, 97969131, 96662493, 95370550, 94088936, 92812510, 91538887, 90269690, 89010258, 87766113, 86539803, 85329666, 84130764, 82937851, 81748285, 80562563, 79384289, 78218803, 77071462, 75946937, 74848866, 73777857, 72732234, 71707602, 70699720, 69706373, 68729239, 67773333, 66844068, 65944405, 65074320, 64230847, 63412094, 62618871, 61855073, 61125288, 60431976, 59774837, 59150968, 58557625, 57993913, 57460318, 56956682, 56480899, 56028543, 55594392, 55175166]
3178E5175166m04749l88603l70817l54328l42388l36957l37534l40767l43056l41487
3188E1614480l36294l30753l28227l33008l45903l63936l82433l95308l98578l92289
3198D8007751l79301l64756l53375l47294l47262l51653l58605l65887l71466l72805
3208D4395347l68810l59159l46641l35145l27907l26175l27473l27411l22280l11317
3218D1043029k97971k87304k82931k85378k90343k92657k87726k75099k58131k41838
3228C8243651k30238k24698k23035k22540k19999k14705k07560j99709j92983j88914
3238C6119270j87902j90346j96040k02420k06759k05726j97568j84656j70972j62377
3248C4214504j62587j71528j85952k00987k12968k21641k29094k39408k54082k72635
$$ y = [55175166, 54770417, 54381814, 54010997, 53656669, 53314281, 52977324, 52639790, 52299023, 51955967, 51614480, 51278186, 50947433, 50619206, 50286198, 49940295, 49576359, 49193926, 48798618, 48400040, 48007751, 47628450, 47263694, 46910319, 46563025, 46215763, 45864110, 45505505, 45139618, 44768152, 44395347, 44026537, 43667378, 43320737, 42985592, 42657685, 42331510, 42004037, 41676626, 41354346, 41043029, 40745058, 40457754, 40174823, 39889445, 39599102, 39306445, 39018719, 38743620, 38485489, 38243651, 38013413, 37788715, 37565680, 37343140, 37123141, 36908436, 36700876, 36501167, 36308184, 36119270, 35931368, 35741022, 35544982, 35342562, 35135803, 34930077, 34732509, 34547853, 34376881, 34214504, 34051917, 33880389, 33694437, 33493450, 33280482, 33058841, 32829747, 32590339, 32336257, 32063622]
3258C2063622k92158l08742l19193l22823l19843l12336l01711k89026k73971k55380
3268B9068439k32780k05231j73800j40273j06187p2830l9949o879K7609O3048R8450
3279B8279617J32916J66673K00627K37041K76434L17436L57327L92826M22189M45614
3289C1228700M64718M80442M92385M98421M96432M86384M70316M52206M35908M22132
3299C5928044M08206L87934L54118L02896K33696J51544O4978j6947q7616j42679j83449
3310C7400725k12319k31977k43766k46956k39599k19750j88074j48008j06666p4702
3320C5488908o4442q7197j51448k59011m03793n70027p34065q66945r41052r37042
3330C0473886q51241o98146n08013l17569j58133m5453K4321P2179J25485K09050L37460
$$ y = [32063622, 31771464, 31462722, 31143529, 30820706, 30500863, 30188527, 29886816, 29597790, 29323819, 29068439, 28835659, 28630428, 28456628, 28316355, 28210168, 28137338, 28097389, 28090510, 28118119, 28181167, 28279617, 28412533, 28579206, 28779833, 29016874, 29293308, 29610744, 29968071, 30360897, 30783086, 31228700, 31693418, 32173860, 32666245, 33164666, 33661098, 34147482, 34617798, 35070004, 35505912, 35928044, 36336250, 36724184, 37078302, 37381198, 37614894, 37766438, 37831416, 37814469, 37726853, 37584174, 37400725, 37188406, 36956429, 36712663, 36465707, 36226108, 36006358, 35818284, 35670276, 35563610, 35488908, 35424466, 35337269, 35185821, 34926810, 34523017, 33952990, 33218925, 32351980, 31410928, 30473886, 29622645, 28924499, 28416486, 28098917, 27940784, 27895331, 27919652, 27991831, 28117316, 28326366, 28663826]
3341B8663826N10838P18610R41110J154289J333897J459477J519547J515207J459344
3350C9276145J372969J277403J187797J110540J043362R81765R21874Q63333Q08596
3359D8843784P60374P20654O89301O64444O43373O22511N97329N65939N27482M84776
3369E5119967M43092M07138L80349L63593L55091L52688L53331L54710L54042L49455
3379E8833456L40591L30238L23243L24736L36060L54080L71714L80006L73282L50180
3389F2317586L15142K76627K43058K22350K17418K26245K40979K51012K46511K23636
3399F4780564J86220J44042J09602R0641Q8296R7037J08385J15819J16434J10793J00274
3410F6048107Q6589P0953N5514M3330L6864L5906L7074L5424K7223J4014J111l977
$$ y = [28663826, 29174664, 29893274, 30834384, 31988673, 33322570, 34782047, 36301594, 37816801, 39276145, 40649114, 41926517, 43114314, 44224854, 45268216, 46249981, 47171855, 48035188, 48843784, 49604158, 50324812, 51014113, 51678557, 52321930, 52944441, 53541770, 54107709, 54635191, 55119967, 55563059, 55970197, 56350546, 56714139, 57069230, 57421918, 57775249, 58129959, 58484001, 58833456, 59174047, 59504285, 59827528, 60152264, 60488324, 60842404, 61214118, 61594124, 61967406, 62317586, 62632728, 62909355, 63152413, 63374763, 63592181, 63818426, 64059405, 64310417, 64556928, 64780564, 64966784, 65110826, 65220428, 65311069, 65399365, 65496402, 65604787, 65720606, 65837040, 65947833, 66048107, 66134696, 66205649, 66261163, 66304493, 66341357, 66377263, 66414337, 66449761, 66476984, 66490998, 66492109, 66488132]
3422F6488132K628J8449L6144M6868M5405L4041J9431R804R227J5054K0337J8038N522
3435F6769080j3366l0245l7532l1696j5416M888K3265L7360M8718O1336P7081R6445
3447F6989918J15471J31487J44172J55587J70274J92032K21186K56152K92454L25412
3457F8994145L51897L71866L88942M09279M40297M85119N40905N96633O38614O55923
3467G3873620O47717O25982O10075O19201O61507P30958Q09393Q75697R15952R29480
3477H1299582R27181R26590R41496R77783J030512J088276J139049J175890J198778
3486I0705137J214609J230908J253137J281519J311226J337614J358033J373872J389628
3495A02455683J407594J427670J446829J461057J469946J475582J481953J492434J506090
$$ y = [66488132, 66490760, 66509209, 66545353, 66592221, 66637626, 66671667, 66691098, 66700902, 66710129, 66725183, 66745520, 66763558, 66769080, 66755714, 66725469, 66687937, 66656241, 66640825, 66645713, 66668978, 66706338, 66755056, 66816392, 66893473, 66989918, 67105389, 67236876, 67381048, 67536635, 67706909, 67898941, 68120127, 68376279, 68668733, 68994145, 69346042, 69717908, 70106850, 70516129, 70956426, 71441545, 71982450, 72579083, 73217697, 73873620, 74521337, 75147319, 75757394, 76376595, 77038102, 77769060, 78578453, 79454150, 80370102, 81299582, 82226763, 83153353, 84094849, 85072632, 86103144, 87191420, 88330469, 89506359, 90705137, 91919746, 93150654, 94403791, 95685310, 96996536, 98334150, 99692183, 101066055, 102455683, 103863277, 105290947, 106737776, 108198833, 109668779, 111144361, 112626314, 114118748, 115624838]
3504A15624838J521530J536770J552782J572237J596899J624870J650858J667557J672249
3513A30020590J668300J664839J670771J690903J720771J750384J767845J765957J745491
3522A45465851J714678J685247J668406J671114J694812J735306J784401J831284J865749
3531A61116848J881275J878967J867524J860885J870652J899585J937237J965294J965885
3540A78244152J933746J879998J828308J801204J808548J842766J883888J914387J928311
3549A95065308J933498J942940J963882J993313K022877K049675K080326K125854K186070
3558B13363743K240372K249584K179775K027283J831798J664868J596565J657543J824513
3567B30636044K031326K204857K298355K308769K265434K209053K169533K162895K194138
$$ y = [115624838, 117146368, 118683138, 120235920, 121808157, 123405056, 125029926, 126680784, 128348341, 130020590, 131688890, 133353729, 135024500, 136715403, 138436174, 140186558, 141954403, 143720360, 145465851, 147180529, 148865776, 150534182, 152205296, 153900108, 155635414, 157419815, 159251099, 161116848, 162998123, 164877090, 166744614, 168605499, 170476151, 172375736, 174312973, 176278267, 178244152, 180177898, 182057896, 183886204, 185687408, 187495956, 189338722, 191222610, 193136997, 195065308, 196998806, 198941746, 200905628, 202898941, 204921818, 206971493, 209051819, 211177673, 213363743, 215604115, 217853699, 220033474, 222060757, 223892555, 225557423, 227153988, 228811531, 230636044, 232667370, 234872227, 237170582, 239479351, 241744785, 243953838, 246123371, 248286266, 250480404]
3576B50480404K263222K362079K463475K521762K486515K332955K086601J824913J646595
3585B70468521J623039J758976J990662K216759K352447K366677K288341K178803K094688
3594B89338913K062302K079601K132969K212639K314644K427654K522106K555675K494050
3603C10140553K336769K128028J941453J848926J886368K038421K244874K422561K493630
3612C29481583K409324K168999J832314J514511J358299J476059J883392K459717K968788
3621C47552986L151589K853965K119179J194229M26865J04294L20854R44672J697616
3630C60366249K301331K600097K600746K425614K223129K099228K099648K225036K446633
3639C81387711K696304K855186K773247K336235J557579O22711j61094n02625k82860
$$ y = [250480404, 252743626, 255105705, 257569180, 260090942, 262577457, 264910412, 266997013, 268821926, 270468521, 272091560, 273850536, 275841198, 278057957, 280410404, 282777081, 285065422, 287244225, 289338913, 291401215, 293480816, 295613785, 297826424, 300141068, 302568722, 305090828, 307646503, 310140553, 312477322, 314605350, 316546803, 318395729, 320282097, 322320518, 324565392, 326987953, 329481583, 331890907, 334059906, 335892220, 337406731, 338765030, 340241089, 342124481, 344584198, 347552986, 350704575, 353558540, 355677719, 356871948, 357298813, 357403107, 357723961, 358668633, 360366249, 362667580, 365267677, 367868423, 370294037, 372517166, 374616394, 376716042, 378941078, 381387711, 384084015, 386939201, 389712448, 392048683, 393606262, 394228973, 394067879, 393565254, 393282394]
3648C93282394L73650J157074J735802J924400J758156J437263J191101J155091J327629
3657D05342560J617508J920318K167321K321586K349358K213783J903458J470642J031456
3666D22337990P08923N54390N04952M22172J95046j66130n11246o29120l74832K42500
3676D23284645J062012J857643K442970K726326K697449K377014J789856R85527Q1139
3685D39304581p24144j201706j194420p04765R1056R19495J531067J796951J730843
3694D41548958J440086J050530O63719L54576J93138K45400N37910J005173J475067
3703D48514557J716804J549569R51767R8724o93894j111793r84955l63655N11932J327973
3713D51517029J832351J922188J654358J183167O80694K75574L3226l2005O8283L07121
$$ y = [393282394, 393656044, 394813118, 396548920, 398473320, 400231476, 401668739, 402859840, 404014931, 405342560, 406960068, 408880386, 411047707, 413369293, 415718651, 417932434, 419835892, 421306534, 422337990, 423046913, 423601303, 424106255, 424528427, 424723473, 424557343, 424046097, 423416977, 423042145, 423284645, 424346657, 426204300, 428647270, 431373596, 434071045, 436448059, 438237915, 439223442, 439304581, 438580437, 437378731, 436184311, 435479546, 435570602, 436490097, 438021164, 439818115, 441548958, 442989044, 444039574, 444703293, 445057869, 445251007, 445496407, 446034317, 447039490, 448514557, 450231361, 451780930, 452732697, 452831421, 452137527, 451025734, 450040779, 449677124, 450189056, 451517029, 453349380, 455271568, 456925926, 458109093, 458789787, 459065361, 459098587, 459066582, 459134865, 459441986]
3723D59441986O43730J014405J329307J482086J374054R56383K74734n02853j105575
3732D64908257j245537p53289L04223J590118K609329K930031K406311J275940N0278
3741D74075661p54433q94432n20783o0882O3782k90413q98705j321525j191330m52080
3751D67754860O01349J502380J886368J683845J126633N79567L21655M11721O99043
3760D76567421R50050R89189P76139L94821j3352l17039m30183l22991j7471M11186
3770D78987770Q42209J137733J192246R82971N89562J63917j37482k26936j20621Q1711
3780D83493080K59514L40958L35540L15400L58543M93355O80694Q44498R28993R35745
3790D88986320R15070R12933R17283Q48541O14242J90316l31612p74002r74732q89473
$$ y = [459441986, 460085716, 461100121, 462429428, 463911514, 465285568, 466241951, 466516685, 466013832, 464908257, 463662720, 462909431, 463213654, 464803772, 467413101, 470343132, 472749443, 474025383, 474075661, 473321228, 472426796, 471906013, 471845131, 471908913, 471618500, 470719795, 469398270, 468206940, 467754860, 468356209, 469858589, 471744957, 473428802, 474555435, 475135002, 475456657, 475868378, 476567421, 477517471, 478506660, 479282799, 479677620, 479664268, 479347229, 478917046, 478594055, 478576584, 478987770, 479829979, 480967712, 482159958, 483142929, 483732491, 483896408, 483758926, 483531990, 483411369, 483493080, 483752594, 484093552, 484429092, 484744492, 485103035, 485596390, 486277084, 487121582, 488050575, 488986320, 489901390, 490814323, 491731606, 492580147, 493194389, 493384705, 493053093, 492279091, 491304359, 490414886]
3800D90414886o21719l47938j90812j26152l013L35312R08584J545334J963616J938591
3810D95816689J444358O75431p2480n72052p76443q01125q02230q44918q58536p03392
3820D92505302k92778L18642R47876J386948J520614J388245J142998R48143Q71391
3829E00737381Q49533P37419M10309j42364p88765j312752j520157j340256q57048
3838D96773300k53372L02849P57065J183128J693649K302170K823677K913475K238770
3847E10734711P08961j378937l386497m581833m471817l050041q20694J421699K943001
3856D98118553L373604K819977J745147P01790O8169q7090M0055J55258N1079k86713
3866E06699829o97136r53102q93211n03540Q4800O69480J073265J213722J114349Q66394
$$ y = [490414886, 489793167, 489445229, 489254417, 489128265, 489125252, 489460564, 490369148, 491914482, 493878098, 495816689, 497261047, 497936478, 497863998, 497291946, 496515503, 495714378, 494912148, 494067230, 493208694, 492505302, 492212524, 492531166, 493479042, 494865990, 496386604, 497774849, 498917847, 499865990, 500737381, 501586914, 502324333, 502734642, 502592278, 501803513, 500490761, 498970604, 497630348, 496773300, 496519928, 496822777, 497579842, 498762970, 500456619, 502758789, 505582466, 508495941, 510734711, 511443672, 510064735, 506678238, 502096405, 497624588, 494574547, 493753853, 495175552, 498118553, 501492157, 504312134, 506057281, 506759071, 506827240, 506740150, 506780205, 506935463, 506986542, 506699829, 506002693, 505049591, 504156380, 503652840, 503737640, 504407120, 505480385, 506694107, 507808456, 508674850]
3876E08674850N69115K87285M5433j50604k87171l37905k83318j40572K8153J41983
3886E08547249J52740Q6136M0512J33438M21334Q45642J241112J409721J221275O81267
3896E14780426o8130q13256j360550j598510j514740j169014o54068p1793M78058R06296
3906E08914719J149406J189423J058960Q22601N45425K68326R422k12669l63731m02413
3916E12979469l14254j36872M6196J54114J60484J09711Q0147J18294J97448K35939
3926E13630676J63079j6861k15569l13072k38533j4382K59743M71382N55497N13572
3936E14795532L90969K39028R6245r498n7984m3297J2665O1379N6915n951p7858q8501
3948E15369644m387J36681K48337K62451J84860Q9722N4931R2202J39503J19896K1057
$$ y = [508674850, 509243965, 509531250, 509576683, 509426079, 509138908, 508801003, 508517685, 508377113, 508405266, 508547249, 508699989, 508786125, 508826637, 508960075, 509381409, 510227051, 511468163, 512877884, 514099159, 514780426, 514712296, 513899040, 512538490, 510939980, 509425240, 508256226, 507602158, 507530365, 508008423, 508914719, 510064125, 511253548, 512312508, 513135109, 513680534, 513948860, 513958282, 513745613, 513381882, 512979469, 512665215, 512528343, 512574539, 512728653, 512889137, 512998848, 513078995, 513197289, 513394737, 513630676, 513793755, 513776894, 513561325, 513248253, 513009720, 512995338, 513255081, 513726463, 514281960, 514795532, 515186501, 515425529, 515521774, 515512276, 515454292, 515410995, 515423660, 515485039, 515541954, 515536003, 515458145, 515369644, 515365257, 515501938, 515750275, 516012726, 516197586, 516287308, 516342239, 516434441, 516573944, 516693840, 516714897]
3959E16714897q5487j03607l434J41488K12020J48011M692r3880p0190K9754P8049
3970E16972313j0338j81045k76566j83678L7155J79863P1450k45896n16166m83895
3980E15363197j51672J67885R9144m35028j067047j251908p82280j00288m5204j116791
3990E10680008k834435l860817l060646q84933J1063m287110j6664200l6610984n9401017
3999C83086929p7649231
4000C05437698
$$ y = [516714897, 516629410, 516525803, 516522369, 516663857, 516875877, 517023888, 517028580, 516934700, 516864510, 516894264, 516972313, 516961975, 516780930, 516504364, 516320686, 516357841, 516537704, 516609154, 516363258, 515847092, 515363197, 515211525, 515379410, 515478554, 515043526, 513976479, 512724571, 511942291, 511842003, 511796799, 510680008, 507845573, 503984756, 500924110, 500039177, 500050240, 495763130, 479098930, 442487946, 383086929, 305437698]
##END=$$ End of the data block
