##TITLE=$$ Begin of the data block
##JCAMP-DX=5.00 $$ ACD/SpecManager v 10.08
##SPECTROMETER/DATA SYSTEM=16PC
##DATE=28 May 2013 10:35:46
##DATA TYPE=INFRARED SPECTRUM
##DATA CLASS=XYDATA
##ORIGIN=
##OWNER=
##NPOINTS=3601
##FIRSTX=400.00000000
##LASTX=4000.00000000
##MAXX=4000.00000000
##MINX=400.00000000
##MAXY=73.14942169
##MINY=6.88196659
##XFACTOR=1.0000000000
##YFACTOR=0.000000100000000
##FIRSTY=24.66206551
##DELTAX=1.00000000
##XUNITS=1/CM
##YUNITS=TRANSMITTANCE
##XYDATA=(X++(Y..Y))
400B46620655O1445789M7940102L0281525J3625221J768188m107284n297928m337273
408C87938995l481102l750114m903030o104126o713372o682663o418152o346168o564980
417C36975288o821746o773720o290398n561275m950562m731197m901238n201263n292606
426B86451283m953499m163208l045750j750336l68423J058521K476387L769512M772892
435B84247379N339775N406704N012513M265136L286248K177333J016693j29661j204853
444C09417267k177334l057117l888016m717159n558033o378975p128964p778053q341293
453B60392323q863430r374772r853725j0228310j0417003j0380936j0143814r769230
461A81361103r306469q750210q042335p112818n930614m527960k981501j371927K51922
$$ y = [246620655, 308066444, 356006546, 386288071, 399913292, 401681480, 397574196, 392276268, 387938995, 384457893, 380707779, 375804749, 369700623, 362987251, 356304588, 349886436, 343540268, 336975288, 330153542, 323379822, 317089424, 311528149, 306577587, 301846390, 296945152, 291743889, 286451283, 281497784, 277334576, 274288826, 272538490, 272170067, 273228588, 275704975, 279474487, 284247379, 289587154, 294993858, 300006371, 304271507, 307557755, 309735088, 310751781, 310622120, 309417267, 307239933, 304182816, 300294800, 295577641, 290019608, 283640633, 276511669, 268733616, 260392323, 251528893, 242154121, 232300396, 222072086, 211655083, 201274147, 191130333, 181361103, 172054634, 163304424, 155262089, 148149271, 142218657, 137690697, 134709196, 133337269, 133589191]
470A33589191J875391L494616N089645O616393Q021144R266425J0340232J1245823
478A89538860J1979828J2518349J2824306J2869454J2654705J2212086J1589469J0826378
486B87013435R944420Q953057P866287O716080N549507M414634L343735K347221J418038
495C37566414N45807k76680j049156j768418k430343l029595l558960m010200m379673
504C17609196m675541m916783n128326n328217n520324n694866n836106n932483n982686
513B68593864n993804n976277n941601n901127n868682n857907n875950n916080n954704
522B15307732n958805n900021n765820n563984n315074n038376m740944m415093m044838
531A68564777l613052l109150k528515j871319j142730l55921M64897J284771K064877
$$ y = [133589191, 135464582, 138959198, 144048843, 150665236, 158686380, 167952805, 178293037, 189538860, 201518688, 214037037, 226861343, 239730797, 252385502, 264597588, 276187057, 287013435, 296957855, 305910912, 313777199, 320493279, 326042786, 330457420, 333801155, 336148376, 337566414, 338112221, 337835541, 336786385, 335017967, 332587624, 329558029, 325999069, 321988869, 317609196, 312933655, 308016872, 302888546, 297560329, 292040005, 286345139, 280509033, 274576550, 268593864, 262600060, 256623783, 250682182, 244781055, 238912373, 233054466, 227178516, 221262436, 215307732, 209348927, 203448906, 197683086, 192119102, 186804028, 181765652, 177024708, 172609615, 168564777, 164951725, 161842575, 159314060, 157442741, 156300011, 155944090, 156408987, 157693758, 159758635]
540A59758635K773122L392449L921470M369946M747467N058575N301189N473023N578765
549B00374641N632496N656491N672474N695610N731124N775910N826588N883216N953274
558B52201824O047135O170787O319485O476116O615753O716538O768475O777801O761951
567C10855865O738072O713009O680298O623153O526566O385536O208420O012535N816345
576C68559799N631638N461960N305366N158043N017242M881058M747277M613990M480629
585D13857002M350586M231072M129715M049186L984490L921928L845024L740769L605728
594D49715500L446083L277512L115844K972718K851715K749252K661285K590676K549171
603D75929756K555924K625160K754059K915687L063355L148079L139915L042297K891732
$$ y = [159758635, 162531757, 165924206, 169845676, 174215622, 178963089, 184021664, 189322853, 194795876, 200374641, 206007137, 211663628, 217336102, 223031712, 228762836, 234538746, 240365334, 246248550, 252201824, 258248959, 264419746, 270739231, 277215347, 283831100, 290547638, 297316113, 304093914, 310855865, 317593937, 324306946, 330987244, 337610397, 344136963, 350522499, 356730919, 362743454, 368559799, 374191437, 379653397, 384958763, 390116806, 395134048, 400015106, 404762383, 409376373, 413857002, 418207588, 422438660, 426568375, 430617561, 434602051, 438523979, 442369003, 446109772, 449715500, 453161583, 456439095, 459554939, 462527657, 465379372, 468128624, 470789909, 473380585, 475929756, 478485680, 481110840, 483864899, 486780586, 489843941, 492992020, 496131935, 499174232, 502065964]
612E02065964K742157K640648K609520K639389K698593K748718K756767K705078K589798
621E26196632K419472K211151J985817J761780J549034J344032J134377R07555O63604
630E40173454M19159K01073L3531p5188j34391j61782j70898j65825j43471j03187
640E39872475n3177o333L0671O2332J00479J52130K10571K59362K89993L13110L52783
651E41584396M22478M98047N19485M29841K30407J1254q7586K8839L07083N14145L28446
662E44786835m77753j859779l441468m641418m936752m134217k493667o29235P69082
671E22941628J247215P68394l20434j501198k346802k693367k647247k455445k338256
680E10654488k383347k544250k716179k822609k856903k863999k890167k942047k975731
$$ y = [502065964, 504808121, 507448769, 510058289, 512697678, 515396271, 518144989, 520901756, 523606834, 526196632, 528616104, 530827255, 532813072, 534574852, 536123886, 537467918, 538602295, 539509850, 540173454, 540592613, 540793686, 540827217, 540752029, 540617638, 540455856, 540284958, 540119133, 539975662, 539872475, 539819298, 539812965, 539843636, 539905968, 540006447, 540158577, 540369148, 540628510, 540918503, 541231613, 541584396, 542006874, 542504921, 543024406, 543454247, 543684654, 543695908, 543608322, 543637161, 543944244, 544458389, 544786835, 544309082, 542449303, 539007835, 534366417, 529429665, 525295448, 522801781, 522172546, 522941628, 524188843, 524957237, 524636803, 523135605, 520788803, 518095436, 515448189, 512992744, 510654488, 508271141, 505726891, 503010712, 500188103, 497331200, 494467201, 491577034, 488634987, 485659256]
689D85659256k914391k673683k180328j385117k76909J097680K622261M122200N410156
698D89481125O348762O903420P149200P228585P280197P376251P504349P596473P582779
707E54451141P437439P184372O872711O536561O173095N749741N236282M636116L998757
716F08276215L401260K912445K561150K323112K135468J927414J649704J291771Q75358
725F27353897M38538J5144l78227p41425j082382j408882j721459k017211k294884
734F18163109k557907k812882l063583l304062l519974l692779l810311l871002l880691
743E87649918l845826l762664l616143l390045l078079k693329k267723j837540j428642
752E61729927j047630o86302l35808r92K95410N21469O52504O83403O28052N10025
$$ y = [485659256, 482744865, 480071182, 477890854, 476505737, 476228828, 477326508, 479948769, 484070969, 489481125, 495829887, 502733307, 509882507, 517111092, 524391289, 531767540, 539271889, 546868362, 554451141, 561888580, 569072952, 575945663, 582482224, 588655319, 594405060, 599641342, 604277458, 608276215, 611677475, 614589920, 617151070, 619474182, 621609650, 623537064, 625186768, 626478539, 627353897, 627792435, 627807579, 627429352, 626687927, 625605545, 624196663, 622475204, 620457993, 618163109, 615605202, 612792320, 609728737, 606424675, 602904701, 599211922, 595401611, 591530609, 587649918, 583804092, 580041428, 576425285, 573035240, 569957161, 567263832, 564996109, 563158569, 561729927, 560682297, 559995995, 559660187, 559659195, 559954605, 560476074, 561128578, 561811981, 562440033, 562950058]
762E62950058L45077J35575j26953m48685q22258j225319j630669k018814k383422
771E54774590k725792l037415l285255l412209l353577l068008k561989j901131j192855
780E30236359n56641q6708J69678K16217R2811j48163m61769q17604j198921j588936
790E25856323j958732k257882k412414k332115j925850j125794Q7815J664619L481407
799E19077377N357056P090111Q504829R491539J0023461J0148429R956170R543113
807E89192085Q983231Q325500P602272O845169O092911N383454M739303M155808L605728
816F44925461L057327K499390J953201J467743J093826Q55942P34024O73065O06461
825F57866440M89731L16238J14288p4463k21481l23028l96805m63639n32531n96085
$$ y = [562950058, 563295135, 563430710, 563303757, 562855072, 562032814, 560807495, 559176826, 557158012, 554774590, 552048798, 549011383, 545726128, 542313919, 538960342, 535892334, 533330345, 531429214, 530236359, 529679718, 529593010, 529762688, 529978905, 530071716, 529923553, 529461784, 528644180, 527445259, 525856323, 523897591, 521639709, 519227295, 516895180, 514969330, 513843536, 513931351, 515595970, 519077377, 524434433, 531524544, 540029373, 549520912, 559544373, 569692802, 579648972, 589192085, 598175316, 606500816, 614103088, 620948257, 627041168, 632424622, 637163925, 641319733, 644925461, 647982788, 650482178, 652435379, 653903122, 654996948, 655852890, 656586914, 657259979, 657866440, 658356171, 658672409, 658786697, 658712234, 658490753, 658167725, 657770920, 657307281, 656774750, 656178665]
835F56178665o40030o59561o69022o96640p68432q92410j049653j206970j333847j422195
845F46839905j490021j569595j687317j846771k026978k194824k324600k413788k481346
854F28804665k556916k660026k790566k930107l055343l155098l238717l329429l452454
863F01636009l617134l812904m012451m189911m331208m439010m524956m596367m646683
872E63465385m656295m603501m480629m301796m102325l926888l813209l782845l840484
881E25957413l980484m194680m476585m818687n206757n619354o029206o415596o769752
890D78446312p099381p421875p754783q106461q473320q842888r202385r543609r863396
899D02138214j0159378j0422935j0634423j0762176j0764084j0589867j0186348r501705
$$ y = [656178665, 655538635, 654879074, 654210052, 653513412, 652744980, 651852570, 650802917, 649595947, 648262100, 646839905, 645349884, 643780289, 642092972, 640246201, 638219223, 636024399, 633699799, 631286011, 628804665, 626247749, 623587723, 620797157, 617867050, 614811707, 611656609, 608417892, 605088463, 601636009, 598018875, 594205971, 590193520, 586003609, 581672401, 577233391, 572708435, 568112068, 563465385, 558809090, 554205589, 549724960, 545423164, 541320839, 537393951, 533580742, 529797897, 525957413, 521976929, 517782249, 513305664, 508486977, 503280220, 497660866, 491631660, 485216064, 478446312, 471346931, 463925056, 456170273, 448063812, 439590492, 430747604, 421545219, 412001610, 402138214, 391978836, 381555901, 370921478, 360159302, 349395218, 338805351, 328619003, 319117298]
907C19117298q496723p156944n506382l616371j601468L97263K239037L810539N046272
916C04232521N931568O493683O781330O845741O727791O455727O051712N539551M950256
925C60009880M321289L690758L092193K549210K078171J690941J399040J214790J147194
934C81193466J196823J351776J587410J871300K169075K450485K692223K875023K982330
943D00369911K998047K908249K704582K387467J966209J457291Q80623K55813l99284
952D15528908j067505j731644k377167k992019l570786m115677m633102n130501n610351
961C84300156o068154o493873o875687p205238p480278p703896p882538q021011q120976
970C18448505q181438q200760q179912q123646q039723p937927p825947p708378p587337
$$ y = [319117298, 310620575, 303463631, 297957249, 294340878, 292739410, 293136673, 295375710, 299186249, 304232521, 310164089, 316657772, 323439102, 330284843, 337012634, 343468361, 349520073, 355059624, 360009880, 364331169, 368021927, 371114120, 373663330, 375741501, 377432442, 378831482, 380046272, 381193466, 382390289, 383742065, 385329475, 387200775, 389369850, 391820335, 394512558, 397387581, 400369911, 403367958, 406276207, 408980789, 411368256, 413334465, 414791756, 415672379, 415928192, 415528908, 414461403, 412729759, 410352592, 407360573, 403789787, 399674110, 395041008, 389910507, 384300156, 378232002, 371738129, 364862442, 357657204, 350176926, 342473030, 334590492, 326569481, 318448505, 310267067, 302066307, 293886395, 285762749, 277723026, 269785099, 261959152, 254250774, 246663437]
979B46663437p462883p336178p210064p088566o976700o877574o793232o724244o670265
988A83523731o631260o607418o596279o592531o584530o557322o494865o384010o218930
997A24856586o000947n736075n429773n081435m682283m216204l666620l023519k292958
1006H4726772j499271o84319R8353P94353J356249J749745J956052J969252J795883
1015I2263069J451903R64384L70502k83632r46655j568213k106743k531080k822294
1024H4791241k969046k964969k807450k500563k059097j511512q97159k61779L54953
1033F9174619R24487J433959J882219K274819K617168K911191L156538L352127L500176
1042I1227303L604059L670082L703337L706750L682127L629618L549547L443022L312893
$$ y = [246663437, 239200554, 231864376, 224654312, 217565746, 210589046, 203711472, 196918240, 190193996, 183523731, 176892471, 170285053, 163688774, 157096243, 150511713, 143954391, 137459526, 131075516, 124856586, 118855639, 113119564, 107689791, 102608356, 97926073, 93709869, 90043249, 87019730, 84726772, 83227501, 82543182, 82641535, 83435888, 84792137, 86541882, 88497934, 90467186, 92263069, 93714972, 94679356, 95049858, 94766226, 93819571, 92251358, 90144615, 87613535, 84791241, 81822195, 78857226, 76049776, 73549213, 71490116, 69978604, 69081445, 68819666, 69174619, 70099106, 71533065, 73415284, 75690103, 78307271, 81218462, 84375000, 87727127, 91227303, 94831362, 98501444, 102204781, 105911531, 109593658, 113223276, 116772823, 120215845, 123528738]
1051A23528738L163528L001957K836295K674894K523632K383995K252569K123423J990270
1060A46479301J849890J702156J548920J389437J220436J035824Q30335O03657L63417
1069A57023373J23691r7742k84538m25520n15394n54505n47256n00822m24147l27053
1079A53470087k18964j07154O361J22938K46868L81107N23958O69547Q08296R31940
1089A56834984J037865J129188J214066J301250J394787J492939J588077J671009J735650
1098A69399815J781463J814404J842079J870212J897965J918220J920681J897564J849060
1107A86191463J789074J743432J747531J838913K049523K397671K883644L485851M164371
1116B08291473M865628N531349O108398O557064O858025P011948P037849O963902O823196
$$ y = [123528738, 126692266, 129694223, 132530518, 135205412, 137729044, 140113039, 142365608, 144489031, 146479301, 148329191, 150031347, 151580267, 152969704, 154190140, 155225964, 156056299, 156659956, 157023373, 157147064, 157049322, 156764784, 156339264, 155823870, 155269365, 154722109, 154221287, 153797140, 153470087, 153251123, 153143969, 153150330, 153273268, 153520136, 153901243, 154425201, 155094748, 155903044, 156834984, 157872849, 159002037, 160216103, 161517353, 162912140, 164405079, 165993156, 167664165, 169399815, 171181278, 172995682, 174837761, 176707973, 178605938, 180524158, 182444839, 184342403, 186191463, 187980537, 189723969, 191471500, 193310413, 195359936, 197757607, 200641251, 204127102, 208291473, 213157101, 218688450, 224796848, 231353912, 238211937, 245223885, 252261734, 259225636, 266048832]
1125B66048832O644497O451111O258163O074581N904618N747680N600663N458164N314464
1134C19502773N165577N011254M854583M702416M560241M430962M313469M202843M094772
1143C60838890L987198L882256L785438L701744L636131L588372L555908L530426L498535
1152C94004898L437882L320388L116837K809334K403030J934853J471405J091804Q65441
1161D14455872Q28018R68742J235924J556778J861954K107467K281151K396164K476501
1170D30168571K540360K594795K635918K658348K662392K655220K648773K651100K662430
1179D53877907K674293K675782K660560K630348K595101K566032K549439K542114K533035
1188D77304611K510910K469864K414627K356034K307395K275086K256431K242356K223587
$$ y = [266048832, 272693329, 279144440, 285402603, 291477184, 297381802, 303129482, 308730145, 314188309, 319502773, 324668350, 329679604, 334534187, 339236603, 343796844, 348227806, 352541275, 356744118, 360838890, 364826088, 368708344, 372493782, 376195526, 379831657, 383420029, 386975937, 390506363, 394004898, 397442780, 400763168, 403880005, 406689339, 409092369, 411027222, 412498627, 413590431, 414455872, 415283890, 416252632, 417488556, 419045334, 420907288, 423014755, 425295906, 427692070, 430168571, 432708931, 435303726, 437939644, 440597992, 443260384, 445915604, 448564377, 451215477, 453877907, 456552200, 459227982, 461888542, 464518890, 467113991, 469680023, 472229462, 474771576, 477304611, 479815521, 482285385, 484700012, 487056046, 489363441, 491638527, 493894958, 496137314, 498360901]
1197D98360901K195320K160530K125740K096100K072067K049294K023887J995736J969833
1206E17049408J953011J947402J947976J942596J918602J870384J804047J733665J675263
1215E33842354J637688J618461J606941J590157J561050J521073J477699J438751J406670
1224E47700844J377525J344834J303825J256409J209755J173095J151734J144409J144485
1233E58806915J144486J139107J128540J116218J104393J092911J077766J054955J024475
1242E68689766R91516R65385R54094R59664R76333R93042J000176R94453R79386R62028
1252E78465843R47838R33342R09386Q65249P97730P14721O34079N75829N53703N68238
1262E85965958O09359O61545P12204P56035P93304Q26073Q51784Q63724Q54911Q23822
$$ y = [498360901, 500556221, 502716751, 504842491, 506938591, 509010658, 511059952, 513083839, 515079575, 517049408, 519002419, 520949821, 522897797, 524840393, 526758995, 528629379, 530433426, 532167091, 533842354, 535480042, 537098503, 538705444, 540295601, 541856651, 543377724, 544855423, 546294174, 547700844, 549078369, 550423203, 551727028, 552983437, 554193192, 555366287, 556518021, 557662430, 558806915, 559951401, 561090508, 562219048, 563335266, 564439659, 565532570, 566610336, 567665291, 568689766, 569681282, 570646667, 571600761, 572560425, 573536758, 574529800, 575529976, 576524429, 577503815, 578465843, 579413681, 580347023, 581256409, 582121658, 582919388, 583634109, 584268188, 584844017, 585397720, 585965958, 586575317, 587236862, 587949066, 588705101, 589498405, 590324478, 591176262, 592039986, 592894897, 593718719]
1272E93718719P77169P28950O91948O72379O66580O63681O54335O36711O17867O09550
1282F00437889O19621O45600O76918O99615P05834O97479O84547O76842O76727O77529
1292F07198601O69327O45790O12144N80940N65491N69534N82886N89295N75218N41687
1302F13130913N03654M82140M89921N22500N60493N80444N70870N36957M99115M77333
1312F18354340M80232M99649N18913N23720N14030N02549N06286N33638N78995O25153
1322F23637505O53228O54335O32096N99746N70565N51452N40657N31922N18684M96559
1332F29386749M64325M21486L69187L12461K62413K34452K42424K90336L68424M53644
1342F32805901N20782N51453N42984N06668M61235M22325L98102L87611L87230L94096
$$ y = [593718719, 594495888, 595224838, 595916786, 596589165, 597255745, 597919426, 598573761, 599210472, 599828339, 600437889, 601057510, 601703110, 602380028, 603079643, 603785477, 604482956, 605167503, 605844345, 606521072, 607198601, 607867928, 608513718, 609125862, 609706802, 610272293, 610841827, 611424713, 612014008, 612589226, 613130913, 613634567, 614116707, 614606628, 615129128, 615689621, 616270065, 616840935, 617377892, 617877007, 618354340, 618834572, 619334221, 619853134, 620376854, 620890884, 621393433, 621899719, 622433357, 623012352, 623637505, 624290733, 624945068, 625577164, 626176910, 626747475, 627298927, 627839584, 628371506, 628890190, 629386749, 629851074, 630272560, 630641747, 630954208, 631216621, 631451073, 631693497, 631983833, 632352257, 632805901, 633326683, 633878136, 634421120, 634927788, 635389023, 635811348, 636209450, 636597061, 636984291, 637378387]
1352F37378387M08326M29496M52538M67110M59251M19312L48358K60467J80054J33667
1362F40936966J38092J94321K85186L80402M46777M60740M17785L33862K39716J68228
1372F44002075J40228J58539K08359K66876L15705L47900L66440L76434L77960L64380
1382F46924896L32108K90146K62985K84576L74146N20248O72684P61337P29218N65719
1392F51718063L17002P0114q6975j08872j1520J40533K69394L26309L08838K54670
1402F53197556K09808J99737K18354K39181K41699K30179K33612K83509L87649N13077
1412F55954361N95856N70831M10233J44271j40152l33328l49960j67771J55564N04837
1422F57344742P54165Q22525P12433N07431L30429K80610L78646N54123O81229O48804
$$ y = [637378387, 637786713, 638216209, 638668747, 639135857, 639595108, 640014420, 640362778, 640623245, 640803299, 640936966, 641075058, 641269379, 641554565, 641934967, 642381744, 642842484, 643260269, 643594131, 643833847, 644002075, 644142303, 644300842, 644509201, 644776077, 645091782, 645439682, 645806122, 646182556, 646560516, 646924896, 647257004, 647547150, 647810135, 648094711, 648468857, 648989105, 649661789, 650423126, 651152344, 651718063, 652035065, 652105179, 652018204, 651909332, 651897812, 652038345, 652307739, 652634048, 652942886, 653197556, 653407364, 653607101, 653825455, 654064636, 654306335, 654536514, 654770126, 655053635, 655441284, 655954361, 656550217, 657121048, 657531281, 657675552, 657535400, 657202072, 656852112, 656684341, 656839905, 657344742, 658098907, 658921432, 659633865, 660141296, 660471725, 660752335, 661130981, 661685104, 662366333, 663015137]
1432F63015137M24423P7591k50015m16565l46909o7139L15171O65054Q75855R02023
1442F65194626P58819N03922K19269l052p5455N6229L73611P63245J036301J006317
1452F69833832N93338j04218q22067j242676j157074n82504K30026R22241J215287
1461F68886185J054916O28204K41547J34811L44239O90994R03320P88117L49808k13242
1471F73808899o25839o93283m00162R6512N67703Q41598Q80280P73392O61163O39343
1481F76549606P06711P73316P27462N08423J55411k03018m06952l48969l6468L93371
1491F78818893P30286P89719N16205L0899m11759n46036k41394M05503J095810J465301
1501F82653427J270142N24749m90112j354294j708221j417923o24695L42941J133881
$$ y = [663015137, 663439560, 663517151, 663267136, 662850571, 662503662, 662436523, 662751694, 663416748, 664292603, 665194626, 665953445, 666457367, 666676636, 666673584, 666598129, 666654358, 667027969, 667791214, 668827515, 669833832, 670427170, 670322952, 669500885, 668258209, 667101135, 666518631, 666748657, 667670898, 668886185, 669941101, 670569305, 670810852, 670945663, 671289902, 671980896, 672884216, 673672333, 674022141, 673808899, 673183060, 672489777, 672089615, 672186127, 672753830, 673595428, 674475708, 675249100, 675910263, 676549606, 677256317, 678029633, 678757095, 679265518, 679420929, 679217911, 678810959, 678461990, 678425522, 678818893, 679549179, 680338898, 680855103, 680886002, 680474243, 679928207, 679686813, 680092316, 681188126, 682653427, 683923569, 684448318, 683958206, 682603912, 680895691, 679477768, 678853073, 679196014, 680329895]
1510F80329895J530380J511612J214752Q30079M95910K54288O8359j18408l28445n28260
1520F85260162o47888o18362m11454n9356L48587O92062Q66623Q26798O16531L59650
1530F87233353K07901K62375N07736Q00247R27505P18079J45645o34155j336517j677323
1540F87154846j505127q74328j8998P57294J216049J280136J046753P23267N17426
1549F90297318N40084P51953R82514J004944O45370j22146j127854k046432k514649
1558F88411102k288589j373978n4092J208648J967850J990967J364822M43573l30734
1567F91339569o47278m68521k0904L49960L77502J4344n58701j046371j205521r68094
1577F87165985m59671Q0719M31137M85382K82212m1428l33405m99725n31464m87670
$$ y = [680329895, 681860275, 683371887, 684586639, 685416718, 685912628, 686166916, 686235275, 686116867, 685788422, 685260162, 684612274, 683993912, 683582458, 683523102, 683871689, 684563751, 685430374, 686257172, 686873703, 687233353, 687441254, 687703629, 688211365, 689011612, 689939117, 690657196, 690802841, 690168686, 688832169, 687154846, 685649719, 684775391, 684756393, 685513687, 686729736, 688009872, 689056625, 689779892, 690297318, 690837402, 691589355, 692571869, 693576813, 694222183, 694100037, 692972183, 690925751, 688411102, 686122513, 684748535, 684694443, 685903091, 687870941, 689861908, 691226730, 691670303, 691339569, 690692291, 690223770, 690202866, 690552826, 690930328, 690944672, 690385971, 689339600, 688134079, 687165985, 686706314, 686787033, 687218170, 687703552, 687985764, 687944336, 687610931, 687111206, 686579742, 686092072]
1587F86092072m48761m71039n64118o93512q08105q68836q70132q39844q21533q45718
1597F78860474r12552r91440j044083j052780j037369j042404j104889j217041j319732
1606F69138184j331177j202851r66644p36770o58188q23670j208191j663437j980209
1615F58567047j994095j671600j129532n81741k30484j74561l69110o59790q64181
1624F50891953q53501n99365j71585K99911O70319Q20236O85272K78244k93884q37326
1634F50890274j117859r49325k91367O93131J673812K281723K288819J737823R41773
1643F58148804L37753K53906P19528J431046J908951J769638R61838j72043j058808
1652F64300613j198349m38995R28879K321853L166810L191604K537842J644592R81827
$$ y = [686092072, 685643311, 685172272, 684608154, 683914642, 683106537, 682237701, 681367569, 680527725, 679706192, 678860474, 677947922, 676956482, 675912399, 674859619, 673822250, 672779846, 671674957, 670457916, 669138184, 667807007, 666604156, 665637512, 664900742, 664242554, 663418884, 662210693, 660547256, 658567047, 656572952, 654901352, 653771820, 653190079, 652959595, 652785034, 652415924, 651756134, 650891953, 650038452, 649439087, 649267502, 649567413, 650237732, 651057968, 651743240, 652021484, 651727600, 650890274, 649772415, 648823090, 648531723, 649224854, 650898666, 653180389, 655469208, 657207031, 658148804, 658486557, 658740463, 659459991, 660891037, 662799988, 664569626, 665531464, 665359421, 664300613, 663102264, 662663269, 663592148, 665914001, 669080811, 672272415, 674810257, 676454849, 677436676]
1661F77436676P94830J008301J325531J444321J245346Q39691M59747K85340L28674
1670F85168457M48227M78439L69797K35825K70538N90439J114502J569519J635055
1679F91880798J139222J86309q66775j580353j648407j048431l6469R93576J701813
1688F90721283J942825J780854J402664R84344O07453K52838j30844n47028r17511
1697F96096878j111298j023559o44837q3923M75083Q56552R74502Q68378O77109N65261
1707F97650146O35834Q71964J138839J243134J029892M69818l03802j036072j453705
1716G00246048j388321q60748p7439O61698J104660J163635R44901O75582N62363O68640
1726G03701019Q74787R52835P10602J22909o29806j241455j440049j133880m62036
$$ y = [677436676, 678231506, 679239807, 680565338, 682009659, 683255005, 684094696, 684554443, 684839783, 685168457, 685616684, 686095123, 686464920, 686700745, 686971283, 687561722, 688676224, 690245743, 691880798, 693020020, 693206329, 692339554, 690759201, 689110794, 688062363, 688025894, 689019470, 690721283, 692664108, 694444962, 695847626, 696831970, 697439423, 697692261, 697561417, 697014389, 696096878, 694985580, 693962021, 693317184, 693233261, 693708344, 694564896, 695539398, 696407776, 697084885, 697650146, 698285980, 699157944, 700296783, 701539917, 702569809, 703039627, 702735825, 701699753, 700246048, 698857727, 697996979, 697919540, 698581238, 699685898, 700849533, 701794434, 702470016, 703032379, 703701019, 704575806, 705528641, 706239243, 706362152, 705732346, 704490891, 703050842, 701916962, 701454926]
1735G01454926K77252P84301R07364P04041L86658J86691K21023M37775O62842P14569
1745G06737442N16052J36719k50015m64478m17251j41449K32772N56107P25784P18918
1755G08350601N77240L69492J59683n951r1476o8131P8201L26004O02875P97882Q00019
1766G11896439N56335J07193m13742q29849r94339q51746m59747L8910M79660P36618
1776G10265732P62558N91507L11661L0288j59683k01950q7967J37711L85131N43137
1786G12578125N18799K82059j07270n11780p66983p58132m80118m7074L54920N56412
1796G11618958M86755K06909j25885l41797l43933j52283J17951L24020L72925K61078
1806G12424698O3705j17645k10800k02561j29699m3793K1286O1646R2773J26724J60218
$$ y = [701454926, 701732178, 702516479, 703423843, 704127884, 704514542, 704701233, 704922256, 705360031, 706022873, 706737442, 707253494, 707390213, 707140198, 706675720, 706258469, 706117020, 706349792, 706905899, 707631683, 708350601, 708927841, 709297333, 709457016, 709451065, 709359589, 709291458, 709369659, 709695663, 710298538, 711096420, 711896439, 712452774, 712559967, 712146225, 711316376, 710322037, 709470291, 709010544, 709049454, 709529114, 710265732, 711028290, 711619797, 711931458, 711961746, 711802063, 711600113, 711512146, 711649857, 712034988, 712578125, 713096924, 713378983, 713271713, 712759933, 711992950, 711234818, 710754700, 710707626, 711062546, 711618958, 712105713, 712312622, 712186737, 711844940, 711501007, 711348724, 711466675, 711790695, 712163620, 712424698, 712488403, 712370758, 712159958, 711957397, 711827698, 711783905, 711805191, 711866837, 711959610, 712086334, 712246552]
1817G12246552J78298J71738J45645J18485J03683R6588P4845J5487q0261j77688k23389
1828G12669983j76544l6698J51139L20739M25949M65088M77753N07431N61295N94024
1838G15960159N29633L16238k7542m00467o60476o95191m84772j16348K56653M92020
1848G15169907N24139L88336J86768K5482m2572l5172j2054k6016q4687j47323j57089
1859G15789719q5907L7994J41144J42822M730k43911n14756p01294p28073n84106l22876
1870G12935486l5782J89743L01743K97164K10343R3079o409n9128n6000p629O2332
1881G13924942J22833J45417J14059L3722o8512j54419j90048j63651q9569j449O5994
1892G13739319R6435R4452Q1330P6751Q7738J07041J21765J26038J23901J23291J27563
$$ y = [712246552, 712424850, 712596588, 712742233, 712860718, 712964401, 713060989, 713135834, 713151321, 713071060, 712893372, 712669983, 712493439, 712456741, 712607880, 712928619, 713354568, 713819656, 714297409, 714804840, 715366135, 715960159, 716489792, 716806030, 716778488, 716378021, 715717545, 715022354, 714537582, 714421234, 714677887, 715169907, 715694046, 716082382, 716269150, 716294632, 716252060, 716216888, 716204834, 716178818, 716094131, 715946808, 715789719, 715703812, 715741806, 715882950, 716025772, 716030502, 715786591, 715271835, 714570541, 713842468, 713258362, 712935486, 712899704, 713089447, 713391190, 713688354, 713898697, 713991776, 713985367, 713926239, 713870239, 713862610, 713924942, 714047775, 714193192, 714307251, 714340973, 714272461, 714118042, 713927994, 713764343, 713674774, 713673325, 713739319, 713835754, 713930206, 714011536, 714088287, 714176025, 714283066, 714404831, 714530869, 714654770, 714778061, 714905624]
1903G14905624J28251J12686P6446L5401J8920N4398J43585K53372L28904L21579K19574
1914G16598740N8746r4299j77079j63269p4386L6392J15509J39236J19248Q9035P9269
1925G16727142R6741J24054J34125J10779O0272Q392j5106O790O7978J41525J93558
1936G17656250J95999J41983M5166o1722j42517j69601j34430n2185M6768J27640J68762
1947G17822113J67313J38244J04599Q2932P7514P9957P9956P1868N9662N3711O1112
1958G18798981Q0032J00250J08109R5672O3553K2736j3275l3264l3341j5030J3046
1969G19187469M3030O6300P7209P4692O2103M6997L6240L4332M0589M8828N3329N3406
1981G19824524N1956N4855O3858P3014P0724M6616r16n8975j06048j20621r4986l7308
$$ y = [714905624, 715033875, 715146561, 715223007, 715258408, 715277328, 715331726, 715475311, 715728683, 716057587, 716379166, 716598740, 716657486, 716563187, 716386108, 716222839, 716148453, 716184845, 716300354, 716439590, 716558838, 716647873, 716727142, 716823883, 716947937, 717082062, 717192841, 717253113, 717261505, 717246399, 717253189, 717321167, 717462692, 717656250, 717852249, 717994232, 718039398, 717977676, 717835159, 717665558, 717531128, 717478943, 717525711, 717653351, 717822113, 717989426, 718127670, 718232269, 718315201, 718392715, 718472672, 718552628, 718624496, 718684158, 718737869, 718798981, 718879013, 718979263, 719087372, 719183044, 719246597, 719269333, 719256058, 719222794, 719189453, 719174423, 719187469, 719230499, 719296799, 719374008, 719448700, 719510803, 719557800, 719594040, 719628372, 719668961, 719717789, 719771118, 719824524, 719876480, 719931335, 719995193, 720068207, 720138931, 720185547, 720184631, 720125656, 720019608, 719898987, 719804001, 719766693]
1993G19766693K9144P7897R3765P7209M4174J6022O485J6937L7232N1498N0965L7918
2005G20305939K2659K0294L7613P1640J07803J29395J25122R5520N2567J3733n646
2016G20976639k29K6016O0883R1934J10321J13602J04828Q8195O8741M9286L1738J7166
2028G21739120P935M807Q544J8235L0823M3640N3558N8441N8975N6382N4626N6915
2040G22192001O6223Q2627J03683J24054J39084J44501J38855J23825J02463P9498
2050G23296814N9967M7760M5853N3558O8054Q2779R2163TQ3542P0877O0501N6229N7526
2063G24167786O1416O2638O0043N5618N3482N7450O6375P5989Q0414P6218O5155N3253
2075G24935837M6005M6768N3864O2484O8741P0725P1869P4234P9422Q4839Q5373P8659
$$ y = [719766693, 719795837, 719873734, 719967499, 720044708, 720088882, 720104904, 720111389, 720128326, 720165558, 720217056, 720268021, 720305939, 720328598, 720348892, 720386505, 720458145, 720565948, 720695343, 720820465, 720915985, 720968552, 720982285, 720976639, 720976410, 721002426, 721063309, 721155243, 721265564, 721379166, 721483994, 721572189, 721640930, 721690216, 721721954, 721739120, 721747055, 721751862, 721760406, 721778641, 721809464, 721853104, 721906662, 721965103, 722024078, 722080460, 722135086, 722192001, 722258224, 722340851, 722444534, 722568588, 722707672, 722852173, 722991028, 723114853, 723217316, 723296814, 723356781, 723404541, 723450394, 723503952, 723572006, 723654785, 723746948, 723839111, 723922653, 723993530, 724054031, 724110260, 724167786, 724229202, 724291840, 724351883, 724407501, 724460983, 724518433, 724584808, 724660797, 724741211, 724817429, 724882584, 724935837, 724981842, 725028610, 725082474, 725144958, 725213699, 725284424, 725356293, 725430527, 725509949, 725594788, 725680161, 725758820]
2087G25758820O4621M9514M0207M0894N0888O4163P3547P5150P0877O5842O5918P2479
2099G26492920Q1406Q6975Q3542P2250N8670M9667M8752N3711N7831N5084M4098K9755
2111G27214661K0752K3193L7460N6839P2098P7438P2251O2561N5847N5923O1417O6757
2123G27877197O6605N8212M4480L0212K1744K0599K6932L6392M5853N2108N2796M7455
2135G28380585L7536K5483J5411J1520J5946K7694M2572N5771O3553O4163N9891N3787
2147G28853912M7531M2801M0436M1123M5547N3330O3095P0190P0877O4087N2719M3259
2159G29488907M1962M9972O3019P3242P3624O3705M8294L6850L5401M3869N4855N8517
2171G30132217N0202L3188J7624J3809K6626N0126P3165Q3847P7973O0425M1732L1510
$$ y = [725758820, 725823441, 725872955, 725913162, 725954056, 726004944, 726069107, 726142654, 726217804, 726288681, 726354523, 726420441, 726492920, 726574326, 726661301, 726744843, 726817093, 726875763, 726925430, 726974182, 727027893, 727085724, 727140808, 727184906, 727214661, 727235413, 727258606, 727296066, 727352905, 727425003, 727502441, 727574692, 727637253, 727693100, 727749023, 727810440, 727877197, 727943802, 728002014, 728046494, 728076706, 728098450, 728119049, 728145981, 728182373, 728228226, 728280334, 728333130, 728380585, 728418121, 728443604, 728459015, 728470535, 728486481, 728514175, 728556747, 728612518, 728676071, 728740234, 728800125, 728853912, 728901443, 728944244, 728984680, 729025803, 729071350, 729124680, 729187775, 729257965, 729328842, 729392929, 729445648, 729488907, 729530869, 729580841, 729643860, 729717102, 729790726, 729854431, 729902725, 729939575, 729974976, 730018845, 730073700, 730132217, 730182419, 730215607, 730233231, 730247040, 730273666, 730323792, 730396957, 730480804, 730558777, 730619202, 730660934, 730692444]
2183G30692444L1051L5706L7155L0670J9760J2742J6098L0212M7836N8060N5466M2343
2195G31109543K8839K4872L3493M7455N5313M8599K7695L051j2969j3428j297J2131
2207G31363297J7089J0376q39n722J526J8158L3493L5705K1134l738k5483l3569k5177
2220G31406250p095Q697J4572R919M57n798m959L81N341N188O10m806o485l891j297
2235G31417084m807j8005l8757n9968p2402p1869o0730m7684m2648n1270p1793r5062
2247G30782089j10931j12610j01242q5373p5378p7439r1629j11313j27182j35040j35269
2258G29618683j34125j37710j47629j61133j69525j67237j52511j29089j04218q4076
2268G28231430p1182o3629n6992m6768l0213n722K6474O5537J10016J54419J90963
$$ y = [730692444, 730723495, 730759201, 730796356, 730827026, 730846786, 730859528, 730875626, 730905838, 730953674, 731011734, 731067200, 731109543, 731138382, 731163254, 731196747, 731244202, 731299515, 731348114, 731375809, 731378860, 731365891, 731352463, 731351166, 731363297, 731380386, 731390762, 731389923, 731384201, 731385727, 731403885, 731437378, 731473083, 731494217, 731490479, 731464996, 731431427, 731406250, 731399155, 731407852, 731422424, 731432343, 731432800, 731427002, 731422043, 731422424, 731427765, 731432953, 731433563, 731428757, 731422272, 731418381, 731417084, 731412277, 731394272, 731355515, 731295547, 731223145, 731151276, 731090546, 731042862, 731000214, 730948944, 730877151, 730782089, 730671158, 730558548, 730457306, 730371933, 730296555, 730219116, 730127487, 730016174, 729888992, 729753952, 729618683, 729484558, 729346848, 729199219, 729038086, 728868561, 728701324, 728548813, 728419724, 728315506, 728231430, 728160248, 728096619, 728039627, 727992859, 727962646, 727956924, 727983398, 728048935, 728158951, 728313370, 728504333]
2279G28504333K06757J88065J23901J0681j44043l20053m89807o25153p09381p43026
2289G26002274p43027p34711p40738p69729q16040q64029q99430r18045r25064r33151
2299G17658310r53369r93576j058884j155853j291199j467361j672135j872864k023391
2308G05169678k077942k014847j852188j651154j501236j491775j679382k061463k566223
2317F88273468l070145l432617l549423l395844l043289k635574k327118k212143k281113
2326F62326202k426529k504043k409134k133637j761322j413574j180114j080933j083756
2335F46333160j155624j302643j550751j878051k137299k050552j310692K39258K437706
2344F37624512M767685O492080O931992N756454L142701k78321l664856o278305p719497
$$ y = [728504333, 728711090, 728899155, 729023056, 729033737, 728889694, 728569641, 728079834, 727454681, 726745300, 726002274, 725259247, 724524536, 723783798, 723014069, 722198029, 721334000, 720434570, 719516525, 718591461, 717658310, 716704941, 715711365, 714652481, 713496628, 712205429, 710738068, 709065933, 707193069, 705169678, 703091736, 701076889, 699224701, 697573547, 696072311, 694580536, 692901154, 690839691, 688273468, 685203323, 681770706, 678221283, 674825439, 671782150, 669146576, 666819458, 664607315, 662326202, 659899673, 657395630, 654986496, 652852859, 651091537, 649677963, 648497849, 647416916, 646333160, 645177536, 643874893, 642324142, 640446091, 638308792, 636258240, 634947548, 635186806, 637624512, 642392197, 648884277, 655816269, 661572723, 664715424, 664437103, 660772247, 654493942, 646774445]
2353F46774445p995072p408752o364403n186691m041710k957192j902466q57048J63460
2362F10224571J125260K005806K806739L541184M213524M807319N292817N647659N873070
2371F45537949N993194O045075O058578O053085O033860O000213N942917N842285N666657
2380F99173813N377731M948807M382324L717880L021164K363434J795502J336288R78165
2389G27095108P00378M86298L27225K19650J56097J23368J04065Q6288O7978N4398
2399G29420853N2566O1569P3777P8125O7062M3335J6861p63l586N722J8158K4338K0142
2412G29878159P400o790j5106j4115n798M196R613O333m883k0142l2425l7155l2730
2425G29736557k2812j3122q393j0376j5030j7929j4496n111N951J3580J2970M272r689
$$ y = [646774445, 638779373, 631370621, 625006218, 619819527, 615777817, 612820625, 610918159, 610061111, 610224571, 611349831, 613355637, 616162376, 619703560, 623917084, 628724403, 634017220, 639664879, 645537949, 651531143, 657576218, 663634796, 669687881, 675721741, 681721954, 687664871, 693507156, 699173813, 704551544, 709500351, 713882675, 717600555, 720621719, 722985153, 724780655, 726116943, 727095108, 727795486, 728281784, 728609009, 728828659, 728984756, 729108124, 729212189, 729298477, 729366455, 729420853, 729473419, 729534988, 729608765, 729686890, 729753952, 729797287, 729814148, 729813385, 729809799, 729815521, 729833679, 729858017, 729878159, 729885559, 729878769, 729863663, 729849548, 729843750, 729847946, 729857559, 729863892, 729859009, 729838867, 729806442, 729769287, 729736557, 729713745, 729700623, 729692230, 729681854, 729666824, 729648895, 729634399, 729629288, 729635239, 729648819, 729661789, 729666061, 729656372]
2438G29656372k4795l7384m6387n1728n4397n4398n1040m4022l4256k3193j2512m731
2450G29217529j526l814j2512k6551m2496n6686o4163o3934n7526m9896m5319m5853
2462G28747253m9438n1575m8828m0131k9067k1134j9531k4033l1585l7461l9444l7842
2474G28317184l5705l5782l8147m2114m4556m4403m3259m2801m4250m7073m7837m3792
2486G27807465l3722k0676j0071o943j3885k8458m4403n4626n4627m4250k8458j4038
2498G27453308o027o561j2970k1668k9297l3951l6926l8681l9825l7613k9984j6784
2510G27143021j450J1292J5487J0987J52j0605j6556j7929j8692k4795l8681n6687
2522G26995544p0724p2327n8822l6087j4878o103j4038l2730n1194n8975n1803l5859
$$ y = [729656372, 729631577, 729594193, 729547806, 729496078, 729441681, 729387283, 729336243, 729292221, 729257965, 729234772, 729222260, 729217529, 729216003, 729212189, 729199677, 729173126, 729130630, 729073944, 729009781, 728945847, 728888321, 728838425, 728793106, 728747253, 728697815, 728646240, 728597412, 728557281, 728528214, 728507080, 728487549, 728463516, 728431931, 728394470, 728355026, 728317184, 728281479, 728245697, 728207550, 728165436, 728120880, 728076477, 728033218, 727990417, 727946167, 727899094, 727851257, 727807465, 727773743, 727753067, 727742996, 727736053, 727722168, 727693710, 727649307, 727594681, 727540054, 727495804, 727467346, 727453308, 727447281, 727440720, 727427750, 727406082, 727376785, 727342834, 727305908, 727267227, 727227402, 727189789, 727159805, 727143021, 727141571, 727152863, 727168350, 727179337, 727179489, 727168884, 727152328, 727134399, 727115707, 727090912, 727052231, 726995544, 726924820, 726852493, 726793671, 726757584, 726742706, 726736603, 726722565, 726689835, 726638641, 726579666, 726527863, 726492004]
2534G26492004k0599j6556k4490l9368n0888n1727m1275k6703j6861j6937k7008l9368
2546G26120224m7150m7226m2953m1657m8828o3095p7667q2932p3318n1346k7161j1291
2558G25505600j0605k2125l7079m4479l9063k4338q087O11r92r003j6327j7013j1597
2571G25265503n798p019j8540l8147n7144o8283o7444n7678m5090l5858l1967l0441
2583G24802094k6856j8311p324J145J602p324k1286l3875l8834l5171k6703j9913j9149
2596G24550095k4109k9602k9297k0676o180O409R232j53j8234l6698m6768m5318l6393
2609G24272308k7465k5254l0823m0206m6998m7073m2953m0894m7150o2179p9880q9035
2621G23692398q2245n8746k7237o87J1063O409q622k3498l1204l1281k9983l3722m5166
$$ y = [726492004, 726471405, 726454849, 726430359, 726390991, 726340103, 726288376, 726247101, 726220398, 726203537, 726186600, 726159592, 726120224, 726073074, 726025848, 725982895, 725941238, 725892410, 725829315, 725751648, 725668716, 725595398, 725544052, 725516891, 725505600, 725494995, 725472870, 725435791, 725391312, 725352249, 725327911, 725319824, 725320435, 725319443, 725310440, 725294113, 725277100, 725265503, 725259705, 725252686, 725234146, 725195999, 725138855, 725070572, 725003128, 724945450, 724900360, 724864502, 724832535, 724802094, 724775238, 724756927, 724749603, 724750748, 724752350, 724745026, 724723740, 724689865, 724651031, 724615860, 724589157, 724569244, 724550095, 724525986, 724496384, 724467087, 724446411, 724440231, 724446640, 724455872, 724455719, 724437485, 724400787, 724354019, 724308701, 724272308, 724244843, 724219589, 724188766, 724148560, 724101562, 724054489, 724011536, 723970642, 723923492, 723861313, 723781433, 723692398, 723610153, 723551407, 723524170, 723523483, 723534546, 723540955, 723532333, 723508835, 723477631, 723446350, 723416367, 723382645, 723337479]
2634G23337479n9204o6834o1035m2420j9378l815n112k2354m7302o6528p0954o0577
2646G22811966m3488l1280l1510m4250o0577p0420o7596n2872l3798j9531j4420j6708
2658G22325516k0218j9913j5411j1597j4496k6397m3183n5008n3329l5706r003J3962
2670G22035217K1057Q393j8769m8217o8131p3089o6681n7297n1880n2261n3711n1270
2682G21523361m3030l3111l0289m0283o2256q6365j00250r4528p0648l9292j5869j1291
2694G20896149k5406m8447o5384o6452n1880l0441j4877j2741k2431l4637l9292l2272
2706G20451889j8387q163j0910k8458n2948p3090p8506o8817n0964l6164l1662l6011
2718G19957809m1656l8986k4643l357J3122J4573k137l0136n6839p0343o6147m9972
$$ y = [723337479, 723278275, 723211441, 723150406, 723107986, 723088608, 723084793, 723079681, 723057327, 723010025, 722943497, 722872543, 722811966, 722768478, 722737198, 722705688, 722661438, 722600861, 722530441, 722462845, 722409973, 722376175, 722356644, 722342224, 722325516, 722305298, 722285385, 722269974, 722258377, 722243881, 722217484, 722174301, 722119293, 722065964, 722030258, 722021255, 722035217, 722056274, 722064667, 722045898, 721997681, 721929550, 721856461, 721789780, 721732483, 721680603, 721628342, 721574631, 721523361, 721480331, 721447220, 721416931, 721376648, 721314392, 721228027, 721127777, 721033249, 720962601, 720923309, 720907440, 720896149, 720870743, 720822296, 720756912, 720690460, 720638580, 720608139, 720593262, 720580521, 720558090, 720523453, 720484161, 720451889, 720433502, 720425339, 720414429, 720385971, 720333023, 720259933, 720181427, 720112610, 720061646, 720025482, 719993820, 719957809, 719916153, 719877167, 719852524, 719849167, 719862289, 719876862, 719874725, 719844589, 719787750, 719717407, 719651260, 719601288]
2730G19601288l3035k5711l1357m5548n9204o4392n9738m9286m0054l5859l6392l7079
2742G19083633l3569k6474j9989k0370l0747m7531o2408o6529n6686l7460j9608j3351
2754G18648911k2202m1428o0806p0801o9198o1341n6839o2255p6752r1400r4223p9804
2766G17861862n1346k0980l357o180k7695n5008p3929p5683o1112m1504k9220l2807
2778G17383041n1040p4311r0713r2926q2016o5765n4245n2491n9585o8360p1869o7215
2790G16552505n6076m6157m2267m5319n1880n8212o1035o3858p0343q2932r9411j11923
2802G15763092j11923r6970p2174n0278m2572n3558p7209j00480j10473j02692q3084
2813G14861679o3171n3482n6458o6147p3547p2861o5765o0654o4850p9422r7198j06812
$$ y = [719601288, 719568253, 719542542, 719511185, 719465637, 719406433, 719342041, 719282303, 719233017, 719192963, 719157104, 719120712, 719083633, 719050064, 719023590, 719003601, 718983231, 718952484, 718904953, 718842545, 718776016, 718719330, 718681870, 718662262, 718648911, 718626709, 718585281, 718524475, 718453674, 718384476, 718323135, 718266296, 718204041, 718127289, 718035889, 717941666, 717861862, 717810516, 717789536, 717786179, 717779999, 717752304, 717697296, 717623367, 717547684, 717486572, 717445068, 717415848, 717383041, 717332001, 717257690, 717166977, 717074051, 716992035, 716926270, 716872025, 716819534, 716759949, 716691589, 716619720, 716552505, 716496429, 716450272, 716408005, 716362686, 716310806, 716252594, 716191559, 716127701, 716057358, 715974426, 715875015, 715763092, 715651169, 715554199, 715482025, 715431747, 715389175, 715335617, 715258408, 715157928, 715047455, 714944763, 714861679, 714798508, 714745026, 714688568, 714622421, 714548874, 714476013, 714410248, 714349594, 714284744, 714205322, 714108124, 714001312]
2825G14001312j00555q0872n7602m4326m8295o6375q6975r8420r5977q5984q0261q9569
2837G13066101j14746j45264j67083j69144j54266j34659j28632j46713j87378k35825
2847G11482391k73285k85720k70844k37427j98898j64642j37024j10474q2321n1880
2857G09669876k6703j5640k3727m7379p5302r4452r6664q2779o1341m3258l6621m3259
2869G09022751n8899p8735r8343j17112j34201j48468j55868j51825j34811j07728
2879G07836761p8887n7679n1727o2180q4228j09406j29928j40610j42212j37710j31150
2890G06711044j24817j17950j09406r8876q8959q4610r1019j09253j35650j60828j74790
2901G05414886j71279j51291j21689r2621p1106n6915m5395l1433j4878l814r918m2573
$$ y = [714001312, 713900757, 713819885, 713762283, 713717957, 713669662, 713603287, 713516312, 713417892, 713321915, 713235931, 713155670, 713066101, 712951355, 712806091, 712639008, 712469864, 712315598, 712180939, 712052307, 711905594, 711718216, 711482391, 711209106, 710923386, 710652542, 710415115, 710216217, 710051575, 709914551, 709804077, 709721756, 709669876, 709643173, 709627533, 709603806, 709556427, 709481125, 709386673, 709290009, 709207230, 709145889, 709102631, 709066010, 709022751, 708963852, 708885117, 708786774, 708669662, 708535461, 708386993, 708231125, 708079300, 707944489, 707836761, 707757874, 707700195, 707648468, 707586288, 707502060, 707392654, 707262726, 707122116, 706979904, 706842194, 706711044, 706586227, 706468277, 706358871, 706259995, 706171036, 706086426, 705995407, 705886154, 705750504, 705589676, 705414886, 705243607, 705092316, 704970627, 704878006, 704806900, 704749985, 704704590, 704673157, 704658279, 704654465, 704644547, 704601974]
2913G04601974r8876j65864k23464k55433k57721k39715k17133k02713j96533j88827
2923G02555695j65406j20697o3019j1215J5946R918k0599n4932p2327o2561l0594R232
2935G01989441M3945O8817Q9646J15051J46942J76392J87530J67847J18637N5084Q40
2946G03160172k5940k3423n340O103n645m2725r2316j36719j63879j73874j77765j88446
2958G02130203k11181k40631k64435k70996k57645k29569j97372j68381j41983j12762
2968G00035248p4005k6169K4185O5537Q9721R6588R2774Q9187R1401R8495J01929R2010
2980G00776901O5613K7924p630k8381k6856n874K1896M3259M9209L9444K1515M959
2992G00981979n569j1902k0752l8681o6986r9411j25351j37100j32599j17264r9029
$$ y = [704601974, 704503098, 704337234, 704113770, 703858337, 703600616, 703360901, 703143768, 702941055, 702744522, 702555695, 702390289, 702269592, 702206573, 702195358, 702211304, 702221222, 702200623, 702145691, 702073364, 702010803, 701980209, 701989441, 702033386, 702102203, 702191849, 702306900, 702453842, 702630234, 702817764, 702985611, 703104248, 703159332, 703160172, 703134232, 703110809, 703105469, 703111572, 703105927, 703063202, 702970886, 702834167, 702670288, 702496414, 702318649, 702130203, 701919022, 701678391, 701413956, 701142960, 700885315, 700655746, 700458374, 700289993, 700148010, 700035248, 699961243, 699935074, 699959259, 700024796, 700114517, 700211105, 700303879, 700393066, 700484467, 700582962, 700684891, 700776901, 700842514, 700870438, 700862808, 700834427, 700807571, 700801697, 700823593, 700866852, 700916061, 700955505, 700977020, 700981979, 700976410, 700964508, 700943756, 700905075, 700838089, 700738678, 700613327, 700476227, 700343628, 700226364, 700127335]
3003G00127335q3390o9122n1193k4719P705L4714M2038J9913k9526r1477j45263j74561
3015F99562454j75705j58615j38702j28784j30616j35879j34201j21155j02539r1019
3025F98245239r6283j18179j43738j55868j44577j12534p6675n6458o2713q9112j17187
3036F97071915j26038j08490p4387m6691m6997q1788j37634j88522k10114j94320j52741
3047F95704193j10092q8577r6741j25885j57013j72729j68458j50604j32904j26114
3057F94375076j30920j39389j42441j35345j22071j12610j15661j33438j59912j84555
3067F92998734j96991j91956j70593j37635r9258o1417k8991p477k136j7090n1956
3078F92033234j00327j51596j93176k16599k21023k11792j99127j91803j93711k02179
$$ y = [700127335, 700043945, 699974823, 699923630, 699898911, 699906616, 699941330, 699983368, 700003281, 699973755, 699882278, 699737015, 699562454, 699386749, 699228134, 699089432, 698960648, 698830032, 698694153, 698559952, 698438797, 698336258, 698245239, 698148956, 698030777, 697887039, 697731171, 697586594, 697474060, 697397385, 697340927, 697278214, 697189102, 697071915, 696945877, 696837387, 696763000, 696716309, 696669312, 696587524, 696449890, 696261368, 696051254, 695856934, 695704193, 695594101, 695505524, 695408783, 695282898, 695125885, 694953156, 694784698, 694634094, 694501190, 694375076, 694244156, 694104767, 693962326, 693826981, 693704910, 693592300, 693476639, 693343201, 693183289, 692998734, 692801743, 692609787, 692439194, 692301559, 692202301, 692140884, 692111893, 692104416, 692102280, 692085190, 692033234, 691932907, 691781311, 691588135, 691371536, 691150513, 690938721, 690739594, 690547791, 690354080, 690151901]
3088F90151901k11715k15760k12249k03553j94092j89132j89362j92871j95770j95694
3098F88151703j91193j84555j76468j67465j56479j43509j30539j22985j25504j40228
3108F86612778j61820j80206j83792j68381j39007j10550j01319j22986j74636k42844
3118F85027237l06168l45382l52631l31573k94648k56958k28347k12021k06299k06223
3128F82286987k10342k16370k22549k26288k22473k09198j89057j69754j61666j72883
3138F80286407k03170k44522k82593l04108l02200k79236k44675k10800j87225j78223
3148F77849655j83563k00272k24380k52991k83279l11127l33252l45917l47671l40500
3158F75026703l28674l16849l08914l05939l07083l08991l09219l05405k98462k90603
$$ y = [690151901, 689940186, 689724426, 689512177, 689308624, 689114532, 688925400, 688736038, 688543167, 688347397, 688151703, 687960510, 687775955, 687599487, 687432022, 687275543, 687132034, 687001495, 686878510, 686753006, 686612778, 686450958, 686270752, 686086960, 685918579, 685779572, 685669022, 685567703, 685444717, 685270081, 685027237, 684721069, 684375687, 684023056, 683691483, 683396835, 683139877, 682911530, 682699509, 682493210, 682286987, 682076645, 681860275, 681637726, 681411438, 681188965, 680979767, 680790710, 680620956, 680459290, 680286407, 680083237, 679838715, 679556122, 679252014, 678949814, 678670578, 678425903, 678215103, 678027878, 677849655, 677666092, 677465820, 677241440, 676988449, 676705170, 676394043, 676060791, 675714874, 675367203, 675026703, 674698029, 674381180, 674072266, 673766327, 673459244, 673150253, 672841034, 672535629, 672237167, 671946564]
3168F71946564k85645k87475k96784l13797l33710l51409l62320l64914l60947l53851
3178F68635712l48816l47290l50037l55682l62473l68347l72467l71857l64608l50342
3188F65043793l33329l21044l23563l47061l89633m39988m81720n00183m90112m58298
3198F60958862m20456l91922l81927l88336m01917m12674m15039m10995m06723Tm11454
3209F56510696m16183m17404m15039m14429m22516m41742m66537m85001m83322m56696
3219F52091827m12292l68271l44467l51792l86962m32053m65546m72717m53339m21447
3229F47982941l96576l94135m15344m51126m84543n03998n06820m99573m92478m91485
3239F43346863m95911m98276m91256m73175m48761m26636m15268m15535m23126m30298
$$ y = [671946564, 671660919, 671373444, 671076660, 670762863, 670429153, 670077744, 669715424, 669350510, 668989563, 668635712, 668286896, 667939606, 667589569, 667233887, 666871414, 666503067, 666130600, 665758743, 665394135, 665043793, 664710464, 664389420, 664065857, 663718796, 663329163, 662889175, 662407455, 661907272, 661417160, 660958862, 660538406, 660146484, 659764557, 659376221, 658974304, 658561630, 658146591, 657735596, 657328873, 656922150, 656510696, 656094513, 655677109, 655262070, 654847641, 654425125, 653983383, 653516846, 653031845, 652548523, 652091827, 651679535, 651311264, 650966797, 650615005, 650228043, 649795990, 649330444, 648857727, 648404388, 647982941, 647586365, 647192230, 646776886, 646325760, 645841217, 645337219, 644830399, 644330826, 643838348, 643346863, 642850952, 642352676, 641861420, 641388245, 640939484, 640512848, 640097580, 639682045, 639258919, 638828621]
3249F38828621m30718m22935m10118l97377l88718l84407l82538l80974l79295l78532
3259F34873009l80822l84750l86619l80516l61290l29590k91901k60200k47765k62642
3269F31586914l05595l66669m30450m80156n04532n00908m75083m38232m02260l76015
3279F27307014l63426l64418l75328l92265m10347m25377m34532m36287m32205m26827
3289F23246002m26101m35792m58679m92592n31425n65834n86433n86701n64384n23949
3299F18074112m76036m34342m14428m26712m74701n51567o42701p29293p94716q28629
3309F12300987q30879q09174p76519p46804p29522p28226p40280p58667p76024p86858
3319F04618034p90138p89070p89032p95631q11615q36068q64982q93135r15489r29223
$$ y = [638828621, 638397903, 637974968, 637564850, 637167473, 636778755, 636394348, 636011810, 635630836, 635251541, 634873009, 634492187, 634107437, 633720818, 633340302, 632979012, 632649422, 632357521, 632097321, 631849556, 631586914, 631281319, 630914650, 630484200, 630004044, 629499512, 628998604, 628523521, 628085289, 627683029, 627307014, 626943588, 626579170, 626203842, 625811577, 625401230, 624975853, 624541321, 624105034, 623672829, 623246002, 622819901, 622384109, 621925430, 621432838, 620901413, 620335579, 619749146, 619162445, 618598061, 618074112, 617598076, 617163734, 616749306, 616322594, 615847893, 615296326, 614653625, 613924332, 613129616, 612300987, 611470108, 610660934, 609884415, 609137611, 608408089, 607679863, 606939583, 606180916, 605404892, 604618034, 603827896, 603038826, 602249794, 601454163, 600642548, 599806480, 598941498, 598048363, 597132874, 596203651]
3329E96203651r33113r28154r17701r05419q96835q96187r06944r29451r61304r98192
3339E86930351j035003j066208j087876j096077j089668j070518j044617j023254j018296
3348E77398834j039696j088600j155853j224022j273460j290970j274414j234245j187287
3357E66630287j150741j133385j134071j144181j152839j153374j147118j140823j143570
3366E56330185j160851j191902j227951j257591j270218j260719j230660j187629j142121
3375E45400543j103172j076737j064605j064682j072083j078682j075172j051941j002731
3384E35810738r29413q42667p61757p07931o95191p24334p79343q33016q58345q38851
3394E27839890p77855o97976o30302o03485o28319o95495p77131q39691q58154q24776
$$ y = [596203651, 595270538, 594342384, 593424683, 592519264, 591622429, 590726242, 589819298, 588889847, 587928543, 586930351, 585895348, 584829140, 583741264, 582645187, 581555519, 580485001, 579440384, 578417130, 577398834, 576359138, 575270538, 574114685, 572890663, 571617203, 570326233, 569051819, 567817574, 566630287, 565479546, 564346161, 563212090, 562067909, 560915070, 559761696, 558614578, 557473755, 556330185, 555169334, 553977432, 552749481, 551491890, 550221672, 548960953, 547730293, 546542664, 545400543, 544297371, 543220634, 542156029, 541091347, 540019264, 538940582, 537865410, 536813469, 535810738, 534881325, 534038658, 533276901, 532568970, 531873779, 531149445, 530370102, 529537086, 528678741, 527839890, 527062035, 526364059, 525733757, 525130272, 524501953, 523806458, 523029327, 522189636, 521331482, 520506706]
3404E20506706p52601o67916n97572n59425n55420n73426n96466o10313o09512n98031
3414E14386024n83801n73120n66444n58358n40771n07317m57153l95050l31345k77328
3424E09595337k41318k24876k21825k19955k05498j71089j18943o3095k3193j4305
3434E08091240l9520q5755j30462j52092j41373j05400o3095l2883k1553k0561j1597
3445E07286949K1973Q3961J63346K39143K92168L14750L12806L01170K94075K97813
3455E09608154L09639L21694L27377L27492L28293L39279L65715M06265M50134M82827
3465E13266869M90074M64630M10843L43971K86179K58560K71225L18451L79600M27895
3475E16918297M42657M18129L67470L14064K81067K79541L05214L43895L79982M05235
$$ y = [520506706, 519754105, 519086189, 518488617, 517929192, 517373772, 516800346, 516203880, 515593567, 514984055, 514386024, 513802223, 513229103, 512662659, 512104301, 511563530, 511056213, 510599060, 510204010, 509872665, 509595337, 509354019, 509129143, 508907318, 508687363, 508481865, 508310776, 508191833, 508128738, 508105545, 508091240, 508051720, 507965965, 507835503, 507683411, 507542038, 507436638, 507373543, 507340660, 507319107, 507298546, 507286949, 507308922, 507392883, 507556229, 507795372, 508087540, 508402290, 508715096, 509016266, 509310341, 509608154, 509917793, 510239487, 510566864, 510894356, 511222649, 511561928, 511927643, 512333908, 512784042, 513266869, 513756943, 514221573, 514632416, 514976387, 515262566, 515521126, 515792351, 516110802, 516490402, 516918297, 517360954, 517779083, 518146553, 518460617, 518741684, 519021225, 519326439, 519670334, 520050316, 520455551]
3485E20455551M20189M29764M38499M46587M52919M57611M64897M80156N03502N25970
3495E25075645N31579N06973M50020L74603L05023K63290K56463K74925K99225L13644
3505E28651390L17650L24173L49502L99933M64287N20096N47104N40466N14565M93049
3515E33122215M93088N13611N34325N27687M75578L79295K61193J53617Q6136P6104
3525E36622849J24664K19574L37829M50364N28373N50385N14602M43154L76243L54653
3535E40522690L95660M78630N50576N51338M49028K61345N1155j04370j54343r9869
3545E42901840J0491J11503J60713J57280J34888J32217J64986K19193K67944K96974
3555E44558029L14942L40232L69149L57933K31628o9313n37681j073685j511688j689911
$$ y = [520455551, 520875740, 521305504, 521744003, 522190590, 522643509, 523101120, 523566017, 524046173, 524549675, 525075645, 525607224, 526114197, 526564217, 526938820, 527243843, 527507133, 527763596, 528038521, 528337746, 528651390, 528969040, 529293213, 529642715, 530042648, 530506935, 531027031, 531574135, 532114601, 532629166, 533122215, 533615303, 534128914, 534663239, 535190926, 535666504, 536045799, 536306992, 536460609, 536546745, 536622849, 536747513, 536967087, 537304916, 537755280, 538283653, 538834038, 539348640, 539791794, 540168037, 540522690, 540918350, 541396980, 541947556, 542498894, 542947922, 543209267, 543260422, 543156052, 543001709, 542901840, 542912331, 543023834, 543184547, 543341827, 543476715, 543608932, 543773918, 543993111, 544261055, 544558029, 544872971, 545213203, 545582352, 545940285, 546171913, 546102600, 545564919, 544491234, 542979546, 541289635]
3565E41289635j529732j079063m94233K6513L28216L54385J54686j52435m35562n94864
3575E37867546n88379m36783k16407m2115l6735k86293p94754j461296k104264k530517
3585E29370003k621880k395668k000847j648140j509628j638985j956863k298660k498474
3594E10800858k460022k182198j739540j239929p89490m76418l69834n17312r34639
3603E00091476j590423k405090l270684m089813m819336n492058o207313p083130q189583
3612D56944046r475784j0728455j1581192j1595001j0402031p868347m208069J7242
3620C91102409M043236P148476Q905334R317398Q781014P884064P144317O814003O834068
3629D57974319O939774O840172O370506N546608M523125L502426K653160K068329J755142
$$ y = [541289635, 539759903, 538680840, 538186607, 538213120, 538541336, 538895721, 539050407, 538897972, 538462410, 537867546, 537279167, 536842384, 536625977, 536583862, 536547127, 536260834, 535466080, 534004784, 531900520, 529370003, 526748123, 524352455, 522351608, 520703468, 519193840, 517554855, 515597992, 513299332, 510800858, 508340836, 506158638, 504419098, 503179169, 502389679, 501913261, 501543427, 501026115, 500091476, 498501053, 496095963, 492825279, 488735466, 483916130, 478424072, 472216759, 465133629, 456944046, 447468262, 436739807, 425158615, 413563614, 403161583, 395293236, 391085167, 391102409, 395145645, 402294121, 411199455, 420516853, 429297867, 437181931, 444326248, 451140251, 457974319, 464914093, 471754265, 478124771, 483671379, 488194504, 491696930, 494350090, 496418419, 498173561]
3638D98173561J637802J563187J328773P47567k59133j582489k922592l885460m150390
3647D90650826l624802k499504j166382m1237O15463P87316O62841N06936N20095P58744
3657D87170296J141662J513176J719437J659431J305428P04536l1242p46498j284599
3666D93151627j547547j539917j374130j215019j189614j315994j491623j557579j400642
3675D80519562j031075n91888k98729l48663q52166j817054l171082m794502o531677
3684D61082726q187714r534226j0350723j0494423r963684q909149p580338o220130
3692C89842339m973412l847160k740059j514282o5041J645355L586044N668641P751922
3701C95354347R644280J1121063J1981316J2128067J1635780J0756760R844818R221840
$$ y = [498173561, 499811363, 501374550, 502703323, 503450890, 503191757, 501609268, 498686676, 494801216, 490650826, 487026024, 484526520, 483360138, 483318901, 483934364, 484721680, 485384521, 485891457, 486411552, 487170296, 488311958, 489825134, 491544571, 493204002, 494509430, 495213966, 495182724, 494436226, 493151627, 491604080, 490064163, 488690033, 487475014, 486285400, 484969406, 483477783, 481920204, 480519562, 479488487, 478896599, 478597870, 478249207, 477397041, 475579987, 472408905, 467614403, 461082726, 452895012, 443360786, 433010063, 422515640, 412551956, 403642807, 396062469, 389842339, 384868927, 381021767, 378281708, 376767426, 376702385, 378347740, 381933784, 387602425, 395354347, 404998627, 416119690, 428101006, 440229073, 451864853, 462621613, 472466431, 481688271]
3709D81688271R048080R263992R631234R847106R679337R051056Q048592O862793N703010
3718E58823471M727516M016228L581390L397065L421821L602142L857079M061394M052696
3727E93540802L675194K860336J705399N01251l32909m14428M09736J931343L608170
3736F07484894M772301M928016M000130K380867P40318l14827n42488j61056L18603
3745F23606758M22592N951o64978j091156q60710Q4496J399955K530785L020935K755318
3755F31209946J993866J194763P47795P77893J118431J448441J490402J150284N37719
3764F41669540j16806n82809p16248m90760J6365O56585J242829J594696J591797J228408
3774F46093597O32019K3194l78571m57763k52610P8049L53012M71115M56619M16718
$$ y = [481688271, 490736351, 500000343, 509631577, 519478683, 529158020, 538209076, 546257668, 553120461, 558823471, 563550987, 567567215, 571148605, 574545670, 577967491, 581569633, 585426712, 589488106, 593540802, 597215996, 600076332, 601781731, 602282982, 601950073, 601535645, 601945381, 603876724, 607484894, 612257195, 617185211, 621185341, 623566208, 624306526, 623991699, 623449211, 623288155, 623606758, 624029350, 624035301, 623370323, 622279167, 621418457, 621502953, 622902908, 625433693, 628454628, 631209946, 633203812, 634398575, 635146370, 635924263, 637042694, 638491135, 639981537, 641131821, 641669540, 641552734, 640969925, 640253677, 639762917, 639779282, 640435867, 641678696, 643273392, 644865189, 646093597, 646725616, 646748810, 646370239, 645912476, 645659866, 645737915, 646090927, 646562042, 647018661, 647435379]
3784F47435379M57687O07071Q07419R67789J035538J026077R91592R55506Q70056O40259
3794F55794373J97830m20304j059265j516494j650773j466674j102143p32574m51203
3803F47592773k09121J37329O99844J441117K148132K525711K359466J643906N98068
3812F58937225m46624j212998j598434j680603j614685j500245j313171r45816l21426
3821F48303223N02624J323624J888962K040100J805114J378861R93729P73391O55594
3830F59665222M48303k4948p80945j630020k267151k434845k066116j309051m22058
3839F49178391L88183J075897J738587K478637L235321L715516L491058K232513l7918
3848F67496185k831878n307999o589737o146698m054489r95178K013702M037552M594803
$$ y = [647435379, 647893066, 648500137, 649307556, 650275345, 651310883, 652336960, 653328552, 654284058, 655154114, 655794373, 655992203, 655571899, 654512634, 652996140, 651345367, 649878693, 648776550, 648043976, 647592773, 647383652, 647520981, 648220825, 649661942, 651810074, 654335785, 656695251, 658339157, 658937225, 658490601, 657277603, 655679169, 653998566, 652383881, 650883636, 649570465, 648624649, 648303223, 648805847, 650129471, 652018433, 654058533, 655863647, 657242508, 658236237, 659009628, 659665222, 660113525, 660088577, 659307632, 657677612, 655410461, 652975616, 650909500, 649600449, 649178391, 649566574, 650642471, 652381058, 654859695, 658095016, 661810532, 665301590, 667534103, 667496185, 664664307, 659356308, 652766571, 646619873, 642565384, 641570206, 643583908, 647621460, 652216263]
3857F52216263L807983K274704P43180k40326n34211l76052j71814k34070o15387j112213
3867F55758057j416016j301575p52487M7836Q22297J336288J488647J314545R29260
3876F58226852M59595K442l77961o35757p36847o73218m81567k45285o5232p782o4773
3887F55400467j45798j21918J06507N42526J069641J484680J577683J222076M41437
3896F61577301n88150j592102k297211k525177k247696j578750p15180J42899Q51745
3905F51027679J342392J602478J643601J482086J140595O65054J35040l47824o88934
3914F58002167q33359p83005n88836l27912p5149J18332K32315K73742K66037K32010
3924F56516342J81503J03913k0447j94931l84064n10101m86603k72217Q5678M53187
$$ y = [652216263, 656024246, 658298950, 659042130, 658801804, 658267593, 657891541, 657719727, 657485657, 656870270, 655758057, 654342041, 653040466, 652287979, 652335815, 653158112, 654494400, 655983047, 657297592, 658226852, 658686447, 658688889, 658310928, 657675171, 656938324, 656265106, 655783539, 655538254, 655473022, 655465240, 655400467, 655254669, 655132751, 655239258, 655781784, 656851425, 658336105, 659913788, 661135864, 661577301, 660989151, 659397049, 657099838, 654574661, 652326965, 650748215, 650033035, 650175934, 651027679, 652370071, 653972549, 655616150, 657098236, 658238831, 658903885, 659038925, 658691101, 658002167, 657168808, 656385803, 655796967, 655469055, 655393906, 655512238, 655744553, 656018295, 656284332, 656516342, 656697845, 656801758, 656781311, 656586380, 656202316, 655692215, 655205612, 654933395, 655019073, 655472260]
3934F55472260O70623O36902L72620J0299k81295l95584l40043k17208j41068j60065
3944F55627441k33993k78015k36588j23596m501O1874O8207N5160O2561Q5373P5226
3955F55159149j1139j58310k89154l19290k28500q8272r232n2795j76010k64817k33230
3966F53328400j06430j0529o6681k75040m91561n34668l43171n1345R7656n1346m14505
3977F51080780p13196o95495l71399n1194j12609o61621j371003j682663j279068m54635
3987F43687897k8916p46154k554551m367828m698181k935410m71687p42149p793770
3996F19349251k3922463m7668342p3485375r3576889
4000C80696182
$$ y = [655472260, 656142883, 656779785, 657152405, 657162704, 656881409, 656485825, 656145782, 655928574, 655787506, 655627441, 655393448, 655115433, 654878845, 654755249, 654750748, 654812622, 654880829, 654935989, 654998550, 655083923, 655159149, 655148010, 654989700, 654700546, 654381256, 654152756, 654064484, 654055252, 654002457, 653826447, 653561630, 653328400, 653221970, 653211441, 653144760, 652869720, 652378159, 651843491, 651500320, 651448975, 651546631, 651495285, 651080780, 650367584, 649672089, 649300690, 649249496, 649136887, 648475266, 647104263, 645421600, 644142532, 643687897, 643658981, 642912827, 640358276, 635990448, 631292267, 628356857, 627885170, 627143021, 619349251, 595426788, 547758446, 474273071, 380696182]
##END=$$ End of the data block
