##TITLE=$$ Begin of the data block
##JCAMP-DX=5.00 $$ ACD/SpecManager v 10.08
##SPECTROMETER/DATA SYSTEM=16PC
##DATE=28 May 2013 09:19:44
##DATA TYPE=INFRARED SPECTRUM
##DATA CLASS=XYDATA
##ORIGIN=
##OWNER=
##NPOINTS=3601
##FIRSTX=400.00000000
##LASTX=4000.00000000
##MAXX=4000.00000000
##MINX=400.00000000
##MAXY=68.33285522
##MINY=5.84368038
##XFACTOR=1.0000000000
##YFACTOR=0.000000100000000
##FIRSTY=36.46240234
##DELTAX=1.00000000
##XUNITS=1/CM
##YUNITS=TRANSMITTANCE
##XYDATA=(X++(Y..Y))
400C64624023R4050675P2065163M4467849K0322037N396957K68593J398049M077568
408F06670914N205421M327355K773132J951828K176285K688064K553482J526566K00882
417F30073929n54886l15361O18706J527748J845741J522484R41467N43213M99535O69555
427F37372131Q00515P54242N69419L60070J86729L0136j33781k61536k65388j14098
437F39298439R5596J83602K5062l35197o95343q40683p00913m01649j66321j54304
447F36308289l59993o43044q50220r25483r27048r53026j052017j190224j292381j309242
457F26805611j256562j197929j198196j287880j460953j692925j956863k223930k459565
466F12070808k631073k726478k770691k818756k927056l121185l384132l671112l940468
$$ y = [364624023, 458674698, 530739861, 575207710, 595529747, 600926704, 601195297, 602593346, 606670914, 611876335, 616203690, 618976822, 620928650, 623104935, 625792999, 628346481, 629873047, 630073929, 629519043, 629203682, 629822388, 631350136, 633195877, 634718361, 635659828, 636203041, 636702576, 637372131, 638172646, 638926888, 639496307, 639856377, 640043106, 640073242, 639939461, 639677925, 639412537, 639298439, 639394035, 639577637, 639602699, 639267502, 638572159, 637731476, 637030563, 636628914, 636462593, 636308289, 635948296, 635305252, 634455032, 633529549, 632602501, 631649475, 630597458, 629407234, 628114853, 626805611, 625549049, 624351120, 623152924, 621865044, 620404091, 618711166, 616754303, 614530373, 612070808, 609439735, 606713257, 603942566, 601123810, 598196754, 595075569, 591691437, 588020325, 584079857]
475E84079857m179421m410781m683342n053482n566292o237564p042923p922097q805046
484E30178909r652900j0486603j1378823j2402229j3564262j4774361j5875320j6723709
492D25320702j7267456j7564087j7722588j7800980j7732429j7324848j6339073j4598389
500B88970852j2070961q887501n301208j617165J870632M922867P378426R163150J0287266
509B94716358J0827637J0902157J0637703J0149879R533844Q863030Q193512P563629
517C71387749P000313O528434O183510O014328O069718O370239O885681P531166Q193398
526D32164536Q769760R199981R471932R604492R620132R529152R329949R023056Q621368
535E15334358Q154183P659454P173233O720505O311111N938568N584526N227700M854469
$$ y = [584079857, 579900436, 575489655, 570806313, 565752831, 560186539, 553948975, 546906052, 538983955, 530178909, 520526009, 510039406, 498660583, 486258354, 472694092, 457919731, 442044411, 425320702, 408053246, 390489159, 372766571, 354965591, 337233162, 319908314, 303569241, 288970852, 276899891, 268012390, 262711182, 261094017, 262964649, 267887516, 275265942, 284429092, 294716358, 305543995, 316446152, 327083855, 337233734, 346767578, 355630608, 363824120, 371387749, 378388062, 384916496, 391100006, 397114334, 403184052, 409554291, 416439972, 423971138, 432164536, 440934296, 450134277, 459606209, 469210701, 478830833, 488359985, 497689934, 506712990, 515334358, 523488541, 531147995, 538321228, 545041733, 551352844, 557291412, 562875938, 568103638, 572958107]
544E72958107M468956M092178L752213L467827L236885L038559K844810K638397K419701
553F02917633K206612K024078J893654J827354J821099J852989J884842J870308J774292
562F20072861J591530J356048J128884R68627Q99430Q96797Q99506Q43734O96450M72259
572F29826126K23808J4458j13983j58081j53542j58729k28653l91808o37169r21669
582F27300758j191978j415901j600724j790351k038804k374191k780647l207283l602371
591F07298508l949471m280090m658089n144920n768929o519394p358970q243981r124565
600E52250099r928894j0534363j0757637j0374984r177971p048455m023437l25241
608D90079117L659897P454986J0601235J2766685J3820687J3850097J3106384J1913987
$$ y = [572958107, 577427063, 581519241, 585271454, 588739281, 591976166, 595014725, 597859535, 600497932, 602917633, 605124245, 607148323, 609041977, 610869331, 612690430, 614543419, 616428261, 618298569, 620072861, 621664391, 623020439, 624149323, 625117950, 626017380, 626914177, 627813683, 628657417, 629353867, 629826126, 630049934, 630064392, 629950409, 629792328, 629638786, 629480057, 629251404, 628859596, 628222427, 627300758, 626108780, 624692879, 623092155, 621301804, 619263000, 616888809, 614108162, 610900879, 607298508, 603349037, 599068947, 594410858, 589265938, 583497009, 576977615, 569618645, 561374664, 552250099, 542321205, 531786842, 521029205, 510654221, 501476250, 494427795, 490404358, 490079117, 493739014, 501194000, 511795235, 524561920, 538382607, 552232704, 565339088, 577253075]
616E77253075J0570526R280548Q137054P145348O267891N464935M716988M031410L431435
625F36299210K942772K574958K309037K096557J875839J599198J260834R00497N85709
634F52444611L73382K78549K66266K73133K40402J40686j6861j99127l68042m93317
644F52939682n58395n65873n41992n35660o00433p64923j006851j254578j427841j494141
654F44188995j497955j536179j684455j923104k129860k154655j943283j616822j441040
663F28261642j678504k412873l454246m409218m882240m695855l996544l179435k678337
672E96874390k747460l361320m272652n180206n889588o380462o761704p168045p677536
681E47435417q292579q975525r695549j0445023j1223755j2011490j2758407j3401795
$$ y = [577253075, 587823601, 597104149, 605241203, 612386551, 618654442, 624119377, 628836365, 632867775, 636299210, 639241982, 641816940, 644125977, 646222534, 648098373, 649697571, 650958405, 651858902, 652444611, 652817993, 653096542, 653362808, 653635941, 653876343, 654017029, 654000168, 653801041, 653432999, 652939682, 652381287, 651815414, 651273422, 650737762, 650137329, 649372406, 648365555, 647110977, 645683136, 644188995, 642691040, 641154861, 639470406, 637547302, 635417442, 633262787, 631319504, 629702682, 628261642, 626583138, 624170265, 620716019, 616306801, 611424561, 606728706, 602732162, 599552727, 596874390, 594126930, 590765610, 586492958, 581312752, 575423164, 569042702, 562280998, 555112953, 547435417, 539142838, 530167313, 520471764, 510026741, 498802986, 486791496, 474033089, 460631294]
689D60631294j3886146j4170075j4205017j3903580j3125152j1694374r450226o312714
697C63884010k331466K290649P212677J2005386J6224480J9496803K1593018K2466087
705D62841644K2241936K1166115J9529381J7605362J5613288J3713417J2011757J0564843
713E95287743R377250Q403244P565728O789283O033898N310745M665565M144974L762512
722F51340942L485489L254090L009033K720489K395783K069168J780395J557618J407241
731F73020248J313782J247559J173630J066589R19952P49131N85403M61044L91693
740F80929031L67890L62320L43094K94036K21177J48162J01319R2773J13449J36872
750F83110123J33209Q5220k060j01776j76163j96609j56937q0108r156J4801k8991
$$ y = [460631294, 446745148, 432575073, 418370056, 404466476, 391341324, 379646950, 370196724, 363884010, 361552544, 363843193, 371055870, 383061256, 399285736, 418782539, 440375557, 462841644, 485083580, 506249695, 525779076, 543384438, 558997726, 572711143, 584722900, 595287743, 604664993, 613068237, 620633965, 627423248, 633457146, 638767891, 643433456, 647578430, 651340942, 654826431, 658080521, 661089554, 663810043, 666205826, 668274994, 670055389, 671613007, 673020248, 674334030, 675581589, 676755219, 677821808, 678741760, 679490891, 680076294, 680537338, 680929031, 681296921, 681659241, 682002335, 682296371, 682517548, 682665710, 682767029, 682859802, 682973251, 683110123, 683243332, 683328552, 683326492, 683224716, 683048553, 682851944, 682695007, 682614899, 682605743, 682620544, 682591553]
761F82591553j27106k41013l25470l53469l27988k80228k51083k69318l36609m28466
771F79650803n07508n41534n19257m53186l72009l06854k76337k81525l07998l36457
781F75748138l54995l62549l68042l78494l92228l98178l81851l39508k83127k36969
791F72252197k23465k49786l01819l51791l76358l69797l49197l44620l80936m65469
801F68838959n84641p09533q09403q61206q54263p93762o98243n98755n30166n18036
811F61880951n64270o40335o97937o94046o15998m94995l89938l56750m12064n23987
821F56490631o30264o76651o49719n82886n33905n46723o26983p41654q44650r07211
831F49749985r31320r42383r66492j010513j058884j086883j078873j039810r91440
$$ y = [682591553, 682464447, 682223434, 681897964, 681544495, 681216507, 680936279, 680685196, 680415878, 680079269, 679650803, 679143295, 678601761, 678082504, 677629318, 677257309, 676950455, 676674118, 676392593, 676084595, 675748138, 675393143, 675030594, 674662552, 674284058, 673891830, 673493652, 673111801, 672772293, 672489166, 672252197, 672028732, 671778946, 671477127, 671125336, 670748978, 670379181, 670029984, 669685364, 669304428, 668838959, 668254318, 667544785, 666735382, 665874176, 665019913, 664226151, 663527908, 662929153, 662398987, 661880951, 661316681, 660676346, 659978409, 659284363, 658668365, 658173370, 657783432, 657426682, 657014618, 656490631, 655860367, 655183716, 654533997, 653951111, 653417206, 652870483, 652243500, 651501846, 650657196, 649749985, 648818665, 647876282, 646909790, 645899277, 644840393, 643753510, 642674637, 641634827, 640643387]
840F40643387r60617r64546j005478j072083j145973j210098j253167j274337j283226
849F30473862j296807j334114j405868j507454j618805j712761j768990j788597j794433
858F16246033j824112j909485k058907k252693k451706k621040k751160k865562l008423
867E94502945l220749l518181l884086m285355m693947n106048n541802o031876o604232
876E51616669p274208q050347q936195r930115j1029472j2246132j3638382j5328789
884D65183029j7464447k0090141k2967224k5435868k6453247k4873771j9915314j1618443
892B96364574j054267R870739J8983497K4554444K5835037K3196907J7836075J1227684
900D26814690M604377j316871o299553j0350113j3455124j5444374j6016808j4879951
$$ y = [640643387, 639682770, 638718224, 637712746, 636640663, 635494690, 634284592, 633031425, 631757088, 630473862, 629177055, 627842941, 626437073, 624929619, 623310814, 621598053, 619829063, 618040466, 616246033, 614421921, 612512436, 610453529, 608200836, 605749130, 603128090, 600376930, 597511368, 594502945, 591282196, 587764015, 583879929, 579594574, 574900627, 569794579, 564252777, 558220901, 551616669, 544342461, 536292114, 527355919, 517425804, 506396332, 494150200, 480511818, 465183029, 447718582, 427628441, 404661217, 379225349, 352772102, 327898331, 307983017, 296364574, 295310307, 305181046, 324164543, 348718987, 374554024, 397750931, 415587006, 426814690, 431419067, 430102196, 423802643, 413452530, 399997406, 384553032, 368536224, 353656273]
908C53656273j1901932p211418j211586N474091J2104454J7949180K2421341K5186310
916D16466713K6209526K5725822K4138642K1890640J9357529J6801033J4380073J2188111
924E77158089J0286598Q709717P453308O464538N654335M928704M225349L535156K895165
933F31310959K362099J975441J733703J589089J467323J300812J057357P56455M57153
942F44010391K29340J16272J11236J61133J90735J43127N188j86157l66745m75692
952F43938828m88739m24958l38287k89154l17459m23889n70984p00074p59353p26776
962F38899155o22635n00527m23202m33426n32837o82335q18901q87566q66851p78237
972F32352638o73408o09856o20651p00035q08182q90808r08394q54340p59162o73295
$$ y = [353656273, 341754341, 334542923, 333331337, 338805428, 350909882, 368859062, 391280403, 416466713, 442676239, 468402061, 492540703, 514431343, 533788872, 550589905, 564969978, 577158089, 587444687, 596154404, 603607712, 610072250, 615726585, 620655289, 624880638, 628415794, 631310959, 633673058, 635648499, 637382202, 638971291, 640438614, 641739426, 642796783, 643553238, 644010391, 644239731, 644356003, 644467239, 644628372, 644819107, 644962234, 644967422, 644781265, 644414520, 643938828, 643450089, 643025131, 642686844, 642397690, 642080231, 641656342, 641085358, 640385284, 639625931, 638899155, 638276520, 637775993, 637352791, 636919365, 636386528, 635704193, 634885292, 633997726, 633130875, 632352638, 631679230, 631069374, 630448723, 629748688, 628940506, 628049698, 627141304, 626286964, 625527802, 624854507]
982F24854507o43234o85386p81899q86383r51004r49059q88290q05550p47108p45812
992F16770782q05587r01718r93844j046333j044922j001930r50127r27696r60235j050377
1002F07088013j176300j302491j395797j442452j455536j469955j526184j650391j841202
1011E93827705k068634k288131k461777k578392k660141k757912k930641l224106l653717
1020E69204254m201698m832039n511818o235237p022781p895089q820877r663772j0162545
1029E04858398r973220q773537o400719k961006J143837N300293Q854294J1301155
1037E03349495J2419815J2302361J1271820R743385Q085442O539192N208625M101906
1045E73022041L188362K438164J837654J380196J055489Q40606P00760N96619M91714
$$ y = [624854507, 624211273, 623525887, 622743988, 621857605, 620906601, 619957542, 619069252, 618263702, 617516594, 616770782, 615965195, 615063477, 614069633, 613023300, 611978378, 610976448, 610026321, 609098625, 608138390, 607088013, 605911713, 604609222, 603213425, 601770973, 600315437, 598845482, 597319298, 595668907, 593827705, 591759071, 589470940, 587009163, 584430771, 581770630, 579012718, 576082077, 572857971, 569204254, 565002556, 560170517, 554658699, 548423462, 541400681, 533505592, 524684715, 515020943, 504858398, 494885178, 486111641, 479710922, 476749916, 477893753, 483194046, 492048340, 503349495, 515769310, 528071671, 539343491, 549086876, 557172318, 563711510, 568920135, 573022041, 576210403, 578648567, 580486221, 581866417, 582921906, 583762512, 584463272, 585059891, 585551605]
1054E85551605L62854K03743K9335j33781k57530l28408l56178l70293m05883m84734
1064E83810730o03638p36198q45947r06563r15642q96759q89359r29298j033478j190872
1074E74862976j367989j523666j628647j679115j699982j731147j809884j951408k141609
1083E59329529k345696k526245k662163k759399k845802k956314l114357l322373l561897
1092E33235283l805122m030343m233017m428329m643860m908066n237503n629310o061554
1101D90258179o500130o906166p243385p476197p563629p451706p068290o331254n167350
1110D28550072l543320j495171Q50220L279877N523338P306214Q410034Q722038Q255157
1119D65858459P133255N549393L713684J815605Q088j585732k853737l687019l986244
$$ y = [585551605, 585914459, 586118202, 586147537, 586013756, 585756226, 585427818, 585071640, 584701347, 584295464, 583810730, 583207092, 582470894, 581624947, 580718384, 579802742, 578905983, 578016624, 577087326, 576053848, 574862976, 573494987, 571971321, 570342674, 568663559, 566963577, 565232430, 563422546, 561471138, 559329529, 556983833, 554457588, 551795425, 549036026, 546190224, 543233910, 540119553, 536797180, 533235283, 529430161, 525399818, 521166801, 516738472, 512094612, 507186546, 501949043, 496319733, 490258179, 483758049, 476851883, 469608498, 462132301, 454568672, 447116966, 440048676, 433717422, 428550072, 425006752, 423511581, 424361801, 427641678, 433165016, 440471230, 448881264, 457603302, 465858459, 472991714, 478541107, 482254791, 484070396, 484078484, 482492752, 479639015, 475951996, 471965752]
1128D71965752l686028k783089j352462M55703K439804M383431O090889P415047Q271331
1137D93200378Q640061Q558960Q108406P392883O521988N590897M673271L816299L047219
1146E49550362K380066J821212J370392J017914P45010N24903L31611J48774k7428
1155E57862816j86463l15437m06036m61693m96826n29518n72281o26030o80580p19986
1165E52867966p31926p13692o75278o34689o11458o18477o56013p13654p72285q14476
1175E45926018q30918q24852q10279q04749q21686q63495r20677r76295j014633j027832
1185E37030602j020279j005478r99260j012955j046410j088295j119575j123200j090812
1194E27524338j026840r47609q72651q18176p87849p73926p60880p34634o89545o32133
$$ y = [471965752, 468279724, 465496635, 464144173, 464599876, 467039680, 471423111, 477514000, 484929047, 493200378, 501840439, 510399399, 518507805, 525900688, 532422676, 538013573, 542686844, 546503143, 549550362, 551930428, 553751640, 555122032, 556139946, 556884956, 557409859, 557741470, 557890244, 557862816, 557676353, 557360916, 556954880, 556493187, 555996361, 555466843, 554894562, 554268532, 553587952, 552867966, 552136040, 551422348, 550747070, 550112381, 549500923, 548882446, 548226433, 547512779, 546740494, 545926018, 545095100, 544270248, 543459969, 542655220, 541833534, 540970039, 540049362, 539073067, 538058434, 537030602, 536010323, 535004845, 534005585, 532992630, 531946220, 530857925, 529738350, 528615150, 527524338, 526497498, 525549889, 524677238, 523859062, 523071213, 522297287, 521536407, 520801773, 520112228, 519480095]
1204E19480095n78194n45044n43937n73464o20613o64940o89049o85386o60629o33088
1214E13285751o23474o46782p04384p82775q60253r16595r41849r41200r31015r31053
1224E05006371r53904r99717j055642j103782j129189j128463j108971j087227j077881
1233D95361595j087227j111450j137276j151123j144752j120758j090508j069069j067466
1242D85381966j087418j120987j153717j172256j170540j153298j133041j124497j137695
1251D75128517j174316j228562j292991j363373j440888j530571j634330j747208j855354
1260D61860924j940918j990204j999664j978341j944808j919404j916351j939850j983337
1269D44248047k033463k078666k111283k133941k154999k185440k232857k298126k375412
$$ y = [519480095, 518901901, 518356857, 517812920, 517239456, 516618843, 515953903, 515264854, 514579468, 513918839, 513285751, 512662277, 512015495, 511311111, 510528336, 509668083, 508751488, 507809639, 506868439, 505937424, 505006371, 504052467, 503052750, 501997108, 500893326, 499764137, 498635674, 497526703, 496439476, 495361595, 494274368, 493162918, 492025642, 490874519, 489729767, 488609009, 487518501, 486449432, 485381966, 484294548, 483173561, 482019844, 480847588, 479677048, 478523750, 477390709, 476266212, 475128517, 473954201, 472725639, 471432648, 470069275, 468628387, 467097816, 465463486, 463716278, 461860924, 459920006, 457929802, 455930138, 453951797, 452006989, 450087585, 448171234, 446231384, 444248047, 442214584, 440135918, 438024635, 435890694, 433735695, 431550255, 429317398, 427019272, 424643860]
1278D24643860k453919k525062k584267k633362k679634k731056k795181k874184k965088
1287D00402107l061065l154259l240395l322105l408280l511734l641357l797874l972855
1296C69292183m152870m327088m493637m658966m834747n028076n235749n441474n616494
1305C25503082n723972n724182n582829n281467m828377m267654l679829l167744k836971
1314B84410057k768822l000621l522225m285049n224285o281376p418747q620301r876594
1323B33412037j1163330j2419853j3537903j4357548j4677277j4267292j2896919j0375309
1331A29716606o611976j684046M112978J0267029J6121177K1013870K4440232K6176510
1339B23552380K6315899K5204143K3303909K1050339J8752689J6567040J4529076J2611541
$$ y = [424643860, 422189941, 419664879, 417080612, 414447250, 411767616, 409036560, 406241379, 403367195, 400402107, 397341042, 394186783, 390946388, 387624283, 384216003, 380704269, 377062912, 373265038, 369292183, 365139313, 360812225, 356318588, 351659622, 346824875, 341796799, 336561050, 331119576, 325503082, 319779110, 314054928, 308472099, 303190632, 298362255, 294094601, 290414772, 287247028, 284410057, 281641235, 278640614, 275118389, 270833340, 265609055, 259327679, 251908932, 243288631, 233412037, 222248707, 209828854, 196290951, 181933403, 167256126, 152988834, 140091915, 129716606, 123104630, 121420584, 125533562, 135800591, 151921768, 172935638, 197375870, 223552380, 249868279, 275072422, 298376331, 319426670, 338179359, 354746399, 369275475, 381887016]
1347C81887016J0774308Q992042P261314N597954M028778K583313J278420J09062r52110
1356D21560097j937485k863274l712005m441872n010872n408516n669250n861016o053428
1365C80602379o290245o579437o902428p235375p558975p857742q112564q294487q374558
1374C13396568q336677q188973p960930p690448p410698p144680o908799o715354o572037
1383B46467972o471997o387825o280155o116104n895042n655442n461425n367470n387230
1392A93445282n482006n581493n622120n582886n495205n422115n421677n512524n665388
1401A43659868n818653n906296n881452n721340n419712m973908m379320l632221k733584
1410I9193382j686210m86851Q78382K426452M155731O022358P935105R771414J1409816
$$ y = [381887016, 392661324, 401653366, 408914680, 414512634, 418541412, 421124725, 422403145, 422512207, 421560097, 419622612, 416759338, 413047333, 408605461, 403594589, 398186073, 392516823, 386655807, 380602379, 374312134, 367732697, 360830269, 353594894, 346035919, 338178177, 330065613, 321771126, 313396568, 305059891, 296870918, 288909988, 281219540, 273808842, 266664162, 259755363, 253040009, 246467972, 239995975, 233608150, 227327995, 221211891, 215316849, 209661407, 204199982, 198832512, 193445282, 187963276, 182381783, 176759663, 171176777, 165681572, 160259457, 154837780, 149325256, 143659868, 137841215, 131934919, 126053467, 120332127, 114912415, 109938507, 105559187, 101926966, 99193382, 97507172, 97020321, 97898703, 100325155, 104480886, 110503244, 118438349, 128209763, 139619579]
1419A39619579J2757960J3757810J4373379J4578857J4362259J3750496J2827244J1724167
1427B47751751J0574131R455032Q361683P226639N973454M556598K953072J120281
1435B97972641j024265l540097o325187q984795j0836487j1113987r320545n546970
1443B41280308n56603M450188Q300762J0303764J0451050R278565P495842N625038
1451B96628914L853664K151165N08538q97847j753978j819783j148300j29757O82564
1460B98075180Q62026L27721o43177j608582k229194k442112k448101k543621k919140
1469B84431000l551426m238701m740143m915409m791546m526996m314003m282589m454041
1478B44616146m757252n085621n357551n553799n714321n905704o173974o509780o842938
$$ y = [139619579, 152377539, 166135349, 180508728, 195087585, 209449844, 223200340, 236027584, 247751751, 258325882, 267780914, 276142597, 283369236, 289342690, 293899288, 296852360, 297972641, 296948376, 293408279, 287083092, 278098297, 267261810, 256147823, 246827278, 241280308, 240723705, 245173893, 253474655, 263778419, 274229469, 283508034, 291003876, 296628914, 300482578, 302633743, 303142281, 302244434, 300490456, 298670673, 297522373, 297392616, 298075180, 298937206, 299264927, 298621750, 297013168, 294783974, 292341862, 289893761, 287350140, 284431000, 280879574, 276640873, 271900730, 266985321, 262193775, 257666779, 253352776, 249070187, 244616146, 239858894, 234773273, 229415722, 223861923, 218147602, 212241898, 206067924, 199558144, 192715206]
1487A92715206p075386p131424p004700o770420o551618o456299o515970o661854o753254
1496A31794281o645327o261072n628004m864502m117508l493604l014117k623119k235508
1505I2911520j799421j334896r25837o75325o46801q30603j148920j494074j774740
1514H2280903j943770j998677j959567j846414j668286j423669j109671p26323k78864
1523F9325662K22644P61314J314640J861067K393508K929539L507271M163218M901695
1532I1380558N680342O419477P040787P503042P818575Q033991Q191957Q301173Q330650
1541A58700552Q231421P964038P512150O881962O095085N188866M224891L286324K452908
1550B10538197J756591J146927N02243l06034j323433k454300l481235m162655m361515
$$ y = [192715206, 185639820, 178508396, 171503696, 164733276, 158181658, 151725359, 145209389, 138547535, 131794281, 125148954, 118887882, 113259878, 108395376, 104277868, 100784264, 97770147, 95147028, 92911520, 91112099, 89777203, 88851366, 88176041, 87529240, 86698637, 85549717, 84055643, 82280903, 80337133, 78338456, 76378889, 74532475, 72864189, 71440520, 70330849, 69604526, 69325662, 69548306, 70309620, 71624260, 73485327, 75878835, 78808374, 82315645, 86478863, 91380558, 97060900, 103480377, 110521164, 118024206, 125842781, 133876772, 142068729, 150369902, 158700552, 166931973, 174896011, 182408161, 189290123, 195385208, 200574074, 204798965, 208085289, 210538197, 212294788, 213441715, 213943958, 213637924, 212314491, 209860191, 206378956, 202216301, 197854786]
1559A97854786m128323l690548l350582l346500l751049m454193n232487n860271o207266
1568A57833567o276245o177626o059561o031179o116219o250095o320706o228075n934019
1577A02439842n478658m953871m456387m040508l702779l398504l079400k724152k348051
1586F8257532j985245j665978j399136j174731r75990p92213o22129m69022l34234
1595E8838854k16036j10865j7957N9690J17955J52116J58177J32227P2264j5421j13425
1606E9057579j92585k21043j72562l4585J94077N08766R03364J368885J887569K426968
1616F5726433K944884L399725L764019M032826M221726M357109M465389M564276M659262
1625A02135649M745702M812918M849615M855080M842653M843207M896602N041609N304527
$$ y = [197854786, 193726463, 190035915, 186685333, 183338833, 179587784, 175133591, 169901104, 164040833, 157833567, 151557322, 145379696, 139320135, 133288956, 127172737, 120922642, 114601936, 108373861, 102439842, 96961184, 92007313, 87550926, 83510418, 79807639, 76409135, 73329735, 70605583, 68257532, 66272287, 64606309, 63207173, 62032442, 61056452, 60264239, 59642110, 59173088, 58838854, 58622818, 58511953, 58493996, 58553686, 58671641, 58823757, 58981934, 59114161, 59186425, 59171004, 59057579, 58864994, 58643951, 58471389, 58436804, 58630881, 59139647, 60043011, 61411896, 63299465, 65726433, 68671317, 72071042, 75835061, 79867887, 84089613, 88446722, 92912111, 97476387, 102135649, 106881351, 111694269, 116543884, 121398964, 126241617, 131084824, 135981426, 141023035, 146327562]
1634A46327562N691061O181488O724053P234859P605915P736264P579898P188874O720009
1643B08989983O379757O322155O551551O893864P073727O869659O264687N492153M933643
1652B65771179M912548N497856O440087P289715P635612P327576O551494N707856N176181
1661C22310104N101052N335464N563278N517273N145531M625702M224586M106903M228020
1670C66157913M381180M358521M115219L807449L679466L873673M294090M631004M538498
1679D03837013L857155K743797J616249R44176J006127J751251K839126L822060M360161
1688D26777115M351234L920861L303375K697754K184334J734809J290780Q46977M85687
1697D47592926L39355N09758R93157J657066K288666K689743K770958K592583K330360
$$ y = [146327562, 152018623, 158200111, 164924164, 172159023, 179764938, 187501202, 195081100, 202269974, 208989983, 215369740, 221691895, 228243446, 235137310, 242211037, 249080696, 255345383, 260837536, 265771179, 270683727, 276181583, 282621670, 289911385, 297546997, 304874573, 311426067, 317133923, 322310104, 327411156, 332746620, 338309898, 343827171, 348972702, 353598404, 357822990, 361929893, 366157913, 370539093, 374897614, 379012833, 382820282, 386499748, 390373421, 394667511, 399298515, 403837013, 407694168, 410437965, 412054214, 412998390, 414004517, 415755768, 418594894, 422416954, 426777115, 431128349, 435049210, 438352585, 441050339, 443234673, 444969482, 446260262, 447107239, 447592926, 447932281, 448442039, 449435196, 451092262, 453380928, 456070671, 458841629, 461434212, 463764572]
1706D63764572K177849K239494K468224K684860K669449K280731J542397O53190q4381
1715D80396385l88794j21765O45180J648140K536621L018951K992707K585983K087173
1724D95400581J784783J800689K015038K135429J884270J195183K92015m09889n34554
1733E05563545K6589J038589K044373K621116K608261K173996J683999J465873J615906
1742E20842247J969795K231255K171860J768112J201973P43522N96238Q02001J241837
1751E33568840J717606K049980K147178K016755J736106J406823J116905R22317Q45833
1760E47528343Q87490J031951J247445J473922J619683J578712J279106P39823J00517
1769E57486992m12369n81245l07732L23868J080055J687393J962548J880493J553764
$$ y = [463764572, 465942421, 468181915, 470650139, 473334999, 476004448, 478285179, 479827576, 480480766, 480396385, 480007591, 479885826, 480531006, 482179146, 484715767, 487734718, 490727425, 493313408, 495400581, 497185364, 498986053, 501001091, 503136520, 505020790, 506215973, 506507988, 506098099, 505563545, 505590134, 506628723, 508673096, 511294212, 513902473, 516076469, 517760468, 519226341, 520842247, 522812042, 525043297, 527215157, 528983269, 530185242, 530928764, 531525002, 532327003, 533568840, 535286446, 537336426, 539483604, 541500359, 543236465, 544643288, 545760193, 546682510, 547528343, 548415833, 549447784, 550695229, 552169151, 553788834, 555367546, 556646652, 557386475, 557486992, 557074623, 556493378, 556185646, 556509514, 557589569, 559276962, 561239510, 563120003, 564673767]
1778E64673767J148148P97233N68962M84085N45655P39975J005554J213074J200142
1787E72376595Q62960K49215m22554q52662q22601l28293M01802J023026J260376J048507
1797E74796371N52330N9777j77384o4621L12729P57027J067810J130219R50317O33926
1807E80018501L27606J54381J63765L17841N18303O59446O83365O01845M77753L73535
1817E84296341L12424K70614K09847J15394Q049p8773j34697j82037k48223l20549
1827E84248390l31611j96534J16120N38444R26628J147042J168174J082077J035691
1836E89734421J113205J260452J314278J122474O71997J30539k36931k23388J92680
1845E95079727Q32482J419334J731567J706734J445580J125373Q91343P92312P84645
$$ y = [564673767, 565821915, 566619148, 567188110, 567672195, 568217850, 568957825, 569963379, 571176453, 572376595, 573239555, 573488770, 573066216, 572213554, 571390953, 571062660, 571464462, 572487488, 573747864, 574796371, 575348701, 575408478, 575231094, 575166473, 575479202, 576236229, 577304039, 578434258, 579384575, 580018501, 580346107, 580500488, 580664253, 580982094, 581500397, 582159843, 582843208, 583445053, 583922806, 584296341, 584608765, 584879379, 585089226, 585204620, 585212669, 585133896, 584999199, 584817162, 584568939, 584248390, 583916779, 583720245, 583836365, 584374809, 585301437, 586448479, 587616653, 588698730, 589734421, 590847626, 592108078, 593422356, 594544830, 595216827, 595347366, 595110435, 594887047, 595079727, 595912209, 597331543, 599063110, 600769844, 602215424, 603340797, 604232140, 605024452, 605809097]
1854F05809097P89986P54662O79283O09321N97382O66160P86286Q81538Q62160O71463
1864F13107338L29437n7678l34816l70331j27144L08762P68013J082497J167068J049576
1874F16922722Q35419O35490N08041M47693M19731M02947M01344M26750M65203M71611
1884F21936951L97987K36511M1428r5940j03874K0790K08626L60832M10652L59688
1894F23773651K64359J90048J65138J72310J75476J55296J24512J08986J15242J16653
1904F25361671P1030l9139j77536k67982k41966r3193J03034K27662J84478l7078l53013
1915F24737968o28967p54661o99768n19829l15476j72233j20087j32103j54571j47400
1925F21092873j04103m8905j3885j7662n4589j00174j24130j05400m2572M3716J16425
$$ y = [605809097, 606599083, 607353745, 608033028, 608642349, 609239731, 609905891, 610692177, 611573715, 612435875, 613107338, 613436775, 613379097, 613044281, 612673950, 612546806, 612855568, 613623581, 614706078, 615873146, 616922722, 617758141, 618393631, 618901672, 619349365, 619769096, 620172043, 620573387, 621000137, 621465340, 621936951, 622334938, 622571449, 622612877, 622516937, 622413063, 622433853, 622642479, 623003311, 623413963, 623773651, 624038010, 624228058, 624393196, 624565506, 624740982, 624896278, 625020790, 625129776, 625245018, 625361671, 625432701, 625393562, 625216026, 624948044, 624706078, 624612885, 624715919, 624943581, 625128059, 625090981, 624737968, 624109001, 623354340, 622654572, 622134743, 621819267, 621647034, 621526947, 621394844, 621240273, 621092873, 620988770, 620939865, 620925980, 620908318, 620853729, 620753555, 620629425, 620524025, 620481453, 620525169, 620641594]
1936F20641594J35117P5492n6228k18277l48892l91579l24097j69029J4267J58920
1946F19517288K19918J90811J00975n760r1401j39541j53580j48964j39847j33209
1956F19216690j30081j27640j26343j29280j42936j72234k16026k65961l07655l27340
1966F17271194l17878k83661k39029k00615j79977j78223j88408k02789k19727k42882
1976F15018005k79579l30047l85209m28695m45748m33006m03404l82233l96461m61464
1986F11072159n71404o98967q04367q52966q30765p53746o61735o00510o00777o61773
1996F04035149p52678q30345q62313q44688q02536p74117p89032q50639r36012j008873
2006E95583916j039658j020088r67827r14917q93860r21020r90258j074752j139260
$$ y = [620641594, 620776711, 620852203, 620795975, 620577698, 620228806, 619837227, 619513130, 619344101, 619358368, 619517288, 619737206, 619928017, 620028992, 620023232, 619931831, 619792290, 619638710, 619489746, 619349899, 619216690, 619086609, 618958969, 618832626, 618703346, 618560410, 618388176, 618172150, 617906189, 617598534, 617271194, 616953316, 616669655, 616430626, 616230011, 616050034, 615871811, 615683403, 615480614, 615260887, 615018005, 614738426, 614408379, 614023170, 613594475, 613148727, 612715721, 612312317, 611930084, 611533623, 611072159, 610500755, 609801788, 608997421, 608144455, 607313690, 606559944, 605898209, 605297699, 604696922, 604035149, 603282471, 602452126, 601589813, 600745125, 599942589, 599168472, 598379440, 597528801, 596592789, 595583916, 594544258, 593524170, 592556343, 591641426, 590747566, 589826546, 588836288, 587761536, 586622276]
2015E86622276j155700j117363j042214r64622r17893r17625r51424r86099r84459
2024E77584877r25522q14972o81801n62820m83398m47083m37012m27818m00543l53241
2034E72050667l00217k64969k68020l16353m00582m97016n79262o28472o42318o35147
2044E67518311o30417o49414o98586p67517q33931q75168q80089q53386q12454p77168
2054E59740181p60841p64389p79458p93762p99713p97577p94678q01849q26301q70514
2064E51751099r29451r94606j057740j114387j166077j217918j275978j342621j415482
2073E41236839j485710j543045j578865j589889j580391j559220j538238j525536j524925
2082E27311020j531754j536331j528091j499214j450043j388855j329613j287231j270523
$$ y = [586622276, 585466576, 584349213, 583306999, 582342377, 581424484, 580506859, 579555435, 578569336, 577584877, 576659355, 575844383, 575162582, 574599762, 574116364, 573669281, 573232269, 572804451, 572403908, 572050667, 571750450, 571485481, 571217461, 570901108, 570500526, 570003510, 569424248, 568795776, 568153458, 567518311, 566887894, 566238480, 565539894, 564772377, 563938446, 563063278, 562183189, 561329803, 560517349, 559740181, 558979340, 558214951, 557435493, 556641731, 555842018, 555044441, 554249763, 553447914, 552621613, 551751099, 550821648, 549827042, 548769302, 547654915, 546488838, 545270920, 543994942, 542652321, 541236839, 539751129, 538208084, 536629219, 535039330, 533458939, 531899719, 530361481, 528835945, 527311020, 525779266, 524242935, 522714844, 521215630, 519765587, 518376732, 517047119, 515759888, 514489365]
2091E14489365j279221j303711j329918j346512j349258j343918j341591j352081j377792
2100E02465363j411210j438751j447906j431694j393853j343841j291771j243401j196823
2109D90266113j145553j083336j007309r20372q29048p40013o57883n83496n13878
2118D82785225m44183l68958k84958j91688r4071M20Q4419J53351K08282K54708K99301
2129D82401848L46832L96996M46891M93165N34858N73464O12678O52886O93931P33490
2139D87887039P70569Q06046Q42018Q78906R14345R43451R60922R65538R61761R55315
2149D96885910R52797R54933R58901R58252R48867R30329R06677Q83713Q65745Q53348
2159E06099472Q44879Q35915Q23479Q06579P86018P63550P41463P19910O98280O73790
$$ y = [514489365, 513210144, 511906433, 510576515, 509230003, 507880745, 506536827, 505195236, 503843155, 502465363, 501054153, 499615402, 498167496, 496735802, 495341949, 493998108, 492706337, 491462936, 490266113, 489120560, 488037224, 487029915, 486109543, 485280495, 484540482, 483882599, 483299103, 482785225, 482341042, 481972084, 481687126, 481495438, 481401367, 481401787, 481486206, 481639557, 481847839, 482102547, 482401848, 482748680, 483145676, 483592567, 484085732, 484620590, 485194054, 485806732, 486459618, 487153549, 487887039, 488657608, 489463654, 490305672, 491184578, 492098923, 493042374, 494003296, 494968834, 495930595, 496885910, 497838707, 498793640, 499752541, 500710793, 501659660, 502589989, 503496666, 504380379, 505246124, 506099472, 506944351, 507780266, 508603745, 509410324, 510196342, 510959892, 511701355, 512421265, 513119545, 513793335]
2169E13793335O42624O01005N46837M80957M06456L29209K54135J84097J19171N6267
2179E17414093o676p0915j33972j92146k41623k80800l11241l36571l60832l85208
2189E15094109m09661m31137m46586m54255m52957m44183m28887m09851l89099l69987
2199E10857506l54042l41950l30887l15818k92015k56157k09313j57623j09139p1449
2209E08419113m8637l8567l5095k9602j5640R803M5166Q4038J18828J43280J53923
2220E08806610J52702J44310J34430J26801J20697J13220J01090Q3122O2752M5585
2230E09891319L6049L4676L6278L2577J5793j6441o0273j06468j46026j73340j90659
2241E09353485k05459k27929k65312l18298l81279m44031m98085n39360n70107n97953
$$ y = [513793335, 514435959, 515036964, 515583801, 516064758, 516471214, 516800423, 517054558, 517238655, 517357826, 517414093, 517407417, 517336502, 517202530, 517010384, 516768761, 516487961, 516176720, 515840149, 515479317, 515094109, 514684448, 514253311, 513806725, 513352470, 512899513, 512455330, 512026443, 511616592, 511227493, 510857506, 510503464, 510161514, 509830627, 509514809, 509222794, 508966637, 508757324, 508599701, 508490562, 508419113, 508370476, 508331909, 508296814, 508267212, 508251572, 508261375, 508306541, 508390579, 508509407, 508652687, 508806610, 508959312, 509103622, 509238052, 509364853, 509485550, 509598770, 509699860, 509782982, 509845734, 509891319, 509927368, 509962044, 509998322, 510030899, 510046692, 510030251, 509969978, 509863510, 509717484, 509544144, 509353485, 509148026, 508920097, 508654785, 508336487, 507955208, 507511177, 507013092, 506473732, 505903625, 505305672]
2251E05305672o30722o71769p19642p67174q05359q27446q29964q15048p85598p45240
2261D97707710o94999o32668n54237m57688l43704k19231r5863J4191J00670J60026
2271D94984207J96419K19040K37732K61039K92511L30925L71247M06227M27627M28162
2281D98155136M04472L57438K92663K18544J41907O6376p134p8773j46981k08053k59438
2292D98936157l02276l41149l82805m29687m79088n22842n52979n65643n63126n52902
2302D94243660n44167n46684n69534o18782o94542p83196q59375q90960q55141p52945
2312D87128334o15463m95072m45442m98199o48575q54797j052437j176262j183510
2321D80158577j071548q85163p02247o06347o46286q08181j015854j167145j189842
$$ y = [505305672, 504674950, 504003181, 503283539, 502516365, 501711006, 500883560, 500053596, 499238548, 498452950, 497707710, 497012711, 496380043, 495825806, 495368118, 495024414, 494805183, 494709320, 494723511, 494824181, 494984207, 495180626, 495399666, 495637398, 495898437, 496190948, 496521873, 496893120, 497299347, 497726974, 498155136, 498559608, 498917046, 499209709, 499428253, 499570160, 499636536, 499629402, 499550629, 499403648, 499195595, 498936157, 498633881, 498292732, 497909927, 497480240, 497001152, 496478310, 495925331, 495359688, 494796562, 494243660, 493699493, 493152809, 492583275, 491964493, 491269951, 490486755, 489627380, 488736420, 487881279, 487128334, 486512871, 486017799, 485572357, 485074158, 484425583, 483570786, 482518349, 481342087, 480158577, 479087029, 478201866, 477499619, 476893272, 476246986, 475438805, 474422951, 473255806, 472065964]
2330D72065964j082802r16977p87773p56111q14705r10797j005097j122017j336174
2339D63333511j695518k129021k415542k263833j475448j04332J499405K805900L335572
2348D60890694K882385J605759n5046j593209k652092l136062l178749l009873k817688
2357D48936119k679062k574920k454567k291718k097130j897506j706353j514702j305885
2366D30414276j077690q50105o54984n15175m31289l82920l42712k90985k22473j44539
2376D25501404p0114j3352J1978o027p4882j95809l60031n53322p58590r61113j149331
2387D21370811j315307j453247j561432j642876j704368j754761j798363j833992j856651
2396D06449814j861649j848945j823731j792526j759796j725426j686745j641769j592331
$$ y = [472065964, 470983162, 470066185, 469278412, 468522301, 467707596, 466796799, 465791702, 464669685, 463333511, 461637993, 459508972, 457093430, 454829597, 453354149, 453249817, 454749222, 457555122, 460890694, 463773079, 465378838, 465323792, 463730583, 461078491, 457942429, 454763680, 451753807, 448936119, 446257057, 443682137, 441227570, 438935852, 436838722, 434941216, 433234863, 431720161, 430414276, 429336586, 428486481, 427831497, 427316322, 426885033, 426502113, 426159401, 425868416, 425645943, 425501404, 425431290, 425417938, 425429916, 425423889, 425349007, 425153198, 424793167, 424239845, 423481255, 422520142, 421370811, 420055504, 418602257, 417040825, 415397949, 413693581, 411938820, 410140457, 408306465, 406449814, 404588165, 402739220, 400915489, 399122963, 397363167, 395637741, 393950996, 392309227, 390716896]
2405C90716896j542358j495171j450844j405372j353760j292153j221275j144066j065025
2414C78746872r87968r14612q45108p78466p13653o51207n93033n42870n05676m83627
2424C71730652m75121m74357m74205m69323m59136m49372m47922m62532m96177n46608
2434C66975899o07949o71615p30362p78656q13713q36678q50334q59795q69560q81920
2444C59075317q95614r08165r16100r18007r15184r10110r06677r05343r05342r03701
2454C49991074q97026q83751q64258q42400q23059q12569q14781q30993q57888q91037
2464C41473312r23881r52988r78813j005173j037979j081886j136627j196175j251106
2473C31908684j292992j317825j330147j339149j354447j380730j414947j448326j471749
$$ y = [390716896, 389174538, 387679367, 386228523, 384823151, 383469391, 382177238, 380955963, 379811897, 378746872, 377758904, 376844292, 375999184, 375220718, 374507065, 373855858, 373262825, 372719955, 372214279, 371730652, 371255531, 370781174, 370306969, 369837646, 369378510, 368929138, 368481216, 368018684, 367522507, 366975899, 366367950, 365696335, 364965973, 364187317, 363373604, 362536926, 361686592, 360826797, 359957237, 359075317, 358179703, 357271538, 356355438, 355437431, 354522247, 353612137, 352705460, 351800117, 350894775, 349991074, 349094048, 348210297, 347346039, 346503639, 345680580, 344868011, 344053230, 343222237, 342364349, 341473312, 340549431, 339596443, 338617630, 337612457, 336574478, 335492592, 334355965, 333159790, 331908684, 330615692, 329297867, 327967720, 326628571, 325274124, 323893394, 322478447, 321030121, 319558372]
2482C19558372j482810j486321j493092j513404j550713j598396j643868j672802j677875
2491C05439091j660691j632404j607189j595993j602192j619206j634750j636906j620330
2500B90829430j589260j555691j533318j530781j545887j567001j577511j563053j518173
2509B76848755j447067j360894j272449j190319j115837j045113r71222q88977p97977
2518B66758900p02896o10466n26391m52346l83625l14083k38247j56384p3871P6N7831
2529B63358498R7026J20984J37004J51616J68685J87932K06260K19784K25124K20318
2539B65093231K04983J81408J54686J30367J13697J04943R9430Q8195O2905J9111m0702
2550B66212254j10302j81714k50377l16143l81699m49981n21012n92747o60896p22809
$$ y = [319558372, 318075562, 316589241, 315096149, 313582745, 312032032, 310433636, 308789768, 307116966, 305439091, 303778400, 302145996, 300538807, 298942814, 297340622, 295721416, 294086666, 292449760, 290829430, 289240170, 287684479, 286151161, 284620380, 283074493, 281507492, 279929981, 278366928, 276848755, 275401688, 274040794, 272768345, 271578026, 270462189, 269417076, 268445854, 267556877, 266758900, 266056004, 265445538, 264919147, 264466801, 264083176, 263769093, 263530846, 263374462, 263300591, 263300667, 263358498, 263455524, 263576508, 263713512, 263865128, 264033813, 264221745, 264428005, 264647789, 264872913, 265093231, 265298214, 265479622, 265634308, 265764675, 265878372, 265983315, 266082745, 266170940, 266233845, 266252956, 266212254, 266101952, 265920238, 265669861, 265353718, 264972019, 264522038, 264001026, 263408279, 262747383, 262024574]
2560B62024574p78141q28323q77476r27696r81178j037464j095582j153907j211052
2569B53133755j265564j316681j362286j401520j432724j454677j467266j469708j461410
2578B40501919j442032j410675j369171j320114j269608j224117j187992j162072j142215
2587B28973923j121788j095105j060485j021347r85508r60255r48830r48124r49459
2596B19883022r42821r22070q87203q44822q03509p69558p42435p15485o78749o24866
2606B11951504n51834m64974l72162k81047j94016j08910k0065P7305J84326K98138
2616B10518265M11873N17692O08616O79779P30496P64007P86362Q05130Q26530Q54187
2626B17502937Q88176R25961R65309J005058J046391J090069J136531J182633J223926
$$ y = [262024574, 261246433, 260418110, 259540634, 258612938, 257631760, 256594296, 255498714, 254344807, 253133755, 251868191, 250551510, 249189224, 247787704, 246354980, 244900303, 243433037, 241963329, 240501919, 239059887, 237649212, 236280041, 234959927, 233690319, 232466202, 231278210, 230116138, 228973923, 227852135, 226757030, 225696545, 224675198, 223689690, 222729435, 221780605, 220832481, 219883022, 218940201, 218018131, 217130928, 216286106, 215482597, 214713039, 213970604, 213255119, 212576370, 211951504, 211399670, 210934696, 210562534, 210281487, 210087471, 209978561, 209958496, 210035801, 210220127, 210518265, 210930138, 211447830, 212056446, 212736225, 213466721, 214230728, 215017090, 215822220, 216648750, 217502937, 218391113, 219317074, 220282383, 221287441, 222333832, 223423901, 224560432, 225743065, 226966991]
2635B26966991J256543J278000J290149J297074J301784J307068J311817J313439J309032
2644B38631897J295853J272888J238384J191120J129360J052876R64203Q67595P69883
2653B48414059O76918N93261N20153M56334L98407L42216K84290K22111J56002Q7986
2663B52151737K1420m0856r9125j56669k19670k93884l81756m81090n86357o90289
2673B49223461p87544q75149r52759j021404j081390j134434j181068j221638j255608
2682B39712467j279373j288471j278534j248303j201667j146279j090545j039429r93042
2691B29146824r46446q93421q30517p58094o81687o08425n45330m96235m61159m37107
2701B22488403m20074m05064l89461l71418l50342l25432k95734k60773k20470j77231
$$ y = [226966991, 228223534, 229501534, 230791683, 232088757, 233390541, 234697609, 236009426, 237322865, 238631897, 239927750, 241200638, 242439022, 243630142, 244759502, 245812378, 246776581, 247644176, 248414059, 249090977, 249684238, 250204391, 250660725, 251059132, 251401348, 251685638, 251907749, 252063751, 252151737, 252173157, 252132301, 252033176, 251876507, 251656837, 251362953, 250981197, 250500107, 249913750, 249223461, 248435917, 247560768, 246608009, 245586605, 244505215, 243370781, 242189713, 240968075, 239712467, 238433094, 237144623, 235866089, 234617786, 233416119, 232269840, 231179295, 230139866, 229146824, 228200378, 227306957, 226476440, 225718346, 225036659, 224428234, 223882904, 223386669, 222925510, 222488403, 222068329, 221663265, 221273804, 220902386, 220552044, 220226612, 219930878, 219670105, 219449635, 219272404]
2711B19272404j32695q9340m6081J52N2224J11160J74904K38228K95238L43094L81012
2722B20600300M09794M30298M41665M42448M33731M19254M04568L93181L84178L71685
2732B24731102L47576L06683K51064J88484J30081Q3733N1460K8115N226k4357o4945
2743B26034222j14518j68209k19154k61955k94132l15342l27912l33996l34797l30123
2753B23334084l18280k97985k70481k38781k07844j80950j59454j40820j22051j00918
2763B21296520p8754n9910m9820n1918o6605r1095j21173j54572j90029k28958k72179
2774B19931507l20759l74126m31252m91104n50689o06804o54450o89239p08695p14474
2784B14389915p10296p02038o93359o85120o75487o61927o43120o20880n97763n76782
$$ y = [219272404, 219139709, 219050369, 219004288, 219004440, 219056664, 219167824, 219342728, 219580956, 219876194, 220219288, 220600300, 221010094, 221440392, 221882057, 222324505, 222758236, 223177490, 223582058, 223975239, 224359417, 224731102, 225078678, 225385361, 225636425, 225824909, 225954990, 226038723, 226090183, 226118298, 226123524, 226099167, 226034222, 225919704, 225751495, 225532341, 225270386, 224976254, 224660912, 224333000, 223999004, 223664207, 223334084, 223015804, 222717819, 222447338, 222208557, 222000713, 221819763, 221660309, 221519489, 221397438, 221296520, 221217766, 221157856, 221108036, 221056118, 220989513, 220898418, 220777245, 220622673, 220432644, 220203686, 219931507, 219610748, 219236622, 218805370, 218314266, 217763577, 217156773, 216502323, 215813084, 215104389, 214389915, 213679619, 212977581, 212284222, 211599102, 210923615, 210261688, 209618568, 208997688, 208399925, 207823143]
2794B07823143n58662n42756n28526n16186n08060n08404n20687n47543n89180o43348
2804B02359791p05700p71198q34179q89607r34009r65653r84421r91592r87415r72729
2814A93323288r46121r06620q53157p85084p03869o11668n12981m12483l14236k21558
2824A87055511j35097n4112K1801R2507J55849K08855K49882K78282K96459L06873
2834A88476810L11718L12882L11165L08456L06740L07045L08666L07617K98691K76184
2844A91525974K37637J84498J21402N4360j0681p0401j23786j71223k14253k54440
2854A91279087k92244l27206l57017l78571l89099l87363l75023l56445l35827l17135
2864A87763157l00140k82784k62413k38113k13261j93939j86501j94149k13966k38800
$$ y = [207823143, 207264481, 206721725, 206193199, 205677013, 205168953, 204660549, 204139862, 203592319, 203003139, 202359791, 201654091, 200882893, 200048714, 199159107, 198225098, 197259445, 196275024, 195283432, 194296017, 193323288, 192377167, 191470547, 190617390, 189832306, 189128437, 188516769, 188003788, 187591305, 187277069, 187055511, 186920414, 186866302, 186888103, 186980610, 187136459, 187345314, 187595196, 187873478, 188169937, 188476810, 188788528, 189101410, 189412575, 189721031, 190027771, 190334816, 190643482, 190951099, 191249790, 191525974, 191763611, 191948109, 192069511, 192123871, 192113190, 192042789, 191919003, 191747780, 191533527, 191279087, 190986843, 190659637, 190302620, 189924049, 189534950, 189147587, 188772564, 188416119, 188080292, 187763157, 187463017, 187180233, 186917820, 186679707, 186466446, 186272507, 186086006, 185891857, 185677891, 185439091]
2874A85439091k60067k72885k77843k81296k90737l10516l38154l65277l81431l79162
2884A82281723l58257l24574k88067k57320k35844k21920k09236j92280j67942j36795
2894A79889488j01471o5479k9774O657M6482R1782J43165J98879K55299L08857L56293
2905A81100178L96786M31766M62818M92916N22347N50499N74112N89599N95379N93300
2915A86309700N88913N89466O01311O26488O61716P00073P33509P57542P70931P77493
2925A93117142P81040P85065P89070P90634P84874P68108P39022O99043O53667O08502
2935B00516167N69496N38864N14393M91276M62741M25625L79849L30086K82135K40192
2945B04750824K04582J71414J36089R4700M7931M01m2515p6084j01261j24645j55640
$$ y = [185439091, 185179024, 184906139, 184628296, 184347000, 184056263, 183745747, 183407593, 183042316, 182660885, 182281723, 181923466, 181598892, 181310825, 181053505, 180817661, 180595741, 180386505, 180194225, 180026283, 179889488, 179788017, 179722538, 179692764, 179699421, 179745903, 179837685, 179980850, 180179729, 180435028, 180743885, 181100178, 181496964, 181928730, 182391548, 182884464, 183406811, 183957310, 184531422, 185121021, 185716400, 186309700, 186898613, 187488079, 188089390, 188715878, 189377594, 190077667, 190811176, 191568718, 192339649, 193117142, 193898182, 194683247, 195472317, 196262951, 197047825, 197815933, 198554955, 199253998, 199907665, 200516167, 201085663, 201624527, 202138920, 202630196, 203092937, 203518562, 203898411, 204228497, 204510632, 204750824, 204955406, 205126820, 205262909, 205357609, 205405540, 205405941, 205363426, 205287342, 205186081, 205061436, 204905796]
2956B04905796k02808k70043l53775m46338n39170o27689p12166p93610q68415r21345
2966A99170437r25694q48159o58875l43723Q8367O02646J145248J653748K071400K356968
2976B04312363K494335K489948K369156K166500J917534J653004J396446J164608R66091
2985B20929985Q01811O67134N52845M51679L59363K76242K02274J33209N7831l8948
2995B24393425j72882l58143o09779r45149j376381j894588k443314k908497l131275
3004B10553417k956505k298984j196842J76315J556988K676849L351212L531913L303986
3013B18698349K832184K289562J799755J416798J137619R33266P76462O53515N60760
3022B31098270M96502M53606M21314L89748L55034L20205K91691K74735K69298K70138
$$ y = [204905796, 204702988, 204432945, 204079170, 203632832, 203093662, 202465973, 201753807, 200960197, 200091782, 199170437, 198244743, 197396584, 196737709, 196393986, 196482353, 197084999, 198230247, 199883995, 201955395, 204312363, 206806698, 209296646, 211665802, 213832302, 215749836, 217402840, 218799286, 219963894, 220929985, 221731796, 222398930, 222951775, 223403454, 223762817, 224039059, 224241333, 224374542, 224432373, 224393425, 224220543, 223862400, 223252621, 222307472, 220931091, 219036503, 216593189, 213684692, 210553417, 207596912, 205297928, 204101086, 204277401, 205834389, 208511238, 211862450, 215394363, 218698349, 221530533, 223820095, 225619850, 227036648, 228174267, 229107533, 229883995, 230537510, 231098270, 231594772, 232048378, 232469692, 232859440, 233214474, 233534679, 233826370, 234101105, 234370403, 234640541]
3032B34640541K69280K60715K43301K21863K04334J98632K07596K26650K46563K56386
3042B36975861K50587K31037K07329J92375J96266K21539K63405L12061L58467L97873
3052B39606800M32434M68407N11951N65987O28624O93684P55176Q08678Q53004Q89607
3062B46214352R20887R49764R77955J006775J036262J065083J090183J106930J112423
3071B55480614J105003J087418J065159J043853J028538J020279J017361J016063J012383
3080B64876671J003799R90315R73930R58595R47152R40074R34105R22356Q98800Q59756
3090B74305553Q07801P51018O98166O55060O20384N87120N46189M91600M23603L47576
3100B80234070K70099J95008J22013M7226l2139j16253k01664k82726l56331m21848
$$ y = [234640541, 234909821, 235170536, 235413837, 235635700, 235840034, 236038666, 236246262, 236472912, 236719475, 236975861, 237226448, 237457485, 237664814, 237857189, 238053455, 238274994, 238538399, 238850460, 239208927, 239606800, 240039234, 240507641, 241019592, 241585579, 242214203, 242907887, 243663063, 244471741, 245324745, 246214352, 247135239, 248085003, 249062958, 250069733, 251105995, 252171078, 253261261, 254368191, 255480614, 256585617, 257673035, 258738194, 259782047, 260810585, 261830864, 262848225, 263864288, 264876671, 265880470, 266870785, 267844715, 268803310, 269750462, 270690536, 271624641, 272546997, 273445797, 274305553, 275113354, 275864372, 276562538, 277217598, 277837982, 278425102, 278971291, 279462891, 279886494, 280234070, 280504169, 280699177, 280821190, 280868416, 280836277, 280720024, 280518360, 280235634, 279879303, 279457455]
3110B79457455m81625n38330n93166o45542o94542p40433p86057q35914q94642r64146
3120B72283058j043281j129227j217918j306744j394692j482372j572037j665115j762886
3129B59708786j863976j964817k060051k144088k213764k270241k317620k361240k402706
3138B40110283k439537k465248k473164k460728k430305k387619k337170k279663k212200
3147B18624649k131481k037506j935292j832084j734314j642475j551934j456394j351318
3156B02951851j237984j121559j008644r01756p98626o92330n76057m46682l05634
3165A95862579j58863j1120J35193K82574M35619N99041P74250R57299J141758J319637
3175B01337967J484718J634369J768856J891442K006931K119884K233429K347164K457486
$$ y = [279457455, 278975830, 278437500, 277844334, 277198792, 276504250, 275763817, 274977760, 274141846, 273247204, 272283058, 271239777, 270110550, 268892632, 267585888, 266191196, 264708824, 263136787, 261471672, 259708786, 257844810, 255879993, 253819942, 251675854, 249462090, 247191849, 244874229, 242512989, 240110283, 237670746, 235205498, 232732334, 230271606, 227841301, 225453682, 223116512, 220836849, 218624649, 216493168, 214455662, 212520370, 210688286, 208953972, 207311497, 205759563, 204303169, 202951851, 201713867, 200592308, 199583664, 198681908, 197883282, 197190952, 196614895, 196168213, 195862579, 195703716, 195692596, 195827789, 196110363, 196545982, 197145023, 197919273, 198876572, 200018330, 201337967, 202822685, 204457054, 206225910, 208117352, 210124283, 212244167, 214477596, 216824760, 219282246]
3184B19282246K557621K641525K706833K755527K793007K825089K852955K874774K886372
3193B44175949K885571K874965K860413K847881K838745K831459K821026K805100K784462
3202B69725571K761116K737903K713242K684307K650375K614289K582912K563419K557049
3211B93590183K558346K557259K543964K516098K478752K441368K411881K391681K375756
3220C15865288K354698K321930K275772K221031K165070K114296K071151K033196J996422
3229C35418854J956939J914635J872292J834640J805229J785126J771317J757545J737061
3238C51853638J704406J659852J608009J559715J526260J514702J524620J544609J558114
3247C66053925J549835J513748J455917J393090J341400J310119J295586J284904J264611
$$ y = [219282246, 221839867, 224481392, 227188225, 229943752, 232736759, 235561848, 238414803, 241289577, 244175949, 247061520, 249936485, 252796898, 255644779, 258483524, 261314983, 264136009, 266941109, 269725571, 272486687, 275224590, 277937832, 280622139, 283272514, 285886803, 288469715, 291033134, 293590183, 296148529, 298705788, 301249752, 303765850, 306244602, 308685970, 311097851, 313489532, 315865288, 318219986, 320541916, 322817688, 325038719, 327203789, 329318085, 331389236, 333422432, 335418854, 337375793, 339290428, 341162720, 342997360, 344802589, 346587715, 348359032, 350116577, 351853638, 353558044, 355217896, 356825905, 358385620, 359911880, 361426582, 362951202, 364495811, 366053925, 367603760, 369117508, 370573425, 371966515, 373307915, 374618034, 375913620, 377198524, 378463135]
3256C78463135J228142J179504J129112J087418J058616J039391J023178J004830R82818
3265C88196144R60083R38645R18769Q98896Q77800Q57315Q42323Q38356Q47740Q67844
3275C97043915Q91533R12056R24377R29299R29489R29031R28955R27239R21135R08889
3285D06245918Q91838Q73871Q59413Q50716Q47244Q45833Q42323Q34084Q19397P99255
3295D14709892P76367P54815P39173P33834P38983P49779P57370P52716P32040P00264
3305D22145233O70052O54793O61582O86913P18460P41310P47261P37496P20634P08351
3315D29192085P06253P13883P24792P29447P21168O95458O52885N97801N38254M83360
3325D35755386M40598M12750L95126L78991L55720L20816K78053K35177J99508J74256
$$ y = [378463135, 379691277, 380870781, 381999893, 383087311, 384145927, 385185318, 386208496, 387213326, 388196144, 389156227, 390094872, 391013641, 391912537, 392790337, 393647652, 394489975, 395328331, 396176071, 397043915, 397935448, 398847504, 399771881, 400701180, 401630669, 402559700, 403488655, 404415894, 405337029, 406245918, 407137756, 408011627, 408871040, 409721756, 410569000, 411414833, 412257156, 413091240, 413910637, 414709892, 415486259, 416241074, 416980247, 417714081, 418453064, 419202843, 419960213, 420712929, 421444969, 422145233, 422815285, 423470078, 424131660, 424818573, 425537033, 426278343, 427025604, 427763100, 428483734, 429192085, 429898338, 430612221, 431337013, 432066460, 432787628, 433483086, 434135971, 434733772, 435272026, 435755386, 436195984, 436608734, 437003860, 437382851, 437738571, 438059387, 438337440, 438572617, 438772125, 438946381]
3335D38946381J55639J36414J09367P0915K2011l2692q6364j32523j65672j83030j86042
3346D38654404j81885j80817j93290k25602k76184l35426l90816m31328m53262m61426
3356D35524368m65927m75845m94003n15862n31082n31960n17082m94041m76456m75464
3366D30546646m95109n29366n66292n94253o08254o09894o04591n97763n90324n80521
3376D24770279n66521n48744n31006n17196n08614n02548m92897m73442m42200m02756
3386D19784355l63960l37143l31307l48358l81431m16489m36897m30908l97492l47214
3396D15993156k98729k70843k73972l06167l53203l93982m10118l92761l45612k84920
3406D12662849k31018k01492k02293k25640k54478k71149k65312k40021k07634j81694
$$ y = [438946381, 439102020, 439238434, 439347801, 439418716, 439440727, 439408035, 439321671, 439189148, 439023476, 438840446, 438654404, 438472519, 438291702, 438098412, 437872810, 437596626, 437261200, 436870384, 436439056, 435985794, 435524368, 435058441, 434582596, 434088593, 433572731, 433041649, 432509689, 431992607, 431498566, 431022110, 430546646, 430051537, 429522171, 428955879, 428361626, 427753372, 427143478, 426538887, 425941124, 425350800, 424770279, 424203758, 423655014, 423124008, 422606812, 422098198, 421595650, 421102753, 420629311, 420187111, 419784355, 419420395, 419083252, 418751945, 418403587, 418022156, 417605667, 417168770, 416737862, 416340370, 415993156, 415694427, 415423584, 415149612, 414843445, 414490242, 414096260, 413686142, 413293381, 412947769, 412662849, 412431831, 412230339, 412028046, 411802406, 411547928, 411276779, 411011467, 410771446, 410563812, 410382118]
3416D10382118j70364j70326j70365j58539j27945q0871k6474K2926N6725P0648O7711
3427D09695244N7869N3901O6872R8915J42021J80359J98784J92871J71700J54838J58806
3438D11172180J87264K27089K55050K54212K25639J89934J77307K10113K88735L92342
3448D13579865M88700N51911N73425N64385N45082N32035N29519N31349N28183N18036
3458D18942490N08155N11895N37872N84183O37817O80885P01027O95000O68716O33049
3468D25101089N99137N75600N69343N84450O18896O62880O97785P06634O81992O34002
3478D31431808N86358N63392N74990O11534O51245O75430O82716O86760P04880P40585
3488D37909698P79725P99675P89032P59124P37992P49931P93915Q39729Q44307P82356
$$ y = [410382118, 410211754, 410041428, 409871063, 409712524, 409584579, 409503708, 409477234, 409500160, 409556885, 409627533, 409695244, 409753113, 409807014, 409873886, 409972801, 410114822, 410295181, 410493965, 410686836, 410858536, 411013374, 411172180, 411359444, 411586533, 411841583, 412095795, 412321434, 412511368, 412688675, 412898788, 413187523, 413579865, 414068565, 414620476, 415193901, 415758286, 416303368, 416835403, 417364922, 417896271, 418424454, 418942490, 419450645, 419962540, 420500412, 421084595, 421722412, 422403297, 423104324, 423799324, 424468040, 425101089, 425700226, 426275826, 426845169, 427429619, 428048515, 428711395, 429409180, 430115814, 430797806, 431431808, 432018166, 432581558, 433156548, 433768082, 434419327, 435094757, 435777473, 436464233, 437169113, 437909698, 438689423, 439489098, 440278130, 441037254, 441775246, 442525177, 443319092, 444158821, 445003128, 445785484]
3498D45785484O66962N45654M75235M87137N68276O71119P41997P55005P23457O89316
3508D52109642O94542P54280Q50830R47380J008949J022492R96704R52263R06029Q63037
3518D61106148Q18519P66602P06749O46667N97535N71060N77049O23131P12814Q39462
3528D67965736R82209J106071J173134J162300J085320R88006R31359R57565J062088
3537D77413788J187134J246872J174774R65538O87065M51698L59688M43687O52848
3546D84583092Q82110J033135J070366J032829J000519J034736J137429J258583J342354
3555D94375153J375274J392823J437072J494599J471901J242141P44057O5079n57709
3564E03040390q39233o00777J17607J064987J900635K362785K380753K074127J655960
$$ y = [445785484, 446452446, 446998100, 447473335, 447960472, 448528748, 449199867, 449941864, 450696869, 451420326, 452109642, 452804184, 453558464, 454409294, 455356674, 456365623, 457388115, 458384819, 459337082, 460243111, 461106148, 461924667, 462691269, 463398018, 464044685, 464642220, 465213280, 465790329, 466413460, 467126274, 467965736, 468947945, 470054016, 471227150, 472389450, 473474770, 474462776, 475394135, 476351700, 477413788, 478600922, 479847794, 481022568, 481988106, 482675171, 483126869, 483486557, 483930244, 484583092, 485465202, 486498337, 487568703, 488601532, 489602051, 490636787, 491774216, 493032799, 494375153, 495750427, 497143250, 498580322, 500074921, 501546822, 502788963, 503533020, 503598099, 503040390, 502201157, 501600380, 501717987, 502782974, 504683609, 507046394, 509427147, 511501274, 513157234]
3573E13157234J315155J149101J169892J343613J615715J900291K064629J956977J487389
3582E27159996P19566j05934o57501o78368j37748P39135J581498K068176K083168
3591E32771988J744995J303101R83352Q81882R62944J137238J340370J557464J781464
3600E44464798J961632J995392J782112J302833O64139O9695k68517k24800J84593
3609E51931877Q14400J443291J845550J856575J429939O79894j12381n65033l44582
3618E58979530O44532K130012L506050M066353L350487J427307j064835l171997m066238
3627E65801201l439675j631927N69725K340546L197364L145218K553749J881409J443443
3636E75861053J338807J517944J876488K278328K513542K291755J353570l24402k375450
$$ y = [513157234, 514472389, 515621490, 516791382, 518134995, 519750710, 521651001, 523715630, 525672607, 527159996, 527879562, 527773628, 527116127, 526437759, 526300011, 527039146, 528620644, 530688820, 532771988, 534516983, 535820084, 536803436, 537685318, 538648262, 539785500, 541125870, 542683334, 544464798, 546426430, 548421822, 550203934, 551506767, 552170906, 552240601, 551972084, 551747284, 551931877, 552746277, 554189568, 556035118, 557891693, 559321632, 560001526, 559889145, 559324112, 558979530, 559624062, 561754074, 565260124, 569326477, 572676964, 574104271, 573039436, 569867439, 565801201, 562361526, 560729599, 561299324, 563639870, 566837234, 569982452, 572536201, 574417610, 575861053, 577199860, 578717804, 580594292, 582872620, 585386162, 587677917, 589031487, 588707085, 586331635]
3645E86331635m099961m770050m026375k123642J61820J926307K604905K224922J306610
3654E79536171N06096K46277N60493J197510J851501K331200K569122K528267K143860
3663E93470497J372833L06473p86590j571503j854858j736031j559105j672783k158852
3672E83810081k734260k906151k288551q58422J016694K783432L984527M428063M159278
3681E91394691L313332J999893L19329j527253l162193m109764m008255k830315r46312
3690E80443153J023255K486648L120919K944908K214088J244927K88925m79126r14765
3699E92372932q85238l34740O09474J589623K115555J788597N41572j260452k939644
3708E93597679l801765l460884k017479k060J878776L051300L281861K701034J664658
$$ y = [586331635, 582231674, 577461624, 573435249, 571311607, 571473427, 573399734, 576004639, 578229561, 579536171, 580042267, 580288544, 580849037, 582046547, 583898048, 586229248, 588798370, 591326637, 593470497, 594843330, 595149803, 594363213, 592791710, 590936852, 589200821, 587641716, 585968933, 583810081, 581075821, 578169670, 575881119, 575022697, 576039391, 578822823, 582807350, 587235413, 591394691, 594708023, 596707916, 597027245, 595499992, 592337799, 588228035, 584219780, 581389465, 580443153, 581466408, 583953056, 587073975, 590018883, 592232971, 593477898, 593766823, 593287697, 592372932, 591487694, 591152954, 591762428, 593352051, 595467606, 597256203, 597797775, 596537323, 593597679, 589795914, 586335030, 584317551, 584315491, 586194267, 589245567, 592527428, 595228462, 596893120]
3717E96893120N61104l31612q84514j076126r30939m93469J58424Q85277J481591J714210
3727E97977066J392708M52690r74464k537270l715782l974877k993660q87031J722145
3736E86461525L874016M675140L749199J482582j120567k941094l339462k487869j224480
3745E89128990n06058p99179j797371k645645k519874j177559Q74519K694702L480492
3754E86733017L024864J782036N36041q1863Q3847P15866J292458J413917R84535J88637
3764E96673355o63338j289482j515503j280822o31714K79274J196136J815109J896782
3773E96479797J386719M68140n04456j166153j311989r81826m13742R9639L67585L83491
3783E94807205K91786K74048M25110O97136R43260J026154R13200O92330M90684L60184
$$ y = [596893120, 597454224, 597122612, 596238098, 595161972, 594231033, 593737564, 593895988, 594781265, 596262856, 597977066, 599369774, 599822464, 598848000, 596310730, 592594948, 588620071, 585626411, 584739380, 586461525, 590335541, 595010681, 598759880, 600242462, 599121895, 596180801, 592841339, 590353470, 589128990, 588622932, 587823753, 586026382, 583380737, 580860863, 579683304, 580557823, 583252525, 586733017, 589757881, 591539917, 592075958, 591994095, 592077942, 592793808, 594086266, 595500183, 596484718, 596673355, 596010017, 594720535, 593205032, 591924210, 591292496, 591571770, 592767906, 594583015, 596479797, 597866516, 598334656, 597830200, 596664047, 595352058, 594370232, 593956490, 594056129, 594423714, 594807205, 595098991, 595373039, 595798149, 596495285, 597438545, 598464699, 599377899, 600070229, 600560913, 600921097]
3793F00921097K18010r8648o88973j465797k155762k450981k212257j581154q94394
3802E89591141m51355k93389j70517K63100J153374K268715L089523L119049K211304
3811F00780945O81915q75778j942291k349663k300263k138481k059860j973991j612130
3820E86210403p83119M24958J647605K451287K592125K152633J466866Q98857O22749
3829E97684364N42145L82309j09024r86557k046509k918281l247223k875901j920852
3838E84504471p02782M35906J321678K023582K743988L582611M326363M441643L332405
3847F06009865P53250k873573o467820q695144q583832o031303j905327K326355N253257
3856E79785728O119156N067749K945252Q13408n56641r57642p02209l38631l13949
$$ y = [600921097, 601139107, 601040459, 600351486, 598885689, 596729927, 594278946, 592066689, 590485535, 589591141, 589139786, 588846397, 588675880, 588938980, 590092354, 592361069, 595450592, 598569641, 600780945, 601462860, 600587082, 598644791, 596295128, 593994865, 591856384, 589796524, 587822533, 586210403, 585427284, 585852242, 587499847, 589951134, 592543259, 594695892, 596162758, 597061615, 597684364, 598226509, 598608818, 598499794, 597513237, 595466728, 592548447, 589301224, 586425323, 584504471, 583801689, 584237595, 585559273, 587582855, 590326843, 593909454, 598235817, 602677460, 606009865, 606763115, 603889542, 597421722, 588726578, 580142746, 574111443, 572206116, 574532471, 579785728, 585904884, 590972633, 593917885, 594731293, 594174652, 593217010, 592514801, 592176170, 591862221]
3865E91862221p50962j430091j948204j952591j328087k51465R02634J743240K037659
3874E88884354J789322J191902M99458j00212n36690q22372r77745r88274q27026n16854
3884E87595863j66397O7177Q0757q3732k32888j28250L51982J101647J802978K076531
3894E92465668J679382O37245p60727k094574k991981l256073k893601k058601r67178
3903E79759560J66702J159820J870957K214203K176666J821632J264420O26945K137
3912E91063042n48821r73625j208801j195641r26170m83284k5902K84424L77006L10440
3922E86672668K24457K30408L23372L83873K75116l4561m22669o73523o16913k41203
3932E86121025K93808P50465R45054Q32328M98810R3994k47039m45366m81873l87115
$$ y = [591862221, 591111259, 589681168, 587732964, 585780373, 584452286, 584200821, 585103455, 586846695, 588884354, 590673676, 591865578, 592365036, 592264824, 591728134, 590905762, 589928017, 588939743, 588112717, 587595863, 587429466, 587496643, 587577400, 587493668, 587260780, 587132530, 587484512, 588586159, 590389137, 592465668, 594145050, 594782295, 594021568, 591926994, 588935013, 585678940, 582785339, 580726738, 579759560, 579926262, 581086082, 582957039, 585171242, 587347908, 589169540, 590433960, 591060905, 591063042, 590514221, 589540596, 588331795, 587136154, 586209984, 585726700, 585700798, 585985222, 586362228, 586672668, 586897125, 587127533, 587450905, 587834778, 588109894, 588075333, 587652664, 586979141, 586362228, 586121025, 586414833, 587165298, 588110352, 588942680, 589441490, 589535484, 589288445, 588843079, 588361206, 587974091]
3942E87974091k31743j06736q6402j81046l17802l79563k85377n7068J86043L09791
3952E86824188K62337J06773l6621r2697q5297r7084j76544k77176k97622j83564K404
3963E85949097J17721O2142j28823l07731l47405k60772j90506k69242m72717o21643
3973E83530121n42259k52533J4228O87l29208p19414q30498n65223k06070j93215p00798
3984E79205818j392631j656876j184692l98598k46544j379929l353462m661751l904953
3993E61026382j430931j64909m623146j8272247m0710907o6603585q7437172
4000C41783485
$$ y = [587974091, 587742348, 587635612, 587549210, 587368164, 587050362, 586670799, 586385422, 586328354, 586514397, 586824188, 587086525, 587193298, 587156677, 587063980, 586978683, 586881599, 586705055, 586427879, 586130257, 585946693, 585949097, 586066818, 586128960, 586000137, 585692406, 585345001, 585084229, 584893723, 584624481, 584151764, 583530121, 582987862, 582735329, 582749557, 582750244, 582421036, 581701622, 580871124, 580305901, 580099831, 579906616, 579205818, 577813187, 576156311, 574971619, 574573021, 574326477, 572946548, 569593086, 564931335, 561026382, 559595451, 559430542, 554807396, 536535149, 495824242, 429220657, 341783485]
##END=$$ End of the data block
