##TITLE=$$ Begin of the data block
##JCAMP-DX=5.00 $$ ACD/SpecManager v 10.08
##SPECTROMETER/DATA SYSTEM=16PC
##DATE=25 Jun 2013 14:20:12
##DATA TYPE=INFRARED SPECTRUM
##DATA CLASS=XYDATA
##ORIGIN=
##OWNER=
##NPOINTS=3601
##FIRSTX=400.00000000
##LASTX=4000.00000000
##MAXX=4000.00000000
##MINX=400.00000000
##MAXY=39.82535553
##MINY=8.34980583
##XFACTOR=1.0000000000
##YFACTOR=0.000000100000000
##FIRSTY=20.99631500
##DELTAX=1.00000000
##XUNITS=1/CM
##YUNITS=TRANSMITTANCE
##XYDATA=(X++(Y..Y))
$$ plain form
400 209963150 266993866 311512432 339464531 352154694 354548874 352448158 350198135 349897079
408 349897079 351929054 355916061 361260757 367107697 372155151 374837189 373978691 369525948 362799911
417 362799911 356021423 351353149 349999962 351830559 355624886 359703293 362573814 363346519 361862640
426 361862640 358615227 354548187 350783997 348313484 347715416 349001923 351654091 354835701 357684669
435 357684669 359557724 360142174 359429665 357613258 354986191 351892662 348724213 345912933 343865089
444 343865089 342820320 342691422 342994919 342962189 341836281 339231834 335367928 331031761 327272644
453 327272644 324983368 324583359 325941925 328526993 331649628 334665909 337083626 338610611 339194527
462 339194527 339051704 338625336 338430519 338831825 339879608 341323776 342808304 344125023 345352554
$$ packed form
400B09963150N7030716M4518566K7952099J2690163K394180k100716k250023l01056
408C49897079K031975L987007N344696N846940N047454K682038q58498m452743o726037
417C62799911o778488m668274j353187J830597L794327M078407K870521P72705j483879
426C61862640l247413m067040l764190k470513n98068J286507K652168L181610K848968
435C57684669J873055N84450p12509j816407k627067l093529l168449k811280k047844
444C43865089j044769j28898L03497l2730j125908k604447l863906m336167l759117
453C27272644k289276m00009J358566K585068L122635L016281K417717J526985N83916
462C39194527j42823m26368j94817M01306J047783J444168J484528J316719J227531
$$ plain form
471 345352554 346792145 348758736 351384239 354563179 358049736 361600685 365044441 368241577 371009827
480 371009827 373109436 374316483 374511414 373677483 371778221 368608704 363780212 356933937 348117638
489 348117638 338107872 328442001 321057396 317655468 319068336 324923515 333761177 343546410 352351418
498 352351418 358931465 362992020 365089645 366251640 367490273 369398956 371968269 374664307 376713524
507 376713524 377466621 376691666 374683762 372160988 369996605 368902054 369180679 370637283 372664375
516 372664375 374464149 375319214 374818497 372961922 370119553 366875687 363832130 361452141 359996834
525 359996834 359547119 360063972 361430855 363455849 365858955 368289299 370399055 371948700 372884521
534 372884521 373334846 373522148 373643265 373791771 373959999 374100838 374188766 374229012 374216652 374095306 373770180
$$ packed form
471C45352554J439591J966591K625503L178940L486557L550949L443756L197136K768250
480C71009827K099609J207047J94931q33931j899262l169517m828492o846275q816299
489C48117638j0009766r665871p384605l401928J412868N855179Q837662R785233Q805008
498C52351418O580047M060555K097625J161995J238633J908683K569313K696038K049217
507C76713524P53097p74955k007904k522774k164383j094551K78625J456604K027092
516C72664375J799774Q55065n00717j856575k842369l243866l043557k379989j455307
525C59996834m49715N16853J366883K024994K403106K430344K109756J549645R35821
534C72884521M50325J87302J21117J48506J68228J40839Q7928M0246j2360j21346l25126
$$ plain form
545 373770180 373185883 372418327 371702766 371351852 371591263 372403412 373478737 374321327 374462891 373683205
555 373683205 372119789 370217285 368543015 367563858 367485352 368211594 369417992 370678902 371587143
564 371587143 371833153 371248474 369834747 367782745 365455055 363301392 361705322 360818138 360473213
573 360473213 360249062 359675102 358479843 356745529 354877777 353407402 352739372 352991562 353999062
582 353999062 355456314 357085266 358725700 360308990 361768532 362971802 363734589 363904724 363454323
591 363454323 362513428 361323586 360143166 359154358 358413811 357847824 357278481 356460800 355134659 353098335
601 353098335 350300865 346923065 343400841 340356865 338443794 338148994 339637032 342692490 346786461
610 346786461 351237602 355404053 358837395 361356277 363030930 364105721 364897156 365701828 366728745
$$ packed form
545C73770180n84297p67556p15561l50914K39411Q12149J075325Q42590J41564p79686
555C73683205j563416j902504j674270r79157p8506P26242J206398J260910R08241
564C71587143K46010n84679j413727k052002k327690k153663j596070q87184l44925
573C60473213k24151n73960j195259j734314j867752j470375o68030K52190J007500
582C53999062J457252J628952J640434J583290J459542J203270P62787J70135m50401
591C63454323r40895j189842j180420r88808p40547n65987n69343q17681j326141k036324
601C53098335k797470l377800l522224l043976j913071k94800J488038L055458M093971
610C46786461M451141M166451L433342K518882J674653J074791P91435Q04672J026917
$$ plain form
619 366728745 368056946 369614906 371184120 372443275 373060455 372823143 371759529 370188103 368647804
628 368647804 367715683 367783394 368898277 370748291 372797775 374497910 375465622 375554848 374821053 373438339
638 373438339 371633987 369662514 367790642 366255760 365195694 364595833 364301414 364102249 363837738
647 363837738 363449516 362953453 362370529 361691742 360912285 360099945 359413605 359028130 359008331 359242363
657 359242363 359511070 359654694 359699478 359811592 360085335 360328941 360058708 358779030 356396179 353470421
667 353470421 351071243 350257683 351478844 354270134 357452240 359718018 360255814 359053040 356753044
676 356753044 354218140 352102127 350661469 349833221 349434128 349305534 349336319 349419174 349442787 349359169
686 349359169 349270439 349442596 350200806 351755791 354067268 356829185 359581108 361877403 363424835
$$ packed form
619C66728745J328201J557960J569214J259155O17180k37312j063614j571426j540299
628C68647804r32121O7711J114883J850014K049484J700135R67712Q9226p33795j382714
638C73438339j804352j971473j871872j534882j060066n99861k94419j99165k64511
647C63837738l88222m96063n82924o78787p79457q12340o86340l85475j9799K34032
657C59242363K68707J43624M4784J12114K73743K43606k70233j279678k382851k925758
667C53470421k399178q13560J221161K791290L182106K265778N37796j202774k299996
676C56753044k534904k116013j440658q28248l99093j28594L0785Q2855K3613q3618
686C49359169q8730J72157P58210J554985K311477K761917K751923K296295J547432
$$ plain form
695 363424835 364138908 364120712 363591919 362820625 362052803 361458130 361096268 360921745 360827446 360709686
705 360709686 360520630 360280037 360047684 359882584 359820786 359881821 360087814 360465393 361020584 361702499
715 361702499 362390327 362925072 363176689 363105583 362779045 362327652 361873932 361479454 361148376 360878296
725 360878296 360714607 360756912 361097984 361729355 362478676 363034325 363059235 362342262 360904121 359002151
735 359002151 357032776 355383034 354303589 353846588 353874626 354111023 354203377 353788643 352562294 350353775
745 350353775 347187691 343301392 339097137 335036240 331511841 328749161 326763725 325382271 324306717
754 324306717 323198204 321761284 319817734 317353630 314520645 311578407 308787193 306289310 304033890
763 304033890 301787014 299231091 296110516 292356586 288129158 283752747 279573708 275799313 272390728
$$ packed form
695C63424835P14073j8196n28793p71294p67822n94673l61862j74523r4299j17760
705C60709686j89056k40593k32353j65100o1798O1035K05993L77579N55191O81915
715C61702499O87828N34745K51617p1106l26538m51393m53720l94478l31078k70080
725C60878296j63689M2305L41072O31371P49321N55649K4910p16973j438141j901970
735C59002151j969375j649742j079445m57001K8038K36397R2354m14734j226349k208519
745C50353775l166084l886299m204255m060897l524399k762680j985436j381454j075554
754C24306717j108513j436920j943550k464104k832985k942238k791214k497883k255420
763C04033890k246876k555923l120575l753930m227428m376411m179039l774395l408585
$$ plain form
772 272390728 269055634 265346680 260829334 255256233 248685913 241507015 234365578 228022060 223184090
781 223184090 220355968 219737968 221192245 224282551 228382263 232828503 237082500 240846844 244099503
790 244099503 247033348 249929237 253018246 256388607 259971237 263594666 267073441 270284081 273195171
799 273195171 275847759 278302498 280588951 282684479 284537449 286122341 287497997 288830109 290358143
808 290358143 292313004 294823360 297859955 301245708 304729881 308083591 311169987 313959541 316497097
817 316497097 318852329 321086159 323244247 325364799 327480125 329603462 331709938 333731461 335573730
826 335573730 337148972 338402252 339319534 339915619 340220032 340271111 340121574 339842529 339514084 339203873
836 339203873 338949242 338759842 338644791 338645821 338852997 339385147 340344162 341768608 343615799 345779572
$$ packed form
772B72390728l335094l708954m517346n573101o570320p178898p141437o343518m837970
781B23184090k828122o18000J454277L090306M099712M446240M253997L764344L252659
790B44099503K933845K895889L089009L370361L582630L623429L478775L210640K911090
799B73195171K652588K454739K286453K095528J852970J584892J375656J332112J528034
808B90358143J954861K510356L036595L385753L484173L353710L086396K789554K537556
817C16497097K355232K233830K158088K120552K115326K123337K106476K021523J842269
826C35573730J575242J253280R17282N96085L04413N1079j49537k79045l28445l10211
836C39203873k54631j89400j15051J030K07176N32150R59015J424446J847191K163773
$$ plain form
846 345779572 348131142 350555725 352963753 355279045 357420158 359295273 360816650 361924057 362595711
855 362595711 362835579 362644234 361995354 360844841 359179306 357087326 354814682 352762299 351409111
864 351409111 351175308 352277832 354639091 357895393 361506653 364924660 367748718 369806595 371138458
873 371138458 371908836 372305794 372480431 372546768 372621422 372856216 373429146 374490013 376091766 378148422
883 378148422 380447922 382713089 384683456 386184654 387163963 387693100 387944298 388147621 388532104
892 388532104 389258423 390359268 391716232 393091812 394213982 394880600 395036316 394785118 394335861
901 394335861 393911133 393667297 393658562 393851471 394166946 394521828 394849892 395106316 395265503 395323906 395305328
912 395305328 395260506 395254593 395345345 395563698 395906181 396340675 396816025 397268028 397619972 397789078 397707596
$$ packed form
846C45779572K351570K424583K408028K315292K141113J875115J521377J107407O71654
855C62595711K39868j91345o48880j150513j665535k091980k272644k052383j353188
864C51409111k33803J102524K361259L256302L611260L418007K824058K057877J331863
873C71138458P70378L96958J74637O6337P4654K34794N72930J060867J601753K056656
883C78148422K299500K265167J970367J501198R79309N29137K51198K03323L84483
892C88532104P26319J100845J356964J375580J122170O66618J55716k51198m49257
901C94335861m24728k43836q735J92909L15475L54882L28064K56424J59187N8403j8578
912C95305328m4822n913R0752K18353L42483M34494M75350M52003L51944J69106q1482
$$ plain form
923 397707596 397359352 396812935 396227455 395811615 395744934 396094704 396769142 397537842 398112755 398253555
933 398253555 397851601 396955681 395738525 394427185 393233604 392307625 391718025 391450462 391412544 391445122
943 391445122 391347237 390919456 390019264 388609467 386779289 384727821 382717705 381015244 379835777
952 379835777 379304352 379434357 380126839 381193047 382403030 383550453 384515648 385297356 385997963 386766663
962 386766663 387725677 388915710 390279274 391683388 392962761 393962059 394567871 394731369 394484749
971 394484749 393948059 393313103 392798615 392582436 392739525 393212738 393834038 394383163 394657402 394522820
981 394522820 393937302 392951012 391696281 390369072 389194450 388368874 387990150 388006859 388217888 388335533
991 388335533 388087616 387309761 385984802 384216042 382160645 379965324 377734947 375534554 373398437
$$ packed form
923C97707596l48244n46417n85480m15840o6681L49770O74438P68700N74913J40800
933C98253555m01954q95920j217156j311340j193581r25979n89600k67563l7918L2578
943C91445122r7885m27781r00192j409797j830178k051468k010116j702461j179467
952C79835777n31425J30005O92482J066208J209983J147423R65195P81708P00607P68700
962C86766663R59014J190033J363564J404114J279373R99298O05812J63498k46620
971C94484749n36690o34956n14488k16179J57089M73213O21300N49125K74239j34582
981C94522820n85518r86290j254731j327209j174622q25576l78724J6709K11029J17645
991C88335533k47917p77855j324959j768760k055397k195321k230377k200393k136117
$$ plain form
1000 373398437 371320572 369219437 366901970 364061928 360341721 355455437 349342804 342300377 335031013
1009 335031013 328565979 324052200 322442780 324184036 329017792 335995522 343727608 350791969 356147537
1018 356147537 359390335 360760536 360923729 360646362 360518570 360824013 361569138 362604866 363750076
1027 363750076 364861565 365846481 366651993 367264175 367720032 368112907 368568230 369190216 370005836 370940208
1037 370940208 371839981 372533798 372895927 372882385 372529526 371927261 371190605 370442772 369808235 369398499
1047 369398499 369284515 369460907 369826469 370200424 370377159 370197868 369604073 368646545 367449799 366153412
1057 366153412 364861755 363620949 362420540 361204453 359879684 358320618 356381607 353923645 350849953
1066 350849953 347132416 342809792 337955780 332628441 326824684 320456467 313354130 305294838 296050358
$$ packed form
1000C73398437k077865k101135k317467k840042l720207m886284o112633p042427p269364
1009C35031013o465034m513779j609420J741256M833756O977730P732086P064361N355568
1018C56147537L242798J370201J63193k77367j27792L05443P45125J035728J145210
1027C63750076J111489R84916Q05512O12182M55857L92875M55323O21986Q15620R34372
1037C70940208Q99773O93817L62129j3542l52859o02265p36656p47833o34537m09736
1047C69398499j13984J76392L65562L73955J76735j79291n93795r57528j196746j296387
1057C66153412j291657j240806j200409j216087j324769j559066j939011k457962l073692
1066C50849953l717537m322624m854012n327339n803757o368217p102337q059292r244480
$$ plain form
1075 296050358 285448761 273440704 260149536 245883083 231096821 216320190 202080345 188853626
1083 188853626 177051449 167016506 158996744 153091211 149199743 147028580 146179466 146291313 147155466
1092 147155466 148733149 151064892 154142866 157849503 162022629 166606827 171777115 177918091 185435638
1101 185435638 194496346 204853840 215881824 226808510 237026978 246308136 254808769 262888260
1109 262888260 270855389 278787498 286505508 293690796 300057373 305485172 310060978 314032955 317719002
1118 317719002 321415291 325331764 329561958 334082298 338772049 343448639 347907410 351961212 355471077
1127 355471077 358366776 360655556 362417412 363783951 364901505 365886917 366791801 367590103 368196793
1136 368196793 368506966 368438644 367960472 367097702 365922165 364538422 363073273 361667595 360465546
$$ packed form
1075B96050358j0601597j2008057j3291168j4266453j4786262j4776631j4239845j3226719
1083A88853626j1802177j0034943q019762n905533l891468k171163q49114J11847Q64153
1092A47155466J577683K331743L077974L706637M173126M584198N170288O140976P517547
1101A85435638R060708J0357494J1027984J0926686J0218468R281158Q500633Q079491
1109B62888260P967129P932109P718010P185288O366577N427799M575806L971977L686047
1118C17719002L696289L916473M230194M520340M689751M676590M458771M053802L509865
1127C55471077K895699K288780J761856J366539J117554R85412R04884P98302O06690
1136C68196793L10173o8322m78172q62770j175537j383743j465149j405678j202049
$$ plain form
1145 360465546 359594688 359140129 359121780 359487610 360126648 360900497 361680603 362377129 362948151 363387260
1155 363387260 363696671 363859787 363823280 363494148 362747879 361440430 359423790 356572609 352828522
1164 352828522 348262596 343133507 337908096 333212738 329709396 327926521 328099976 330084152 333366508
1173 333366508 337184830 340714264 343271332 344483795 344379501 343366508 342100716 341272926 341383667
1182 341383667 342589226 344682274 347213516 349695587 351791039 353397064 354600906 355549889 356321602
1191 356321602 356865387 357035141 356673317 355684433 354053421 351811829 348987312 345578499 341568375
1200 341568375 336958351 331789322 326128273 320024948 313467827 306367264 298575077 289927673 280286274
1209 280286274 269556770 257687664 244664135 230519142 215370140 199475498 183282471 167437172
$$ packed form
1145C60465546q70858m54559j8349L65830O39038P73849P80106O96526N71022M39109
1155C63387260L09411J63116l6507l29132p46269j307449k016640k851181l744087
1164C52828522m565926n129089n225411m695358l503342j782875J73455J984176L282356
1173C33366508L818322L529434K557068J212463j04294j012993j265792q27790J10741
1182C41383667J205559K093048K531242K482071K095452J606025J203842R48983P71713
1191C56321602N43785J69754l61824r88884j631012k241592k824517l408813m010124
1200C41568375m610024n169029n661049o103325o557121p100563p792187q647404r641399
1209B80286274j0729504j1869106j3023529j4144993j5149002j5894642j6193027j5845299
$$ plain form
1217 167437172 152732954 139992294 129903650 122856827 118834295 117407942 117861691 119415045
1225 119415045 121476460 123834467 126708984 130638170 136242352 143960123 153862066 165608101
1233 165608101 178553486 191944027 205114346 217616024 229246807 239998684 249969501 259283314
1241 259283314 268043633 276318321 284141693 291518707 298426628 304817028 310623875 315778294 320223312
1250 320223312 323921051 326848679 328986397 330307961 330782356 330387993 329136581 327097588 324416046
1259 324416046 321320114 318115044 315156708 312799416 311321030 310842762 311274948 312322521 313558350
1268 313558350 314544258 314948120 314606209 313505745 311705971 309245644 306087017 302119770 297212696
1277 297212696 291279812 284330654 276490879 267998524 259184742 250442276 242180576 234770718 228492527
$$ packed form
1217A67437172j4704218j2740660j0088644p046823m022532j426353M53749J553354
1225A19415045K061415K358007K874517L929186N604182P717771R901943J1746035
1233A65608101J2945385J3390541J3170319J2501678J1630783J0751877R970817R313813
1241B59283314Q760319Q274688P823372P377014O907921O390400N806847N154419M445018
1250C20223312L697739K927628K137718J321564M74395l94363j251412k038993k681542
1259C24416046l095932l205070k958336k357292j478386m78268M32186J047573J235829
1268C13558350R85908M03862l41911j100464j799774k460327l158627l967247m907074
1277B97212696n932884o949158p839775q492355q813782q742466q261700p409858o278191
$$ plain form
1286 228492527 223505135 219853973 217511997 216435757 216612244 218079147 220913792 225193806 230937290
1295 230937290 238034801 246193810 254926777 263608208 271602020 278421249 283853207 287985935 291115646
1304 291115646 293577404 295583000 297147942 298137150 298391228 297850952 296604538 294835300 292707977
1313 292707977 290270882 287438164 284068336 280100079 275675468 271188831 267236881 264490223 263535366
1322 263535366 264740257 268179417 273632450 280645733 288635788 297005005 305241566 312980709 320018463
1331 320018463 326283379 331787987 336584778 340743942 344351768 347516785 350362892 353001862 355494003
1340 355494003 357819290 359880562 361545906 362712784 363364525 363589325 363550301 363422012 363326569 363300133
1350 363300133 363303680 363263092 363108063 362782974 362222519 361310005 359847450 357560997 354149399 349369545
$$ packed form
1286B28492527m987392l651162k341976j076240J76487J466903K834645M280014N743484
1295B30937290P097511Q159009Q732967Q681431P993812O819229N431958M132728L129711
1304B91115646K461758K005596J564942R89208K54078n40276j246414j769238k127323
1313B92707977k437095k832718l369828l968257m424611m486637l951950k746658r54857
1322B63535366J204891L439160N453033P013283P990055Q369217Q236561P739143P037754
1331C20018463O264916N504608M796791M159164L607826L165017K846107K638970K492141
1340C55494003K325287K061272J665344J166878O51741K24800l9024j28289r5443k6436
1350C63300133L547m0588j55029l25089n60455r12514j462555k286453l411598m779854
$$ plain form
1360 349369545 343142090 335655899 327434883 319324493 312357845 307505341 305375214 305988159 308744278
1369 308744278 312622852 316533527 319652939 321589737 322326317 322023125 320841599 318899460 316352940
1378 316352940 313495502 310755024 308559513 307159805 306536922 306465702 306686325 307058544 307593021
1387 307593021 308353252 309320679 310332718 311140079 311537266 311471558 311064262 310543213 310137768 309991131
1397 309991131 310115337 310388775 310590115 310469494 309844360 308681908 307116318 305375900 303655071
1406 303655071 302016506 300392914 298685818 296877365 295053444 293307400 291597233 289682446 287220421
1415 287220421 283983593 280059776 275897560 272155819 269438114 268059864 267958202 268764725 269981003
1424 269981003 271168575 272088413 272755184 273392544 274296494 275649471 277371578 279105663 280374565
$$ packed form
1360C49369545o227455p486191q221016q110390o966648m852504k130127O12945K756119
1369C08744278L878574L910675L119412J936798P36580l03192j181526j942139k546520
1378C16352940k857438k740478k195511j399708o22883p1220K20623L72219N34477
1387C07593021P60231R67427J012039Q07361L97187o5708m07296n21049m05445j46637
1397C09991131J24206K73438K01340j20621o25134j162452j565590j740418j720829
1406C03655071j638565j623592j707096j808453j823921j746044j710167j914787k462025
1415B87220421l236828l923817m162216l741741k717705j378250j01662Q06523J216278
1424B69981003J187572R19838O66771O37360R03950J352977J722107J734085J268902
$$ plain form
1433 280374565 280841408 280519199 279785328 279176903 279090290 279574947 280347042 280989914 281186867 280831814
1443 280831814 279981270 278742447 277223644 275582008 274078217 273008156 272480202 272173157 271294250
1452 271294250 268867912 264259472 257637405 250061150 243085709 238078499 235636177 235436249 236590424
1461 236590424 238255844 240117416 242460384 245828953 250525379 256281605 262300835 267619648 271555443
1470 271555443 273977776 275273571 276064110 276858883 277831516 278811188 279450417 279450569 278714848 277353668
1480 277353668 275553875 273397655 270748539 267296333 262771606 257239723 251318436 246170998 243221264
1489 243221264 243678188 248068123 255995483 266261425 277311077 287821789 297167835 305539131
1497 305539131 313644848 322136726 331047096 339563065 346306839 350023537 350320816 348029594 344934387
$$ packed form
1433B80374565M66843l22209p33871o08425q6613M84657P72095O42872J96953l55053
1443B80831814q50544j238823j518803j641636j503791j070061n27954l07045q78907
1452B71294250k426338m608440o622067p576255o975441n007210k442322j99928J154175
1461B36590424J665420J861572K342968L368569M696426N756226O019230N318813L935795
1470B71555443K422333J295795P90539P94773R72633R79672O39229J52p35721j361180
1480B77353668j799793k156220k649116l452206m524727n531883n921287n147438k949734
1489B43221264M56924M389935P927360J0265942J1049652J0510712R346046Q371296
1497C05539131Q105717Q491878Q910370Q515969O743774L716698K97279k291222l095207
$$ plain form
1506 344934387 342978821 343376732 346129303 350207253 354246025 357294807 359169044 360259171 361030006
1515 361030006 361616287 361791077 361258354 359983330 358288345 356668854 355519485 355000801 355109711
1524 355109711 355819626 357105751 358824501 360603943 361938667 362503624 362459183 362450905 363202324 364934158
1534 364934158 367037239 368292732 367559090 364492912 359827766 355030670 351567879 350241928 350960503
1543 350960503 352976685 355359993 357396202 358767014 359540482 360072479 360854988 362286758 364383659
1552 364383659 366568756 367747040 366753273 363010521 357025414 350369797 345073090 342715912 343711815
1561 343711815 347162819 351342773 354515343 355651436 354714317 352447128 349843826 347601433 345814590
1570 345814590 344034767 341641273 338326721 334432983 330930252 329007835 329473953 332292900 336545486
$$ packed form
1506C44934387j955566L97911K752571M077950M038772L048782J874237J090127P70835
1515C61030006N86281J74790n32723j275024j694985j619491j149369n18684J08910
1524C55109711P09915J286125J718750J779442J334724N64957m4441q278P51419J731834
1534C64934158K103081J255493p33642l066178m665146m797096l462791j325951P18575
1543C50960503K016182K383308K036209J370812P73468N31997P82509J431770K096901
1552C64383659K185097J178284r93767l742752n985107o655617n296707k357178R95903
1561C43711815L451004M179954L172570J136093r37119k267189k603302k242393j786843
1570C45814590j779823k393494l314552l893738l502731j922417M66118K818947M252586
$$ plain form
1579 336545486 340850868 344014130 345520973 345613213 344955292 344159126 343483620 342855606 342110558 341216927
1589 341216927 340313187 339573174 339057884 338693314 338379440 338106308 337958336 338001213 338165932 338249397
1599 338249397 338039055 337447357 336529427 335367966 333945770 332150688 329937859 327509918 325315323
1608 325315323 323795662 323024902 322522354 321430626 318995075 315042553 310126419 305222893 301170692
1617 301170692 298220921 295971546 293690453 290773888 287038250 282703266 278160496 273738213 269610100
1626 269610100 265831013 262375622 259090252 255600605 251311245 245591717 238089600 228980770 218963299
1635 218963299 208960419 199685822 191322498 183493690 175525990 166842175 157274065 147164488
1643 147164488 137251272 128422604 121454821 116821804 114628611 114689264 116722126 120579243 126380987
$$ packed form
1579C36545486M305382L163262J506843R2240o57921p96166o75506o28014p45048q93631
1589C41216927r03740p40013n15290l64570l13874k73132j47972M2877J64719Q3465
1599C38249397k10342n91698r17930j161461j422196j795082k212829k427941k194595
1608C25315323j519661p70760n02548j091728k435551l952522m916134m903526m052201
1617C01170692k949771k249375k281093k916565l735638m334984m542770m422283m128113
1626B69610100l779087l455391l285370l489647m289360n719528p502117r108830j0017471
1635B18963299j0002880r274597q363324p828808p967700q683815r568110j0109577
1643A47164488r913216q828668o967783m633017k193193O0653K032862L857117N801744
$$ plain form
1652 126380987 134448595 145030327 157957382 172446880 187217293 200903625 212562294 221976566
1660 221976566 229577618 236031055 241751366 246649361 250262070 252155228 252308388 251211662 249610100
1669 249610100 248082066 246754417 245358276 243579121 241435928 239394264 238100128 237900276 238480759
1678 238480759 238898678 238026619 235152149 230370407 224532013 218790188 214023933 210460968 207668095
1687 207668095 204842854 201187077 196155148 189503536 181211185 171390820 160266037 148200254
1695 148200254 135715981 123460541 112119865 102314062 94503593 88914661 85487585 83871269
1703 83871269 83498058 83751984 84183912 84678354 85475378 87019253 89700003 93614054 98459930
1712 98459930 103608065 108297043 111855907 113861637 114189310 112969055 110499287 107170467 103435974
$$ packed form
1652A26380987Q067608J0581732J2927055J4489498J4770413J3686332J1658669R414272
1660B21976566P601052O453437N720311M897995L612709J893158J53160j096726j601562
1669B49610100j528034j327649j396141j779155k143193k041664j294136j99852N80483
1678B38480759M17919q72059k874470m781742n838394n741825m766255l562965k792873
1687B07668095k825241l655777n031929o651612q292351r820365j1124783j2065783
1695A48200254j2484273j2255440j1340676r805803p810469n588932l427076j616316
1703H3871269l73211K53926M31928M94442P97024J543875K680750L914051M845876
1712I8459930N148135M688978L558864K005730L27673j220255k469768l328820l734493
$$ plain form
1721 103435974 99830294 96998777 95684061 96627083 100390701 107178612 116751194 128507614 141714115
1730 141714115 155760689 170302124 185201206 200322704 215328140 229629879 242558632 253651047
1738 253651047 262876186 270646267 277591400 284225502 290695934 296758442 301975365 306013718 308867474
1747 308867474 310891399 312646732 314658813 317216816 320302696 323658333 326934776 329843597 332246971
1756 332246971 334167633 335739441 337139130 338539391 340093307 341934586 344157104 346756020 349552345
1765 349552345 352162933 354079361 354863663 354384766 352958069 351280060 350154915 350142365 351320114
1774 351320114 353291855 355427589 357181396 358301315 358839340 359013748 359061356 359180374 359553680
1783 359553680 360355301 361664352 363326302 364894066 365769043 365516930 364177933 362344017 360906410
$$ packed form
1721A03435974l605680k831517j314716R43022L763618O787911R572582J1756420J3206501
1730A41714115J4046574J4541435J4899082J5121498J5005436J4301739J2928753J1092415
1738B53651047R225139P770081O945133O634102O470432O062508N216923M038353K853756
1747C08867474K023925J755333K012081K558003L085880L355637L276443K908821K403374
1756C32246971J920662J571808J399689J400261J553916J841279K222518K598916K796325
1765C49552345K610588J916428P84302m78897j426697j678009j125145j2550J177749
1774C51320114J971741K135734J753807J119919N38025J74408M7608J19018L73306
1783C59553680Q01621J309051J661950J567764Q74977k52113j338997j833916j437607
$$ plain form
1792 360906410 360594749 361584663 363416786 365276031 366447563 366673012 366212616 365621490 365411720
1801 365411720 365806160 366690598 367736549 368589745 369019699 368987007 368628883 368183861 367885208 367858353
1811 367858353 368073921 368386879 368648033 368814240 368977432 369283791 369804802 370461693 371069412 371464310
1821 371464310 371609535 371586380 371483650 371287460 370885963 370199432 369328003 368572693 368281097 368615341
1831 368615341 369426575 370348969 371058540 371501923 371907463 372558556 373495903 374386902 374684982 373986092
1841 373986092 372336617 370272408 368553848 367766075 368038750 369042587 370233269 371162338 371666451
1850 371666451 371852303 371939163 372087021 372315941 372537537 372648125 372614250 372506676 372471809 372657814
1860 372657814 373122940 373767281 374331017 374483299 373980980 372820435 371289635 369868584 369014282
$$ packed form
1792C60906410l11661R89914J832123J859245J171532K25449m60396n91126k09770
1801C65411720L94440Q84438J045951Q53196M29954l2692l58124m45022k98653k6855
1811C67858353K15568L12958K61154J66207J63192L06359N21011O56891O07719L94898
1821C71464310J45225k3155j02730j96190m01497o86531q71429p55310k91596L34244
1831C68615341Q11234R22394P09571M43383M05540O51093R37347Q90999K98080o98890
1841C73986092j649475k064209j718560p87773K72675J003837J190682R29069N04113
1850C71666451J85852Q6860J47858K28920K21596J10588l3875j07574l4867J86005
1860C72657814M65126O44341N63736J52282n02319j160545j530800j421051q54302
$$ plain form
1869 369014282 368947067 369559021 370497284 371361580 371896172 372065048 371992302 371834908 371686172 371562653
1879 371562653 371451988 371358223 371296272 371247559 371129951 370827789 370271912 369511604 368715553 368087387
1889 368087387 367749596 367673988 367709541 367687111 367527428 367277908 367058220 366959953 366976013 367009125 366946220
1900 366946220 366736946 366417809 366066856 365734138 365410118 365062218 364709473 364467049 364507103 364947319
1910 364947319 365740204 366649208 367346077 367580452 367315521 366744156 366173515 365853920 365860672 366095505
1920 366095505 366389694 366627769 366806450 367000923 367278824 367632675 367977867 368209152 368267746 368172798
1930 368172798 368005867 367865486 367827415 367922745 368134384 368399734 368621597 368693161 368539124 368157806
1940 368157806 367635765 367119980 366755524 366622963 366711082 366936646 367194366 367403831 367528877 367569885
$$ packed form
1869C69014282o7215O11954R38263Q64296N34592J68876p2746j57394j48736j23519
1879C71562653j10665r3765o1951m8713j17608l02162n55877p60308p96051o28166
1889C68087387l37791p5608L5553k2430j59683k49520k19688r8267J6060L3112o2905
1900C66946220k09274l19137l50953l32718l24020l47900l52745k42424M0054M40216
1910C64947319P92885R09004O96869K34375k64931n71365n70641l19595O752K34833
1920C66095505K94189K38075J78681J94473K77901L53851L45192K31285N8594r4948
1930C68172798j66931j40381l8071R5330K11639K65350K21863P1564j54037l81318
1940C68157806n22041n15785l64456j32561Q8119K25564K57720K09465J25046M1008
$$ plain form
1950 367569885 367543449 367467270 367356110 367223587 367084084 366952972 366848259 366792259 366807365 366902962 367057800
1961 367057800 367215691 367304115 367272072 367125816 366934052 366795235 366784973 366914864 367130318 367345619
1971 367345619 367491837 367546234 367530327 367484474 367440376 367409019 367385635 367361794 367335358 367312889 367306404 367326660
1983 367326660 367373390 367424774 367434235 367341690 367102928 366721954 366267090 365852013 365586166 365520744 365622215
1994 365622215 365791435 365916939 365930328 365831680 365673218 365517998 365400963 365316544 365233955 365125465 364986534
2005 364986534 364838753 364715462 364641685 364619637 364624290 364610710 364529495 364347000 364062538 363715401 363375969
2016 363375969 363120193 362998619 363013306 363116150 363231049 363287506 363251724 363136520 362989082 362863846
2026 362863846 362796974 362793579 362832985 362882919 362913399 362903175 362839127 362714653 362532082 362307701 362074547
$$ packed form
1950C67569885k6436p6179j11160j32523j39503j31112j04713n6000J5106R5597J54838
1961C67057800J57891Q8424l2043j46256j91764j38817j0262J29891K15454K15301
1971C67345619J46218N4397j5907m5853m4098l1357k3384k3841k6436k2469o485K0256
1983C67326660M6730N1384R461r2545k38762l80974m54864m15077k65847o5422J01471
1994C65622215J69220J25504J3389r8648j58462j55220j17035q4419q2589j08490j38931
2005C64986534j47781j23291p3777k2048M653j3580q1215j82495k84462l47137l39432
2016C63375969k55776j21574J4687J02844J14899N6457l5782j15204j47438j25236
2026C62863846o6872l395L9406M9934L0480j0224o4048j24474j82571k24381k33154
$$ plain form
2037 362074547 361875801 361749306 361710396 361743698 361809578 361861687 361865578 361809959 361704903 361573868 361444397
2048 361444397 361341171 361282272 361272278 361296654 361320839 361300697 361200867 361013184 360761681 360489731 360237465
2059 360237465 360025215 359854546 359724503 359648361 359652939 359756546 359941330 360140343 360257797 360213013 359986115
2070 359986115 359633446 359265366 358994598 358888817 358949928 359128418 359357948 359586029 359785080 359944000
2080 359944000 360053749 360101776 360078926 359991570 359867630 359748802 359673691 359660835 359703026 359772034 359832306
2091 359832306 359852829 359814987 359715424 359566460 359394417 359236259 359129868 359101486 359152679 359255753 359360924
2102 359360924 359413528 359374237 359231758 359004402 358730049 358453102 358214569 358047142 357973557 358003616 358126335
2113 358126335 358305168 358479691 358582306 358563118 358412170 358166199 357894249 357668343 357535324 357503929
$$ packed form
2037C62074547j98746j26495l8910L3302O5880N2109L891n5619j05056j31035j29471
2048C61444397j03226n8899r994K4376K4185k0142r9830j87683k51503k71950k52266
2059C60237465k12250j70669j30043p6142M578J03607J84784J99013J17454m4784k26898
2070C59986115l52669l68080k70768j05781O1111J78490K29530K28081J99051J58920
2080C59944000J09749M8027k2850q7356j23940j18828p5111j2856M2191O9008O0272
2091C59832306K0523l7842r9563j48964j72043j58158j06391k8382N1193J03074J05171
2102C59360924N2604l9291j42479k27356k74353k76947k38533j67427p3585L0059J22719
2113C58126335J78833J74523J02615j9188j50948k45971k71950k25906j33019l1395
$$ plain form
2123 357503929 357552147 357646103 357757034 357864532 357950211 357988358 357949562 357815132 357596054 357339172 357113533
2134 357113533 356980286 356963120 357036400 357139587 357208595 357206802 357138443 357037811 356944466 356880722 356844063
2145 356844063 356818199 356790161 356762123 356749077 356766129 356815071 356881218 356941566 356977310 356982117 356959076 356913452 356847229
2158 356847229 356761360 356664238 356575203 356517258 356499901 356505089 356488037 356398926 356212997 355951042 355674667
2169 355674667 355458603 355354156 355366707 355458145 355570297 355651817 355673447 355626984 355515327 355345993 355133705
2180 355133705 354906578 354707565 354582634 354562988 354648895 354808769 354991798 355148468 355245934 355272751 355233688
2191 355233688 355141716 355013657 354870567 354737015 354638481 354592857 354603729 354658089 354731674 354799004 354840775
2202 354840775 354847183 354815407 354744911 354636040 354492035 354323387 354149513 353996277 353887863 353837051 353838310
$$ packed form
2123C57503929M8218R3956J10931J07498Q5679L8147l8796j34430k19078k56882k25639
2134C57113533j33247j7166P3280J03187O9008j793o8359j00632r3345o3744l6659
2145C56844063k5864k8038Tj3046J7052M8942O6147O0348L5744M807k3041m5624o6223
2158C56847229q5869r7122q9035n7945j7357N188j7052q9111j85929k61955k76375
2169C55674667k16064j04447J2551R1438J12152Q1520K1630m6463j11657j69334k12288
2180C55133705k27127j99013j24931j9646Q5907J59874J83029J56670R7466K6817l9063
2191C55233688r1972j28059j43090j33552r8534m5624J0872N4360P3585O7330M1771
2202C54840775O408l1776p0496j08871j44005j68648j73874j53236j08414n0812J259
$$ plain form
2213 353838310 353866768 353884735 353854332 353751335 353575821 353354378 353131485 352953339 352850266 352825546 352855682
2224 352855682 352902527 352929687 352916565 352862129 352779617 352687721 352603912 352543678 352521629 352550201 352632484 352752686
2236 352752686 352872925 352942123 352916985 352784424 352571831 352338219 352147217 352038193 352009773 352025948 352038498
2247 352038498 352012901 351941795 351841202 351734886 351639671 351560249 351496010 351449928 351433945 351462212 351539803
2258 351539803 351652908 351768150 351842575 351839485 351742744 351564674 351342812 351128387 350968475 350888443 350880928
2269 350880928 350907669 350914879 350856781 350716438 350513916 350297241 350122223 350031242 350040855 350142059 350309181
2280 350309181 350509834 350713615 350896950 351046295 351158943 351240997 351300735 351343269 351369820 351383820 351399956
2291 351399956 351445885 351551552 351731644 351973953 352244377 352509727 352762222 353027000 353345490 353744011
$$ packed form
2213C53838310K8458J7967l0403j02997j75514k21443k22893j78146j03073k4720L0136
2224C52855682M6845K7160j3122n4436q2512r1896q3809o0234k2049K8572Q2283J20202
2236C52752686J20239O9198k5138j32561k12593k33612j91002j09024k8420J6175J2550
2247C52038498k5597p1106j00593j06316r5215p9422o4239m6082j5983K8267P7591
2258C51539803J13105J15242P4425l090r6741j78070k21862k14425j59912q0032p515
2269C50880928K6741P210n8098j40343k02522k16675j75018r0981R613J01204J67122
2280C50309181K00653K03781J83335J49345J12648Q2054N9738M2534K6551J4000J6136
2291C51399956M5929J05667J80092K42309K70424K65350K52495K64778L18490L98521
$$ plain form
2301 353744011 354209976 354692574 355127258 355466347 355695381 355830345 355904808 355962219 356058121 356261177
2311 356261177 356637650 357215004 357942924 358680840 359232483 359421883 359176445 358575020 357830162 357204285
2321 357204285 356893959 356930275 357147865 357245293 356921692 356030464 354670715 353158722 351880417 351100693
2331 351100693 350836754 350872726 350899734 350680237 350116501 349179878 347775574 345693512 342748718 339067726
2341 339067726 335329056 332733650 332617798 335848007 342313271 350816040 359461403 366366310 370334206
2350 370334206 371174049 369552727 366526451 363035240 359608383 356361160 353189659 349994164 346798439
2359 346798439 343735657 340958138 338551064 336500206 334716492 333090439 331544685 330066109 328707390
2368 328707390 327560654 326714554 326214294 326046486 326157761 326494942 327040062 327814674 328852539 330158348
$$ packed form
2301C53744011M65965M82598M34684L39089K29034J34964P4463N7411R5902K03056
2311C56261177L76473N77354P27920P37916N51643J89400k45438o01425p44858o25877
2321C57204285l10326L6316K17590R7428l23601q91228j359749j511993j278305p79724
2331C51100693k63939L5972K7008k19497n63736r36623j404304k082062k944794l680992
2341C39067726l738670k595406j15852L230209O465264Q502769Q645363O904907L967896
2350C70334206Q39843j621322l026276l491211l426857l247223l171501l195495l195725
2359C46798439l062782k777519k407074k050858j783714j626053j545754j478576j358719
2368C28707390j146736q46100n00260j67808J11275L37181N45120P74612J037865J305809
$$ plain form
2378 330158348 331682816 333329010 334983330 336548805 337962646 339193802 340230675 341073112 341731071
2387 341731071 342226067 342587776 342846298 343024521 343137283 343196487 343217506 343220062 343223381 343240433 343275452
2398 343275452 343324852 343380470 343430595 343462296 343464584 343435097 343384132 343332405 343300362 343296623 343312798 343329735
2410 343329735 343330116 343306236 343259544 343191109 343095207 342962341 342791214 342598610 342418709 342287903 342226105
2421 342226105 342226410 342261009 342296066 342307167 342283897 342223740 342124519 341983833 341805801 341610909 341436310
2432 341436310 341323929 341300468 341360435 341463089 341546173 341550446 341443291 341230164 340949707 340655746 340397911
2443 340397911 340207253 340094872 340058327 340089417 340176506 340299950 340427475 340515862 340523872 340430679 340249367
2454 340249367 340025444 339820023 339683685 339636879 339664650 339727669 339780655 339789314 339737206 339624786 339464302
$$ packed form
2378C30158348J524468J646194J654320J565475J413841J231156J036873Q42437O57959
2387C41731071M94996L61709K58522J78223J12762N9204K1019K556L319J7052L5019
2398C43275452M9400N5618N0125L1701K288k9487n0965n1727l2043l739J6175J6937
2410C43329735L81k3880m6692o8435r5902j32866j71127j92604j79901j30806o1798
2421C42226105L05L4599L5057J1101k3270o0157r9221j40686j78032j94892j74599
2432C41436310j12381k3461N9967J02654Q3084M273j07155k13127k80457k93961k57835
2443C40397911j90658j12381l6545L1090Q7089J23444J27525Q8387Q010r3193j81312
2454C40249367k23923k05421j36338m6806K7771O3019N2986Q659n2108j12420j60484
$$ plain form
2465 339464302 339274521 339077492 338894539 338741112 338621979 338529892 338450165 338368492 338278503 338182182 338083878
2476 338083878 337981758 337864304 337714920 337525024 337305031 337086830 336912956 336816673 336803818 336846809
2486 336846809 336894341 336893692 336813087 336655006 336453438 336257935 336111679 336032600 336006737 335994072 335945396
2497 335945396 335824013 335621643 335363464 335097771 334876595 334734344 334677162 334685898 334729996 334783401 334831657
2508 334831657 334869232 334890022 334880028 334820328 334697189 334513702 334295158 334082222 333917007 333826942 333815956
2519 333815956 333864441 333938675 334003067 334031296 334011803 333946609 333845596 333718796 333572845 333411598 333241653
2530 333241653 333076668 332937431 332845650 332813950 332838440 332898521 332964630 333010292 333023338 333009796 332991753
2541 332991753 332997437 333048439 333148766 333278732 333399010 333463287 333436623 333310776 333108368 332873573 332653885
$$ packed form
2465C39464302j89781j97029j82953j53427j19133r2087p9727q1673q9989r6321r8304
2476C38083878j02120j17454j49384j89896k19993k18201j73874r6283j2855M2991
2486C36846809M7532o49q0605j58081k01568j95503j46256p9079k5863j2665m8676
2497C35945396j21383k02370k58179k65693k21176j42251n7182Q736M4098N3405M8256
2508C34831657L7575K0790r994n9700j23139j83487k18544k12936j65215r0065j0986
2519C33815956M8485P4234O4392K8229j9493o5194j01013j26800j45951j61247j69945
2530C33241653j64985j39237r1781l1700K4490O0081O6109M5662J3046j3542j8043
2541C32991753N684N1002J00327J29966J20278O4277k6664j25847k02408k34795k19688
$$ plain form
2552 332653885 332482758 332373123 332320938 332314796 332341423 332383118 332413521 332397194 332301102 332111702 331848412
2563 331848412 331561432 331313477 331154404 331101837 331139297 331227875 331324043 331392784 331411247 331367073 331257248
2574 331257248 331090164 330888634 330686913 330521088 330414848 330369148 330362206 330359573 330328445 330250168 330124092
2585 330124092 329965820 329802094 329664307 329581871 329574242 329642639 329766235 329904976 330010948 330044174 329983826
2596 329983826 329831543 329606056 329333534 329040718 328753471 328496857 328295021 328164902 328110008 328115883
2606 328115883 328153114 328186951 328187866 328139572 328040276 327899170 327732849 327561798 327408676 327294273 327232475
2617 327232475 327224274 327254410 327295036 327313118 327282410 327191811 327049789 326880875 326717873 326591263 326520271
2628 326520271 326509132 326548271 326621513 326712265 326808586 326900635 326977730 327026253 327032585 326991119 326910629 326815033
$$ packed form
2552C32653885j71127j09635n2185o142K6627M1695L0403j6327r6092j89400k63290
2563C31848412k86980k47955j59073n2567L7460Q8578R6168O8741J8463m4174j09825
2574C31257248j67084k01530k01721j65825j06240m5700o942k633l1128p8277j26076
2585C30124092j58272j63726j37787q2436p629O8397J23596J38741J05972L3226o0348
2596C29983826j52283k25487k72522k92816k87247k56614k01836j30119n4894N875
2606C28115883L7231L3837R15m8294r9296j41106j66321j71051j53122j14403o1798
2617C27232475q201L0136M0626J8082l0708r0599j42022j68914j63002j26610p0992
2628C26520271j1139L9139P3242R0752R6321R2049P7095M8523O332m1466q0490r5596
$$ plain form
2640 326815033 326733665 326688805 326683235 326699028 326705437 326673851 326590652 326462936 326315727 326182480 326093254 326064911
2652 326064911 326094894 326162338 326234894 326280632 326279030 326227989 326140518 326036682 325933228 325839844 325760345 325698395
2664 325698395 325659523 325647964 325659866 325678978 325680199 325639267 325544014 325399971 325226974 325050507 324892578
2675 324892578 324767494 324681473 324633446 324614944 324609032 324592171 324541740 324445992 324312134 324166069 324042015
2686 324042015 323967896 323953247 323985901 324038925 324082642 324095764 324070702 324012566 323933487 323846741 323761673 323681602
2698 323681602 323604813 323527374 323446388 323363075 323281822 323207016 323138351 323068924 322986946 322882881 322756042
2709 322756042 322618332 322490845 322395592 322345276 322337036 322350464 322352982 322307053 322180443 321955910 321638947
2720 321638947 321260185 320870628 320527000 320273399 320125694 320066414 320054054 320041962 319996719 319907017 319780273
$$ packed form
2640C26815033q1368m4860n570J5793O409l1586q3199j27716j47209j33247q9226k8343
2652C26064911K9983O7444P2556M5738j602n1041q7471j03836j03454r3384p9499o1950
2664C25698395l8872j1559J1902J9112J221m0932r5253j44043j72997j76467j57929
2675C24892578j25084q6021m8027j8502n912j6861n0431r5748j33858j46065j24054
2686C24042015p4119j4649L2654N3024M3717J3122k5062n8136p9079q6746q5068q0071
2698C23681602p6789p7439q0986q3313q1253p4806o8665o9427q1978j04065j26839
2709C22756042j37710j27487r5253n0316q240J3428K518m5929j26610k24533l16963
2720C21638947l78762l89557l43628k53601j47705n9280j2360j2092m5243q9702j26744
$$ plain form
2731 319780273 319630585 319468575 319298592 319123192 318949814 318791332 318660545 318560944 318482037 318402596
2741 318402596 318300476 318161945 317985497 317778397 317550373 317309990 317064991 316825695 316604919 316414967
2751 316414967 316260757 316135960 316024456 315906811 315768337 315604229 315420742 315232925 315062294 314932423
2761 314932423 314862347 314857788 314902840 314958878 314974976 314906921 314737492 314483967 314189835 313903084 313654366
2772 313654366 313446846 313261909 313075733 312874146 312657890 312437077 312222347 312018604 311825542 311640797
2782 311640797 311461029 311279888 311085606 310864391 310608845 310328388 310052166 309819756 309663296 309589748
2792 309589748 309575291 309574509 309539661 309439602 309269123 309045353 308797035 308553123 308335819 308158588 308025494
2803 308025494 307929382 307850723 307759266 307623158 307422962 307164669 306884022 306635628 306471043 306414032 306447544
$$ packed form
2731C19780273j49688j62010j69983j75400j73378j58482j30787r9601p8907p9441
2741C18402596j02120j38531j76448k07100k28024k40383k44999k39296k20776j89952
2751C16414967j54210j24797j11504j17645j38474j64108j83487j87817j70631j29871
2761C14932423p0076m559M5052N6038J6098o8055j69429k53525k94132k86751k48718
2772C13654366k07520j84937j86176k01587k16256k20813k14730k03743j93062j84745
2782C11640797j79768j81141j94282k21215k55546k80457k76222k32410j56460p3548
2792C09589748j4457p82l4848j00059j70479k23770k48318k43912k17304j77231j33094
2803C08025494r6112p8659r1457j36108k00196k58293k80647k48394j64585n7011L3512
$$ plain form
2814 306447544 306520405 306571541 306560020 306484013 306377220 306285839 306238976 306231403 306228104 306187744 306088371 305938816
2826 305938816 305769463 305608997 305464897 305319271 305142384 304913883 304635487 304329720 304024982 303740044
2836 303740044 303476219 303221493 302959557 302677727 302367744 302022705 301634197 301194878 300705090 300179634
2846 300179634 299649086 299153156 298727150 298387394 298121490 297889404 297636051 297311916 296892376 296386700
2856 296386700 295830898 295267620 294724274 294201164 293677235 293128338 292545662 291942291 291343899 290770531
2866 290770531 290221729 289675159 289098091 288464012 287764931 287013550 286238308 285475445 284761505 284126530
2876 284126530 283585911 283131714 282729015 282321415 281847019 281258965 280540791 279709129 278803501 277868309
2886 277868309 276938229 276030960 275149593 274289036 273442497 272604599 271771469 270939465 270103931 269259853
$$ packed form
2814C06447544P2861N1136j1521p6007j06793r1381m6863p573l299m0360r9373j49555
2826C05938816j69353j60466j44100j45626j76887k28501k78396l05767l04738k84938
2836C03740044k63825k54726k61936k81830l09983l45039l88508m39319m89788n25456
2846C00179634n30548m95930m26006l39756k65904k32086k53353l24135m19540n05676
2856B96386700n55802n63278n43346n23110n23929n48897n82676o03371n98392n73368
2866B90770531n48802n46570n77068o34079o99081p51381p75242p62863p13940o34975
2876B84126530n40619m54197m02699m07600m74396n88054p18174q31662r05628r35192
2886B77868309r30080r07269q81367q60557q46539q37898q33130q32004q35534q44078
$$ plain form
2896 269259853 268402042 267527676 266637936 265739937 264846535 263974438 263139973 262354031 261618748 260926666
2906 260926666 260263748 259616661 258980122 258362312 257783337 257265873 256819725 256429329 256051102 255626068
2916 255626068 255102711 254459095 253711185 252901936 252077484 251265297 250466900 249669399 248866272 248072052
2926 248072052 247319679 246642609 246054325 245540524 245070400 244621315 244199123 243841782 243601894 243518047
2936 243518047 243592148 243785877 244036674 244284554 244493027 244653435 244772472 244852333 244877491 244815655 244632797
2947 244632797 244312191 243866482 243335419 242773037 242231274 241749897 241354904 241064415 240892315 240849457
2957 240849457 240938511 241149940 241460266 241833992 242225704 242581310 242840500 242944221 242849655 242547398
2967 242547398 242070580 241486473 240869923 240271893 239700603 239128551 238523045 237882156 237254581 236729813
$$ packed form
2896B69259853q57811q74366q89740q97999q93402q72097q34465p85942p35283o92082
2906B60926666o62918o47087o36539o17810n78975n17464m46148l90396l78227m25034
2916B55626068n23357o43616p47910q09249q24452q12187p98397p97501q03127p94220
2926B48072052p52373o77070n88284n13801m70124m49085m22192l57341k39888q3847
2936B43518047P4101J93729K50797K47880K08473J60408J19037P9861K5158o1836j82858
2947B44632797l20606m45709n31063n62382n41763m81377l94993k90489j72100m2858
2957B40849457Q9054K11429L10326L73726L91712L55606K59190J03721r4566l02257
2967B42547398m76818n84107o16550n98030n71290n72052o05506o40889o27575n24768
$$ plain form
2977 236729813 236404819 236346741 236571598 237048321 237721539 238536110 239450150 240433941 241460400 242498779
2987 242498779 243514080 244473457 245353718 246147995 246871300 247564125 248290348 249125423 250133228 251339226
2997 251339226 252714977 254183617 255648556 257030582 258293266 259443398 260509129 261511421 262447433
3006 262447433 263295841 264035225 264660797 265187855 265639114 266029816 266359634 266618385 266798992 266906872
3016 266906872 266959877 266978989 266979198 266967468 266947193 266924934 266909142 266901798 266885548 266819344 266647549 266324024
3028 266324024 265838604 265232124 264588604 264004688 263549747 263234901 263009186 262783337 262471600 262028255
3038 262028255 261460190 260811844 260132656 259448872 258754368 258024406 257238922 256399250 255527687 254653091
3048 254653091 253794250 252952461 252116470 251273460 250417614 249549694 248671188 247780132 246872101 245945683
$$ packed form
2977B36729813l24994n8078K24857M76723O73218Q14571R14040R83791J026459J038379
2987B42498779J015301R59377Q80261P94277P23305O92825P26223Q35075J007805J205998
2997B51339226J375751J468640J464939J382026J262684J150132J065731J002292R36012
3006B62447433Q48408P39384O25572N27058M51259L90702L29818K58751J80607J07880
3016B66906872N3005J9112K09j1730k0275k2259j5792p344j6250o6204j71795l23525
3028B66324024m85420o06480o43520n83916m54941l14846k25715k25849l11737m43345
3038B62028255n68065o48346o79188o83784o94504p29962p85484q39672q71563q74596
3048B54653091q58841q41789q35991q43010q55846q67920q78506q91056r08031r26418
$$ plain form
3058 245945683 245006886 244067574 243138065 242219982 241303692 240373249 239415951 238429279 237422466 236412163
3068 236412163 235414085 234435196 233469105 232495499 231484680 230406284 229239731 227983227 226655979
3077 226655979 225292625 223931084 222599316 221307697 220049343 218807526 217564507 216309242 215039635
3086 215039635 213763027 212494659 211255550 210068913 208954353 207921906 206967793 206076469 205226192
3095 205226192 204397774 203580189 202772198 201980572 201217098 200495853 199830456 199229488 198690624 198196220
3105 198196220 197715359 197213955 196670055 196087284 195498028 194953709 194505920 194187756 194003143 193930092
3115 193930092 193932571 193976593 194041309 194122391 194228439 194374332 194576836 194853687 195225506 195716419 196350536
3126 196350536 197142467 198087635 199156933 200302296 201471519 202626591 203755112 204867630 205982475
$$ packed form
3058B45945683r38797r39312r29509r18083r16290r30443r57298r86672j006813j010303
3068B36412163r98078r78889r66091r73606j010819j078396j166553j256504j327248
3077B26655979j363354j361541j331768j291619j258354j241817j243019j255265j269607
3086B15039635j276608j268368j239109j186637j114560j032447r54113q91324q50277
3095B05226192q28418q17585q07991p91626p63474p21245o65397o00968n38864m94404
3105A98196220m80861n01404n43900n82771n89256n44319m47789l18164j84613p3051
3115A93930092K479M4022O4716Q1082J06048J45893K02504K76851L71819M90913O34117
3126A96350536P91931R45168J069298J145363J169223J155072J128521J112518J114845
$$ plain form
3135 205982475 207107639 208230896 209324951 210363693 211339169 212267056 213176708 214092388 215017262
3144 215017262 215931015 216800861 217600670 218324776 218990288 219625587 220253716 220879288 221485367 222042103
3154 222042103 222520142 222902946 223190498 223395557 223534069 223617439 223651180 223638515 223585587 223503113 223401852
3165 223401852 223284988 223143826 222960300 222715797 222400723 222018032 221579838 221099930 220589085 220056419
3175 220056419 219513645 218976860 218461437 217972546 217497196 217007351 216472111 215874710 215222454 214543533
3185 214543533 213873024 213235703 212635918 212058296 211476746 210865612 210206470 209490204 208716774 207894497
3195 207894497 207039814 206175537 205324421 204499912 203698502 202899456 202073631 201199150 200274639 199322510
3205 199322510 198377609 197467575 196595573 195736351 194848900 193898849 192876225 191798801 190698090
$$ packed form
3135B05982475J125164J123257J094055J038742R75476R27887R09652R15680R24874
3144B15017262R13753Q69846P99809P24106O65512O35299O28129O25572O06079N56736
3154B22042103M78039L82804K87552K05059J38512Q3370L3741j2665n2928q2474j01261
3165B23401852j16864j41162j83526k44503l15074l82691m38194m79908n10845n32666
3175B20056419n42774n36785n15423m88891m75350m89845n35240n97401o52256o78921
3185B14543533o70509o37321n99785n77622n81550o11134o59142p16266p73430q22277
3195B07894497q54683q64277q51116q24509q01410p99046q25825q74481r24511r52129
3205A99322510r44901r10034q72002q59222q87451r50051j022624j077424j100711
$$ plain form
3214 190698090 189599228 188508110 187414131 186305523 185184250 184069538 182985859 181946602 180944366
3223 180944366 179956989 178964043 177961292 176963444 175994129 175070877 174198208 173372250 172591877 171866512
3233 171866512 171213436 170647106 170168266 169761410 169402256 169070606 168761292 168488007 168280621 168178329
3243 168178329 168219929 168433018 168823700 169371166 170033016 170762043 171529427 172341919 173242779 174292603
3253 174292603 175540085 176996765 178629990 180376701 182169132 183959465 185731983 187500095 189292431
3262 189292431 191137524 193051624 195033150 197063179 199109726 201135464 203105526 204995327 206794300
3271 206794300 208506241 210145988 211735096 213297367 214854908 216423264 218006287 219591713 221153049
3280 221153049 222655602 224069595 225381584 226600742 227754784 228878574 229999905 231130219 232262497
$$ packed form
3214A90698090j098862j091118j093979j108608j121273j114712j083679j039257j002236
3223A80944366r87377r92946j002751r97848r69315r23252q72669q25958p80373p25365
3233A71866512o53076n66330m78840m06856l59154l31650l09314k73285k07386j02292
3243A68178329M1600K13089L90682N47466O61850P29027P67384Q12492R00860J049824
3253A74292603J247482J456680J633225J746711J792431J790333J772518J768112J792336
3262A89292431J845093J914100J981526K030029K046547K025738J970062J889801J798973
3271B06794300J711941J639747J589108J562271J557541J568356J583023J585426J561336
3280B21153049J502553J413993J311989J219158J154042J123790J121331J130314J132278
$$ plain form
3289 232262497 233376522 234446888 235450592 236372242 237207508 237965279 238666687 239340343 240011730
3298 240011730 240691719 241369820 242018108 242606010 243118515 243566151 243979797 244392185 244817619 245242462
3308 245242462 245635757 245969944 246239166 246462135 246666641 246868782 247063217 247230816 247359314 247459145
3318 247459145 247561054 247695503 247869301 248056946 248214817 248308983 248335419 248318386 248288574 248258305 248214016
3329 248214016 248132820 248010426 247878304 247794895 247813492 247948399 248161373 248377781 248522491 248554077 248478165
3340 248478165 248337002 248184814 248065395 248001881 247997608 248043289 248121300 248208199 248275661 248295002 248243065
3351 248243065 248108521 247894230 247614384 247288799 246935692 246567574 246191025 245809841 245431671 245070915
3361 245070915 244747639 244480591 244278698 244137993 244047508 244001350 244008274 244089222 244261494 244519882 244827080
$$ packed form
3289B32262497J114025J070366J003704R21650Q35266P57771P01408O73656O71387
3298B40011730O79989O78101O48288N87902N12505M47636M13646M12388M25434M24843
3308B45242462L93295L34187K69222K22969K04506K02141J94435J67599J28498R9831
3318B47459145J01909J34449J73798J87645J57871R4166K6436j7033k9812l0269m4289
3329B48214016q1196j22394j32122q3409J8597J34907K12974K16408J44710L1586p5912
3340B48478165j41163j52188j19419o3514m273M5681P8011Q6899O7462J9341n1937
3351B48243065j34544k14291k79846l25585l53107l68118l76549l81184l78170l60756
3361B45070915l23276k67048k01893j40705r0485m6158O924Q0948J72272K58388L07198
$$ plain form
3372 244827080 245124340 245355492 245489922 245529270 245494843 245407543 245277596 245111790 244929199 244769802
3382 244769802 244681206 244689560 244774990 244870911 244893818 244785881 244545364 244225712 243906956 243656788 243506565
3393 243506565 243450756 243463268 243514919 243580837 243637791 243660946 243627605 243528538 243377361 243210201 243072739
3404 243072739 243001862 243012600 243096581 243231487 243393211 243563499 243728790 243874569 243979721 244018745 243971291
3415 243971291 243835869 243638802 243432312 243278885 243227081 243291054 243442879 243624859 243775864 243857899
3425 243857899 243871517 243850632 243843307 243888016 243999119 244165268 244360218 244556561 244735985 244893208 245032177
3436 245032177 245160141 245280800 245390377 245479450 245539494 245572815 245598774 245650349 245759888 245940285 246174126
3447 246174126 246419945 246635666 246806145 246955967 247136002 247389755 247718391 248070335 248364258 248534489
$$ packed form
3372B44827080K97260K31152J34430L9348l4427q7300j29947j65806j82591j59397
3382B44769802q8596Q354Q5430R5921K2907j07937k40517l19652l18756k50168j50223
3393B43506565n5809J2512N1651O5918N6954K3155l3341r9067j51177j67160j37462
3404B43072739p0877J0738Q3981J34906J61724J70288J65291J45779J05152L9024m7454
3415B43971291j35422j97067k06490j53427n1804O3973J51825J81980J51005Q2035
3425B43857899J3618k0885p325M4709J11103J66149J94950J96343J79424J57223J38969
3436B45032177J27964J20659J09577Q9073O0044L3321K5959N1575J09539J80397K33841
3447B46174126K45819K15721J70479J49822J80035K53753L28636L51944K93923J70231
$$ plain form
3457 248534489 248571243 248529453 248498688 248553047 248711338 248932228 249145660 249297848 249381123 249430408 249492855
3468 249492855 249595280 249730854 249872189 249996815 250103207 250206242 250318050 250432911 250530376 250596313
3478 250596313 250643196 250712891 250855465 251098270 251427956 251797543 252154179 252467861 252740612 252994423
3488 252994423 253249245 253510742 253775845 254046135 254332314 254640713 254950390 255203266 255323639 255263081
3498 255263081 255043335 254765434 254572239 254580612 254822788 255233364 255688286 256072559 256335297 256502419
3508 256502419 256645584 256833725 257098694 257431297 257801743 258181953 258553371 258899364 259195366 259409046
3518 259409046 259514809 259509068 259415817 259277267 259137516 259033661 258997879 259064655 259268932 259629726 260127335
3529 260127335 260693283 261229687 261653748 261945286 262164650 262424049 262822208 263376446 263995361 264511719
$$ packed form
3457B48534489L6754m1790l0765N4359J58291K20890K13432J52188Q3275M9285O2447
3468B49492855J02425J35574J41335J24626J06392J03035J11808J14861R7465O5937
3478B50596313M6883O9695J42574K42805L29686L69587L56636L13682K72751K53811
3488B52994423K54822K61497K65103K70290K86179L08399L09677K52876J20373o0558
3498B55263081k19746k77901j93195Q373K42176M10576M54922L84273K62738J67122
3508B56502419J43165J88141K64969L32603L70446L80210L71418L45993K96002K13680
3518B59409046J05763n741r3251j38550j39751j03855l5782O6776K04277L60794M97609
3529B60127335N65948N36404M24061K91538K19364K59399L98159N54238O18915N16358
$$ plain form
3539 264511719 264766045 264693871 264369946 263978806 263726025 263738136 264007988 264416485 264815159 265117092
3549 265117092 265339642 265576439 265924568 266423454 267049255 267761402 268553963 269454670 270456963 271432571
3559 271432571 272106094 272144699 271337185 269761391 267823868 266124763 265204945 265313854 266325092
3568 266325092 267836971 269384499 270635853 271476212 271973152 272288551 272610588 273125725 273993149
3577 273993149 275279541 276865520 278400555 279386253 279393959 278315506 276486435 274578781 273296700
3586 273296700 273041973 273745117 274956741 276127930 276897182 277214661 277261238 277260208 277336216 277509556
3596 277509556 277793922 278280201 279111824 280355358 281869984 283294334 284186859 284246864 283481979 282222652
3606 282222652 280979290 280229473 280240650 280993309 282205448 283426208 284173603 284104099 283185406 281802807
$$ packed form
3539B64511719K54326p2174l23925l91140k52781J2111K69852M08497L98674L01933
3549B65117092K22550K36797L48129M98886O25801P12147P92561R00707J002293R75608
3559B71432571O73523L8605q07514j575794j937523j699105r19818J08909J011238
3568B66325092J511879J547528J251354Q40359M96940L15399L22037N15137Q67424
3577B73993149J286392J585979J535035R85698P706j078453j829071j907654j282081
3586B73296700k54727P03144J211624J171189P69252L17479M6577j030P6008J73340
3596B77509556K84366M86279Q31623J243534J514626J424350Q92525O0005p64885j259327
3606B82222652j243362p49817J1177P52659J212139J220760P47395o9504r18693j382599
$$ plain form
3616 281802807 280704269 280735340 282429790 285644112 289459248 292470493 293377495 291597881 287581692
3625 287581692 282641659 278379383 276001015 275873852 277519302 279988575 282369194 284144382 285268974
3634 285268974 286015415 286757011 287822647 289436874 291667862 294326992 296870232 298439388 298143082
3643 298143082 295510292 290872517 285397549 280668716 277987518 277782116 279466839 281831436 283713093
3652 283713093 284546585 284498310 284184742 284229755 284967251 286417522 288441792 290869122 293483429 295935459
3662 295935459 297744102 298472939 297985764 296569958 294782505 293090458 291560154 289843998 287500343
3671 287500343 284427948 281097450 278401623 277221985 278000774 280582848 284374275 288642921 292727432
3680 292727432 296057301 298083572 298301258 296446705 292758217 288080292 283658295 280683594 279827862
$$ packed form
3616B81802807j098538L1071J694450L214322L815136L011245R07002j779614m016189
3625B87581692m940033m262276k378368j27163J645450K469273K380619J775188J124592
3634B85268974P46441P41596J065636J614227K230988K659130K543240J569156k96306
3643B98143082k632790m637775n474968m728833k681198k05402J684723K364597J881657
3652B83713093Q33492m8275l13568M5013P37496J450271K024270K427330K614307K452030
3662B95935459J808643P28837m87175j415806j787453j692047j530304j716156k343655
3671B87500343l072395l330498k695827j179638P78789K582074L791427M268646M084511
3680B92727432L329869K026271K17686j854553l688488m677925m421997k974701q55732
$$ plain form
3689 279827862 281025772 283605556 286652012 289374447 291298294 292259884 292309551 291646385 290616283
3698 290616283 289705791 289441185 290177307 291870594 293984756 295629787 295910149 294333572 291080494
3707 291080494 286990891 283260746 280979233 280719452 282361794 285215759 288353176 290975208 292641678
3716 292641678 293293381 293122330 292414322 291462173 290560894 290020161 290120392 291000233 292536240 294300442
3726 294300442 295645866 295900440 294604778 291719131 287735710 283641567 280688419 279978733 281981182
3735 281981182 286197338 291213036 295216274 296794319 295602856 292502499 289039993 286552715 285436134
3744 285436134 285030899 284194164 282168274 279164696 276279831 274813137 275454388 277873287 280951118
3753 280951118 283461456 284738235 284928379 284739342 284915543 285802803 287229538 288692856 289663563
$$ packed form
3689B79827862J197910K579784L046456K722435J923847R61590M9667o63166j030102
3698B90616283r10492k64606P36122J693287K114162J645031K80362j576577l253078
3707B91080494m089603l730145k281513k59781J642342K853965L137417K622032J666470
3716B92641678O51703j71051p08008r52149r01279n40733J00231Q79841J536007J764202
3726B94300442J345424K54574j295662k885647l983421m094143k953148p09686K002449
3735B81981182M216156N015698M003238J578045j191463l100357l462506k487278j116581
3744B85436134m05235q36735k025890l003578k884865j466694O41251K418899L077831
3753B80951118K510338J276779J90144j89037J76201Q87260J426735J463318R70707
$$ plain form
3762 289663563 289815674 289104290 287731876 286078796 284625225 283842735 284042511 285225487 287026463
3771 287026463 288820972 289974613 290115776 289291668 287922916 286586933 285749741 285581131 285936413
3780 285936413 286491508 286947002 287188759 287325211 287591801 288186188 289138031 290293312 291418095 292343121
3790 292343121 293038483 293558960 293902855 293909836 293305054 291888466 289736996 287252407 284983253 283325100
3800 283325100 282313728 281680260 281145515 280735245 280859680 282057552 284560890 287990646 291425247
3809 291425247 293829041 294570694 293695793 291790276 289557495 287418537 285402756 283362656 281307144
3818 281307144 279574490 278705978 279113998 280789700 283261395 285831013 287926979 289346886 290253811
3827 290253811 290956135 291630669 292162399 292188168 291307259 289333725 286453457 283201923 280272007
$$ packed form
3762B89663563J52111p11384j372414j653080j453571p82490J99776J182976J800976
3771B87026463J794509J153641J41163q24108j368752j335983q37192j68610L55282
3780B85936413N55095M55494K41757J36452K66590N94387R51843J155281J124783R25026
3790B92343121O95362N20477L43895O981o04782j416588k151470k484589k269154j658153
3800B83325100j011372o33468n34745m10270J24435J197872K503338L429756L434601
3809B91425247K403794P41653q74901j905517k232781k138958k015781k040100k055512
3818B81307144j732654q68512M08020J675702K471695K569618K095966J419907R06925
3827B90253811P02324O74534N31730K5769q80909j973534k880268l251534k929916
$$ plain form
3836 280272007 278249874 277420101 277747135 279039631 281177406 284221802 288285427 293204899 298232365
3845 298232365 302017956 303019028 300209637 293729744 285079632 276674385 270921154 269259071 271633167
3854 271633167 276645393 282268162 286730289 289145470 289633923 288978806 288072968 287463207 287182999
3863 287182999 286887875 286158352 284791737 282944946 281082840 279776993 279458923 280238171 281865158
3872 281865158 283845234 285644741 286885090 287435970 287381840 286908607 286195049 285371075 284540672 283813400
3882 283813400 283291645 283010921 282893143 282778740 282548523 282261944 282199039 282741241 284134903 286276093
3892 286276093 288659878 290545521 291257305 290461826 288285809 285238781 282010212 279252319 277429867
3901 277429867 276755829 277193546 278501740 280314827 282249355 284005775 285421124 286447906 287081928
$$ packed form
3836B80272007k022133q29773L27034J292496K137775L044396M063625M919472N027466
3845B98232365L785591J001072k809391o479893q650112q405247n753231j662083K374096
3854B71633167N012226N622769M462127K415181M88453o55117r05838o09761k80208
3863B87182999k95124p29523j366615j846791j862106j305847l18070P79248J626987
3872B81865158J980076J799507J240349N50880n4130m73233p13558q23974q30403p27272
3882B83813400n21755k80724j17778j14403k30217k86579o2905N42202J393662K141190
3892B86276093K383785J885643P11784p95479k176017l047028l228569k757893j822452
3901B77429867o74038M37717J308194J813087J934528J756420J415349J026782O34022
$$ plain form
3910 287081928 287303104 287080364 286438694 285523243 284589996 283906517 283621120 283694077 283943653 284174747
3920 284174747 284297142 284351215 284431000 284570293 284683933 284608593 284214783 283512402 282680111 281998825
3930 281998825 281726170 281977463 282670631 283559837 284341469 284785461 284828339 284582825 284257965 284035454
3940 284035454 283974915 284001446 283976784 283799477 283465919 283059826 282691517 282439690 282331696 282359962 282502670
3951 282502670 282726612 282978859 283190498 283303337 283300304 283211021 283084564 282954082 282826080 282701187
3961 282701187 282599468 282555351 282582703 282647133 282683372 282651901 282581520 282548180 282598724 282690620 282713566 282586861
3973 282586861 282342339 282105885 281978226 281925163 281791821 281450253 280944748 280485115 280262184 280249271
3983 280249271 280191994 279836159 279195137 278576756 278280125 278208256 277806549 276510277 274392872 272362747
$$ packed form
3910B87081928K21176k22740o41670r15451r33247o83479k85397P2957K49576K31094
3920B84174747J22395N4073P9785J39293J13640p5340l93810p02381q32291o81286
3930B81998825k72655K51293O93168Q89206P81632M43992M2878k45514l24860k22511
3940B84035454o0539K6531k4662j77307l33558m06093l68309k51827j07994K8266J42708
3951B82502670K23942K52247K11639J12839l033q9283j26457j30482j28002j24893
3961B82701187j01719m4117K7352O4430L6239l1471p0381l3340N0544R1896K2946j26705
3973B82586861k44522k36454j27659n3063j33342l41568n05505m59633k22931j2913
3983B80249271n7277l55835o41022o18381k96631p1869m01707j296272k117405k030125
$$ plain form
3993 272362747 271449032 271420078 269694481 261611996 242380390 209834671 166370220
4000 166370220
$$ packed form
3993B72362747r13715k8954j725597q082485j9231606l2545719m3464451
4000A66370220
##END=$$ End of the data block
