##TITLE=$$ Begin of the data block
##JCAMP-DX=5.00 $$ ACD/SpecManager v 10.08
##SPECTROMETER/DATA SYSTEM=16PC
##DATE=25 Jun 2013 14:09:36
##DATA TYPE=INFRARED SPECTRUM
##DATA CLASS=XYDATA
##ORIGIN=
##OWNER=
##NPOINTS=3601
##FIRSTX=400.00000000
##LASTX=4000.00000000
##MAXX=4000.00000000
##MINX=400.00000000
##MAXY=87.39001465
##MINY=43.99416733
##XFACTOR=1.0000000000
##YFACTOR=0.000000100000000
##FIRSTY=49.18631744
##DELTAX=1.00000000
##XUNITS=1/CM
##YUNITS=TRANSMITTANCE
##XYDATA=(X++(Y..Y))
400D91863174J22404213R6492196O2892227L1641998R886932l91998j880341N95246
408H13503647K910461L256684K001495M11301o29502j094360j426697j869507k154007
417H14909515j765136m83628J301422K781983L272629K669754J487274M64249O2332
426H24700394K25525N37414O08826L69568O4239j4038K05765N05752N65567K30484
436H27999496l56903q58230r88083p10602k52685O6528L9062l30047q77991j424332
446H22306213j876373k237167k537995k775268k908478k904816k783737k603683k407379
455G99271317k177659j845092j351700p17926n5924M87519Q10470R13162Q78754Q18405
465G97031326Q10547Q81424J031189J261368J582107J987305K430115K823028L071137
$$ plain form
400 491863174 614267387 710759583 773651810 805293808 815180740 814788742 812908401 813503647
408 813503647 816414108 819670792 821672287 822083588 821454086 820359726 818933029 817063522 814909515
417 814909515 813144379 812660751 813962173 816744156 820016785 822686539 824173813 824638062 824700394
426 824700394 824925919 825463333 826072159 826441727 826505966 826491928 826697693 827203445 827769012 827999496
436 827999496 827642593 826784363 825796280 825085678 824832993 824899521 824938583 824608536 823730545 822306213
446 822306213 820429840 818192673 815654678 812879410 809970932 807066116 804282379 801678696 799271317
455 799271317 797093658 795248566 793896866 793178940 793123016 793610535 794421005 795334167 796212921 797031326
465 797031326 797841873 798723297 799754486 801015854 802597961 804585266 807015381 809838409 812909546
474H12909546L110886K926330K537232J973800J272202M90875k76184r25217j416168
483H22603302j845016k456055l536987n231705p360153r370499j0485001r999313p608643
492G64709930l601150J191330N666580Q834000J0148925R654313P894592N658340L667832
501H13824692K348480J756210J658936J722870J685333J457596J115722Q11005O62460
510H27043304O90766Q18634R24988R10644P36008M25110L1051l89709p96433j158447
520H29235916j445312j620407j644516j487351j139984o20499J9074O94351J299591
529H23290863J728516J907119J825104J545868J186829Q75930O96869O59943P04117
538H34421158P35550O76117N00946K45666j6479k11640k98614k83966k14234j48697
$$ plain form
474 812909546 816020432 818946762 821483994 823457794 824729996 825220871 824944687 824019470 822603302
483 822603302 820758286 818302231 814765244 809533539 802173386 792802887 782317886 772318573 764709930
492 764709930 761108780 762300110 767966690 776800690 786949615 796603928 804498520 810156860 813824692
501 813824692 816173172 817929382 819588318 821311188 822996521 824454117 825569839 826380844 827043304
510 827043304 827734070 828552704 829477692 830388336 831124344 831549454 831580505 831190796 830394363 829235916
520 829235916 827790604 826170197 824525681 823038330 821898346 821277847 821296921 821991272 823290863
529 823290863 825019379 826926498 828751602 830297470 831484299 832360229 833057098 833717041 834421158
538 834421158 835156708 835832825 836333771 836579437 836562958 836351318 836052704 835768738 835554504 835405807
548H35405807j32446j71966k35749k72598k45438j57470n6305r918o6376k16904l94516
559H33446121n05981m82788l26996j13373M8142P0495o1569k89459n15747o65818p32879
570H29870148p80182r03702j168671j555557j947403k165985k041702j492920n74570
579H17239456N27191J550522K252426K491532K273712J736832J085968N10864J21918
588H29790421o8436j24207j37100j88141l24325n59540q87985j293717j759567k266235
598H22181168k786789l282547l687363l901062l795319l245315k184448o63224J125717
607G99760818K875062M251632N005264N054017M503860L595047K606659J763229J185608
616H30601196Q85849Q00095Q23517Q40072P41806M54941k5406o17675j159134j455841
$$ plain form
548 835405807 835273361 835101395 834865646 834593048 834347610 834190140 834133835 834123917 834057541 833840637 833446121
559 833446121 832940140 832457352 832130356 832016983 832065125 832135620 832074051 831784592 831268845 830603027 829870148
570 829870148 829089966 828186264 827017593 825462036 823514633 821348648 819306946 817814026 817239456
579 817239456 817766647 819317169 821569595 824061127 826334839 828071671 829157639 829668503 829790421
588 829790421 829721985 829597778 829460678 829272537 828948212 828388672 827500687 826206970 824447403 822181168
598 822181168 819394379 816111832 812424469 808523407 804728088 801482773 799298325 798635101 799760818
607 799760818 802635880 806887512 811892776 816946793 821450653 825045700 827652359 829415588 830601196
616 830601196 831487045 832287140 833110657 833950729 834692535 835147476 835122070 834504395 833345261 831889420
626H31889420j366272q69141r1705P33871J358643J614685J475372J046829N11170
635H36302872M3182k54898l75442l85361l78647m29306n62363p51266r40857j077728
645H31190186j134568j117248j053314r70231q80737p85293o85120n97305n49012n54275
655H22863083n82962n57861l91160n6610L54920O34765N47486l3112j004791k029038
665H19744720k652359k522125j578293j14822J334915K236710K295608J569519M03595
674H20717468p62253j605758k035904k155228k129822k050323j880112j505584q45185
683H05747299O6834J071777J960297K572403K860107K886276K764893K592239K408600
692H24930725K204361J956101J657028J329117J004943P07703M37775J77536q9264
$$ plain form
626 831889420 830523148 829654007 829562302 830296173 831654816 833269501 834744873 835791702 836302872
635 836302872 836346054 836091156 835715714 835330353 834951706 834522400 833960037 833208771 832267914 831190186
645 831190186 830055618 828938370 827885056 826914825 826034088 825248795 824563675 823966370 823417358 822863083
655 822863083 822280121 821722260 821331100 821274490 821629410 822264175 822811661 822778549 821773758 819744720
665 819744720 817092361 814570236 812991943 812877121 814212036 816448746 818744354 820313873 820717468
674 820717468 819955215 818349457 816313553 814158325 812028503 809978180 808098068 806592484 805747299
683 805747299 805814133 806885910 808846207 811418610 814278717 817164993 819929886 822522125 824930725
692 824930725 827135086 829091187 830748215 832077332 833082275 833789978 834227753 834405289 834316025
701H34316025l61557o12564p93457q47321p29980m30680J5107N19790R65882J238632
711H33279877J266098J047287O53534J97296k08054m87442o15463o08673n02548l32032
721H33689880j24664R0790K80762M04739M28085L34778J37024j25656l97873o26526
731H34091339p73468q26340q01620p36389o76804o62231p10678q18329r70154j159439
741H25955887j399918j723480k154541k680969l235398l706665l976211l973084l705368
750G99400253l260879k771836k361679k100753j993332j991883k033691k069931k088928
759G78727341k111893k181931k347335k641831l065414l572541m070968m438706m571151
768G49725571m427185m073868l687134l503571l739395m492721n679322p032547q162841
$$ plain form
701 834316025 833954468 833341904 832548447 831701126 830971146 830540466 830555573 831075363 832041245 833279877
711 833279877 834545975 835593262 836246796 836444092 836236038 835748596 835133133 834524460 834021912 833689880
721 833689880 833565216 833656006 833936768 834341507 834769592 835104370 835241394 835115738 834717865 834091339
731 834091339 833317871 832491531 831689911 830953522 830276718 829614487 828903809 828085480 827115326 825955887
741 825955887 824555969 822832489 820677948 817996979 814761581 811054916 807078705 803105621 799400253
750 799400253 796139374 793367538 791005859 788905106 786911774 784919891 782886200 780816269 778727341
759 778727341 776615448 774433517 772086182 769444351 766378937 762806396 758735428 754296722 749725571
768 749725571 745298386 741224518 737537384 734033813 730294418 725801697 720122375 713089828 704926987
777G04926987q670044q264771o859665m602508j842499R61990L357697N012894N790786
786F89810867N766144N185928M377747L648529L200226L093262L261947L570786L878250
795G25793686M086685M156952M089508L899002L592835L173370K658310K102585J602859
804G55155792J274414J209488J433640J883011K422409K892990L177337L246689L167038
813G75862808L061218L044587L165054L380814L587799L679428L607025L402939L157959
822H05949631K958755K835999K743072K583008K269135J776199J156082N09567o2713
831H22718735n03311q05436r88311j066056j023559q30994m67682M8218O55136J265717
841H19002457J796341K193145K439576K547302K543030K458191K321624K159348J994018
$$ plain form
777 704926987 696256943 687992172 681132507 676529999 674687500 675649490 679007187 684020081 689810867
786 689810867 695577011 700762939 705140686 708789215 711989441 715082703 718344650 721915436 725793686
795 725793686 729880371 734037323 738126831 742025833 745618668 748792038 751450348 753552933 755155792
804 755155792 756430206 757639694 759073334 760956345 763378754 766271744 769449081 772695770 775862808
813 775862808 778924026 781968613 785133667 788514481 792102280 795781708 799388733 802791672 805949631
822 805949631 808908386 811744385 814487457 817070465 819339600 821115799 822271881 822781448 822718735
831 822718735 822215424 821409988 820421677 819355621 818332062 817501068 817033386 817081604 817736740 819002457
841 819002457 820798798 822991943 825431519 827978821 830521851 832980042 835301666 837461014 839455032
850H39455032J836472J684494J520309J312333J019592N97458J3046p32575j576156
859H45130005k375031k921447l002549k480850j375885J11084J645126K870331L536454
868H41137238L581924L135300K439041J737289J187439Q32062O31256N25742M85839
877H55693130N20325O54373Q88825J183090J463013J649399J695404J599655J402740
886H66749954J166153R45587P77512O67953N99823N43213M67377L54614K11716O7215
896H72551117l6011o1416O86J25351K58560L41568L37372K50702J22299R918m6463
907H73853683m1275j0147p63m7607j47552k58408l23410l04642k02942o1722N8899
918H72514114J12763Q9722J7089o1798j15127j41068j62582k10800l00141m16412n25284
$$ plain form
850 839455032 841291504 842975998 844496307 845808640 846828232 847425690 847438736 846706161 845130005
859 845130005 842754974 839833527 836830978 834350128 832974243 833085327 834730453 837600784 841137238
868 841137238 844719162 847854462 850293503 852030792 853218231 854050293 854681549 855207291 855693130
877 855693130 856213455 856867828 857756653 858939743 860402756 862052155 863747559 865347214 866749954
886 866749954 867916107 868861694 869639206 870307159 870906982 871450195 871917572 872272186 872483902 872551117
896 872551117 872515106 872453690 872454376 872579727 872838287 873179855 873517227 873767929 873890228 873900146 873853683
907 873853683 873812408 873802261 873801498 873753891 873606339 873347931 873024521 872719879 872516937 872455215 872514114
918 872514114 872626877 872716599 872733688 872671890 872556763 872415695 872253113 872042313 871742172 871325760 870800476
929H70800476n90744n96008n49927m83475m30526m12217m32510m79889n40085o03409
939H65681686o67190p33643q06427q87680r82361j098098j244202j423645j619110
948H56219330j790695j876374j814117j562195j123352n48325P5760O52161J106110
957H49338303J400756J540528J555099J481171J347504J170425R63440P40280N23834
966H60061340L39051K02942J19628P7210N1117J5411m7836j44272k61612l78265m67911
977H59566803n10941n07202m75998m53186m72641n51605o79016q19168r29108r81369
987H53186569r78088r46579r28192r52759j029205j146393j283417j425476j567841
996H42928619j715011j872864k046814k246933k498169k848663l356171m062729m955139
$$ plain form
929 870800476 870209732 869613724 869063797 868580322 868149796 867737579 867305069 866825180 866285095 865681686
939 865681686 865014496 864280853 863474426 862586746 861604385 860506287 859262085 857838440 856219330
948 856219330 854428635 852552261 850738144 849175949 848052597 847504272 847580032 848232193 849338303
957 849338303 850739059 852279587 853834686 855315857 856663361 857833786 858797226 859537506 860061340
966 860061340 860400391 860603333 860722961 860800171 860851288 860866699 860818863 860674591 860412979 860034714 859566803
977 859566803 859055862 858548660 858072662 857619476 857146835 856595230 855916214 855097046 854167938 853186569
987 853186569 852208481 851261902 850333710 849380951 848351746 847205353 845921936 844496460 842928619
996 842928619 841213608 839340744 837293930 835046997 832548828 829700165 826343994 822281265 817326126
1005H17326126n931625o789780p253952p040329n947876l948822j239014J773453M558029
1014G85506210O599732P548675P323151O122513M350967K482834R17664j14060n73425
1023H20164261n68695k77786J25198N12161Q15201J009216J097870J096115J020813
1032H24994354Q87451P05491M79888K17514o8740l51563n95932p66754q44116q30384
1042H23827209p52029o46744n52292m95681m89197n32303o16302p28837q58230r96323
1052H17159271j139221j288986j447296j616364j794281j980591k178573k399979k662430
1061H00651550k982101l361588l789901m247284m716645n197448n704804o267471o913300
1070G57471008p664108q536606r537430j0666122j1901321j3188019j4439392j5548478
$$ plain form
1005 817326126 811394501 804604721 797350769 790310440 784362564 780413742 779174728 780948181 785506210
1014 785506210 792105942 799654617 806977768 813100281 817451248 819934082 820851746 820737686 820164261
1023 820164261 819595566 819317780 819442978 819955139 820770340 821779556 822877426 823973541 824994354
1032 824994354 825881805 826587296 827067184 827284698 827215958 826864395 826268463 825501709 824657593 823827209
1042 823827209 823075180 822428436 821876144 821380463 820891266 820358963 819742661 819013824 818155594 817159271
1052 817159271 816020050 814731064 813283768 811667404 809873123 807892532 805713959 803313980 800651550
1061 800651550 797669449 794307861 790517960 786270676 781554031 776356583 770651779 764384308 757471008
1070 757471008 749806900 741270294 731732864 721066742 709165421 695977402 681538010 665989532
1078F65989532j6414489j6960411j7135926j6895256j6178398j4913063j3052254j0631446
1086E43808289p810746m865074k111854J93138J937675L176766M075431M821511N551643
1095E48776779O334725P205772Q210602R410591J0834618J2408790J3918839J5053558
1103F32154274J5521660J5188064J4152604J2719726J1274567J0120086R369202Q933106
1111G29433289Q604660Q184661P580643O832352O071777N446930N055542M915619M973145
1120G87098618N132293N286331N341645N235214M943619M487304L924790L332138K776565
1129H27558517K292862J875840J491546J101380O83746K50549j67160n31234q19550
1138H33736496j040268j221161j396942j582489j758957j874924j863403j675415j305923
$$ plain form
1078 665989532 649575043 632614632 615478706 598583450 582405052 567491989 554439735 543808289
1086 543808289 535997543 531132469 529020615 529213753 531151428 534328194 538403625 543225136 548776779
1095 548776779 555111504 562317276 570527878 579938469 590773087 603181877 617100716 632154274
1103 632154274 647675934 662863998 677016602 689736328 701010895 711130981 720500183 729433289
1111 729433289 738037949 746222610 753803253 760635605 766707382 772154312 777209854 782125473 787098618
1120 787098618 792230911 797517242 802858887 808094101 813037720 817525024 821449814 824781952 827558517
1129 827558517 829851379 831727219 833218765 834320145 835003891 835254440 835087280 834556046 833736496
1138 833736496 832696228 831475067 830078125 828495636 826736679 824861755 822998352 821322937 820017014
1147H20017014q03986k62070K15302N46798O94428O66351M99497K38495q1177m40674
1157H21289978q36029j277008j787720k399368l134918l983078m865799n630112o067657
1166G91308289n971222n207291l782272j865921K26135K105942L408355L889389L499222
1175G87610626K404251R55124m10080j293030j457443r03625J41983J315384K252426
1184G90615616K713623K647705K171631J490707P92465J81809l35236q16879j329727
1193G98131714j908875k545700l204498l847885m458008n038986n612106o201096o822052
1202G58492508p482987q180923q910522r668808j0464020j1317520j2264862j3347550
1210F76855316j4598541j6016464j7534829j8991966k0116234k0548858j9914475j7938766
$$ plain form
1147 820017014 819213028 818950958 819166260 819713058 820407486 821073837 821573334 821811829 821730652 821289978
1157 821289978 820453949 819176941 817389221 814989853 811854935 807871857 803006058 797375946 791308289
1166 791308289 785337067 780129776 776347504 774481583 774707718 776813660 780222015 784111404 787610626
1175 787610626 790014877 790970001 790559921 789266891 787809448 786905823 787047806 788363190 790615616
1184 790615616 793329239 795976944 798148575 799639282 800431747 800613556 800278320 799461441 798131714
1193 798131714 796222839 793677139 790472641 786624756 782166748 777127762 771515656 765314560 758492508
1202 758492508 751009521 742828598 733918076 724249268 713785248 702467728 690202866 676855316
1210 676855316 662256775 646240311 628705482 609713516 589597282 569048424 549133949 531195183
1218E31195183j4580002j0113792n124588l68538L452453N927849P082443P356873
1226E24827881P420006P895355R116783J1019707J3208389J5148926J6398468J6757583
1234F21793098J6298867J5280533J4010925J2734985J1587448J0608673R796143R142685
1242G21253357Q645477Q291779Q038559P807007P503128P045593O391525N547562M561004
1251G85084991L499146K428284J397552M34418m53034j265029j995774k618561l080673
1260G83431320l312454l251953k873917k220077j402664n84183O2027M03824L80554
1269G70632477J4725o13556j400834k260208l143844m042969m969254n928344o897660
1278G41390533p814254q585434r106827r293366r104614q554992p712861o673736n529404
$$ plain form
1218 531195183 516615181 506501389 501376801 501008263 504460716 510388565 517471008 524827881
1226 524827881 532247887 540143242 549260025 560279732 573488121 588637047 605035515 621793098
1234 621793098 638091965 653372498 667383423 680118408 691705856 702314529 712110672 721253357
1242 721253357 729898834 738190613 746229172 754036179 761539307 768584900 774976425 780523987 785084991
1251 785084991 788584137 791012421 792409973 792844391 792391357 791126328 789130554 786511993 783431320
1260 783431320 780118866 776866913 773992996 771772919 770370255 769786072 769848099 770251923 770632477
1269 770632477 770647202 770033646 768632812 766372604 763228760 759185791 754216537 748288193 741390533
1278 741390533 733576279 724990845 715884018 706590652 697486038 688931046 681218185 674544449 669015045
1287F69015045m337692l104324j787186l18604J362305L268967N341491P431870R317703
1296F86189575J0741654J1478195J1401672J0544586R104767P395096N748444M406662
1304G57010651L448104K781754K212677J548462O90689l33405j401824k376252l177642
1313G60403214l811036m336548m804382n194321n395278n237275m558334l275604j428528
1322G22361908Q18787L214340N476227P355041Q681183R389343R516373R174423Q512421
1331G84500046P677994O791458N936203N165100M508590L979569L571854L258056K993164
1340H28382034K728272K424316K065659J658020J221542P82471L67126O333k71378
1349H39364395m46014n23072n43594n79071p09534j000518j490250k198639l143311
$$ plain form
1287 669015045 664677353 661573029 659785843 659467239 660829544 664098511 669440002 676871872 686189575
1296 686189575 696931229 708409424 719811096 730355682 739460449 746855545 752603989 757010651
1304 757010651 760458755 763240509 765453186 767001648 767692337 767358932 765957108 763580856 760403214
1313 760403214 756592178 752255630 747451248 742256927 736861649 731624374 727066040 723790436 722361908
1322 722361908 723180695 726395035 731871262 739226303 747907486 757296829 766813202 775987625 784500046
1331 784500046 792178040 798969498 804905701 810070801 814579391 818558960 822130814 825388870 828382034
1340 828382034 831110306 833534622 835600281 837258301 838479843 839262314 839629440 839635773 839364395
1349 839364395 838918381 838395309 837851715 837272644 836563110 835562592 834072342 831873703 828730392
1358H28730392m336547n752945p268219q620224r430237r310608q026199n636063k535019
1367G67814331O41861L226852M741288N034408M284287K873840J217957l65220j696472
1376G87773132k697143l324356l540345l326568k729187j879044r66568j75934L81165
1385G69515152O91833Q14209Q18253P38678N69000K99759l8986l59039n44358n15976
1395G71988525k81448N1498L21885L87344J89209k27509p45468j237869j622162j885147
1405G66938858k067032k223816k393341k581940k776870k968140l161087l373108l608093
1414G41785431l831940l963470l893051l524857k829590j873169q12835J55792Q67691
1423G22080002J252670J357269J313019J264191J296844J400452J487885J459884J270447
$$ plain form
1358 828730392 824393845 818640900 811372681 802752457 793322220 784011612 775985413 770349350 767814331
1367 767814331 768456192 771683044 776424332 781458740 785743027 788616867 789834824 789469604 787773132
1376 787773132 785075989 781751633 778211288 774884720 772155533 770276489 769309921 769133987 769515152
1385 769515152 770206985 771021194 771839447 772578125 773147125 773446884 773407898 773048859 772504501 771988525
1395 771988525 771707077 771758575 772080460 772467804 772657013 772429504 771684036 770446167 768824005 766938858
1405 766938858 764871826 762648010 760254669 757672729 754895859 751927719 748766632 745393524 741785431
1414 741785431 737953491 733990021 730096970 726572113 723742523 721869354 721056519 721212311 722080002
1423 722080002 723332672 724689941 726002960 727267151 728563995 729964447 731452332 732912216 734182663
1432G34182663R64432O53076M53033M17481N08575O17447O23093M49295R0027m00849
1442G38558273r41238j449051j854782k105484k181702k127380k074814k229233k790069
1451G20804520l835221n223770o591949p465897p459030o449585m644394k484360m38003
1460F76212311J202011K408371L352203M231949N112534N870819O281204O173859N562820
1469G16408081M658356L761368L104324K741089K541580K292404J827393J112213K42157
1478G38688965o39801j442032k179184k951050l858032m897995n897369o522217o370468
1487G03930817n124817k706070O44073M393311P875824J0518417J2034226J2493133
1495G44058914J2228089J1622924J0900422J0027999Q801117P050400M843674K554779
$$ plain form
1432 734182663 735147095 735800171 736253204 736670685 737179260 737796707 738419800 738869095 738959122 738558273
1442 738558273 737617035 736167984 734313202 732207718 730026016 727898636 725823822 723594589 720804520
1451 720804520 716969299 711745529 705153580 697687683 690228653 683779068 679134674 676650314 676212311
1460 676212311 677414322 679822693 683174896 687406845 692519379 698390198 704671402 710845261 716408081
1469 716408081 721066437 724827805 727932129 730673218 733214798 735507202 737334595 738446808 738688965
1478 738688965 738049164 736607132 734427948 731476898 727618866 722720871 716823502 710301285 703930817
1487 703930817 698806000 696099930 696744003 701137314 709013138 719531555 731565781 744058914
1495 744058914 756287003 767909927 778810349 788838348 797639465 804689865 809533539 812088318
1503H12088318P35168j39236Q8119J161194K523270L569336L903580L473053K524490
1512H29927292J433105N10407j06888m51965o39496p62406q31451p90024n65491j32675
1522H27590408M50821J051331J500625J657029J465072R87778L96881r5825l34244
1531H34669876l03345j53503j33591m56085j161728k057800k778778k951126k377091
1540H22296829j151962L62778J688079K432251K449112J876145J044922L10669j11847
1549H31196976k31858k54516m61121j044311j986847l027191l745881l741226k826843
1558H13877182j157227P88956K380295L090668K728195J511307m5166j390229k200851
1567H19583130k506333k613525k864532l388138l978806m196090l615647k097397Q6213
$$ plain form
1503 812088318 812823486 812684250 812772369 813933563 816456833 820026169 823929749 827402802 829927292
1512 829927292 831360397 831870804 831763916 831311951 830672455 829910049 829078598 828288574 827723083 827590408
1522 827590408 828041229 829092560 830593185 832250214 833715286 834703064 835099945 835004120 834669876
1531 834669876 834366531 834213028 834079437 833623352 832461624 830403824 827625046 824673920 822296829
1540 822296829 821144867 821507645 823195724 825627975 828077087 829953232 830998154 831308823 831196976
1549 831196976 830965118 830710602 830249481 829205170 827218323 824191132 820445251 816704025 813877182
1558 813877182 812719955 813508911 815889206 818979874 821708069 823219376 823174210 821783981 819583130
1567 819583130 817076797 814463272 811598740 808210602 804231796 800035706 796420059 794322662 794408875
1576G94408875K341995M012146M657669M226379L026276J544189K19040p15484j251526
1585H12469559j522751j677780j789933j845932j788101j580429j246872q72650n70221
1594G99574890m32815n00489p46460j091537j440888j726226j934967k108002k304230
1603G87289276k552795k821045l027878l098297l030777k924652k941437l213882l753052
1612G59925461m414215m956284n162811m963379m478302l960419l670425l747482m155884
1621G20416260m718933n219193n503616n539475n412063n279770n315476n660171o385574
1630F71381989p466202q766861j0060196j1090050j1672401j1787072j1613769j1467896
1638E87457542j1652336j2294502j3245239j4107743j4381370j3665123j1809464q955078
$$ plain form
1576 794408875 796750870 800763016 805420685 809647064 812673340 814217529 814436569 813721085 812469559
1585 812469559 810946808 809269028 807479095 805633163 803845062 802264633 801017761 800145111 799574890
1594 799574890 799142075 798641586 797895126 796803589 795362701 793636475 791701508 789593506 787289276
1603 787289276 784736481 781915436 778887558 775789261 772758484 769833832 766892395 763678513 759925461
1612 759925461 755511246 750554962 745392151 740428772 735950470 731990051 728319626 724572144 720416260
1621 720416260 715697327 710478134 704974518 699435043 694022980 688743210 683427734 677767563 671381989
1630 671381989 663915787 655148926 645088730 633998680 622326279 610539207 598925438 587457542
1638 587457542 575805206 563510704 550265465 536157722 521776352 508111229 496301765 487346687
1646D87346687n433273j606102K281075O142349R973907J3720551J7161674J9909325
1654E49496193K1528969K1732864K0538941J8300857J5585404J2947921J0722504Q932877
1662F79786530P370758N778122M034347K232437O11420n99060j321182j662140j828003
1671F94403229j985550k168274k293549k273483k135620k056732k278443k950286m006348
1680F72254944n161972o043854o386948o179199n678863n292435n392838o171913p598152
1689F18348770r479217j1572190j3669281j5616226j7273369j8467483j8975563j8569451
1697D94725990j7098159j4573060j1214141p436867l763924o98166J416207K498397
1705D43856277K755967K612152K550773K930375L844642N088310O244812O859780O618690
$$ plain form
1646 487346687 481913414 480307312 482588387 488730736 498704643 512425194 529586868 549496193
1654 549496193 571025162 592758026 613296967 631597824 647183228 660131149 670853653 679786530
1662 679786530 687157288 692935410 696969757 699202194 699813614 699214554 697893372 696231232 694403229
1671 694403229 692417679 690249405 687955856 685682373 683546753 681490021 679211578 676261292 672254944
1680 672254944 667092972 661049118 654662170 648482971 642804108 637511673 632118835 625946922 618348770
1689 618348770 608869553 597297363 583628082 568011856 550738487 532271004 513295441 494725990
1697 494725990 477627831 463054771 451840630 444403763 440639839 439941673 441357880 443856277
1705 443856277 446612244 449224396 451775169 454705544 458550186 463638496 469883308 476743088 483361778
1714D83361778N456505L561363J292076r32846k725296l764228l803139k685433l84407
1723D79376373K942353O928520J1045341J4726029J7525329J9242630J9948998J9903831
1731E91639404J9408951J8670349J7745056J6585389J5140380J3453598J1687317J0065003
1739G14395447Q764877P833862P171326O594696N946045N180130M385986L729325L355713
1748G67357407L308105L502579L771896L944245L918457L691558L335419K948151K609710
1757G98387527K362519K222595K191849K264328K409897K560043K611542K462616K066574
1766H19539490J477661Q48846L82004K40784M76455J000596J619949K117920K339630
1775H30043335K241592J890641J422271R81903O82602N78156O62155Q70819J099014
$$ plain form
1714 483361778 488818283 492379646 493671722 492738876 490013580 486249352 482446213 479760780 479376373
1723 479376373 482318726 489247246 500292587 515018616 532543945 551786575 571735573 591639404
1731 591639404 611048355 629718704 647463760 664049149 679189529 692643127 704330444 714395447
1739 714395447 723160324 730994186 738165512 744760208 750706253 755886383 760272369 764001694 767357407
1748 767357407 770665512 774168091 777939987 781884232 785802689 789494247 792829666 795777817 798387527
1757 798387527 800750046 802972641 805164490 807428818 809838715 812398758 815010300 817472916 819539490
1766 819539490 821017151 821865997 822248001 822488785 822965240 823965836 825585785 827703705 830043335
1775 830043335 832284927 834175568 835597839 836579742 837262344 837840500 838502655 839373474 840472488
1784H40472488J225815J154099Q55865M02909m7303l06778k44140J43966P18918J253662
1794H45629501J535416J471786J127930O94733L90014L47138N57251Q82645J137161
1803H53773575J182937R94568O58722L19901J03531O0348J61286L26538M78515N73273
1813H58633194O07452N96695N56412M88052L88413K61383J25503N265q5373j49918
1823H61427078k02942k51922k78549k42920j08643J25046M10232O64826Q15506Q37021
1833H63194733P60498O49872N49011M50287K99224M4861l05175o57731q67309q10776
1843H63307495m64401O8970N99899R42535J006165Q29620N47867L10974K03095K10113
1853H67562332K49329K35138J39465N112q6518p8353K0294J27792J40152q697k97547
$$ plain form
1784 840472488 841698303 842852402 843708267 844111176 844063873 843757095 843512955 843656921 844375839 845629501
1794 845629501 847164917 848636703 849764633 850459366 850849380 851196518 851753769 852636414 853773575
1803 853773575 854956512 855951080 856609802 856929703 857033234 857093582 857254868 857581406 858059921 858633194
1813 858633194 859240646 859837341 860393753 860881805 861270218 861531601 861657104 861662369 861576996 861427078
1823 861427078 861224136 860972214 860693665 860450745 860342102 860467148 860877380 861542206 862357712 863194733
1833 863194733 863955231 864605103 865154114 865604401 865903625 865948486 865643311 864985580 864118271 863307495
1843 863307495 862843094 862912064 863511963 864454498 865460663 866290283 866838150 867149124 867352219 867562332
1853 867562332 867811661 868046799 868186264 868191376 868104858 868026505 868046799 868174591 868314743 868306046 868008499
1864H68008499o19583q28857q11158n42068r9640L68423P13730Q44422P58896N29403
1874H68322067K60849M1962q4152j20545r8648n8594l2348m2114j01853k11334l51944
1885H67523346m84695n60608n42450m26941k50778p7973L2730N2414o027j00708j87073
1896H64971237k40555k60543k61689k59323k60696k69165k85568l11585l39050l43476
1906H62139587k90222j50985O8054L16009N10788N76401M85916K78168M4632j16425
1916H63861923j47400n4626J03683K54212L47748L77655L70330L59955L62625L68348
1926H66204453L52935K96250J99051Q4838j1291n9052m8065O485O9733J00632P1411
1937H67267380k0294j47553k60162l09449k67257j42746K1210J66473K45590K40631
$$ plain form
1864 868008499 867388916 866560059 865748901 865206833 865107193 865475616 866189346 867033768 867792664 868322067
1874 868322067 868582916 868624878 868540726 868420181 868321533 868262939 868230591 868188477 868086624 867875290 867523346
1885 867523346 867038651 866478043 865935593 865508652 865257874 865179901 865212631 865265045 865259018 865158310 864971237
1896 864971237 864730682 864470139 864208450 863949127 863688431 863419266 863133698 862822113 862483063 862139587
1906 862139587 861849365 861698380 861766434 862082443 862593231 863169632 863655548 863933716 863978348 863861923
1916 863861923 863714523 863659897 863763580 864017792 864365540 864743195 865113525 865473480 865836105 866204453
1926 866204453 866557388 866853638 867052689 867137527 867126236 867067184 867019119 867025604 867095337 867195969 867267380
1937 867267380 867247086 867099533 866839371 866529922 866262665 866119919 866141129 866307602 866553192 866793823
1947H66793823J67542O4773k8534q8119j11160j08872r5062p7591n6076k8763L204
1958H66435165L0747M1580K7161j0987n9280r6436j00708o2866J2818J04675J84708
1969H66506577K28271K24686J82037J21384O7978L6239K6779K8687K7695J5945l281
1980H67462997k0294k7084k4719k6017m5013r0103j54953k17285k49787k31552j58005
1991H66218185m8141O6376J50070J80740J54419R0866J9532k9221m1504k2507Q240
2002H66747055K4796J2435k7084p6752j13678j23901j08871q4763p3776q9417j27945
2013H65958099j69601j88217j65177r9411q850P7973J35345J51291J30234Q9645M9744
2024H65961075K3804J2817R613L357j2512l9368o9351r5368j11084j14669j08490r5902
$$ plain form
1947 866793823 866961365 867026138 866997604 866909485 866798325 866689453 866594391 866516800 866460724 866431961 866435165
1958 866435165 866465912 866507492 866534653 866523666 866464386 866367950 866267242 866204376 866217194 866321869 866506577
1969 866506577 866734848 866959534 867141571 867262955 867330933 867367172 867393951 867422638 867450333 867466278 867462997
1980 867462997 867442703 867415619 867390900 867364883 867319870 867229767 867074814 866857529 866607742 866376190 866218185
1991 866218185 866170044 866236420 866386490 866567230 866721649 866812515 866832047 866802826 866761322 866738815 866747055
2002 866747055 866771851 866784286 866757202 866680450 866566772 866442871 866334000 866249237 866175461 866086044 865958099
2013 865958099 865788498 865600281 865435104 865335693 865326843 865404816 865540161 865691452 865821686 865911331 865961075
2024 865961075 865984879 865997696 866007309 866010666 865998154 865958786 865889435 865794067 865682983 865568314 865459824 865363922
2036H65363922q0337o4316n0202m1809m2114n2414p1716r4071j11313j16348j05667
2047H64533615q2779n6534l7613l6697n4703q8806j27029j56403j68915j63269j46408
2058H63414459j30005j23672j30692j45874j56936j52665j26113p9346k3041K9297
2068H62375412O7062Q4458Q4228P2632N8823M8675M4861TM5013M1047L1890J9379Q392
2081H63026733K747N341J5335K9220M1657M9743N1575M7379L7765K4109O866j2359
2093H63326111l0976m5547n5161n8517n7754n5466n1041m2953k8000o104K0294M5395
2105H62960281O2867O9503O7139O0730N5237N2032M7150L5171J1673k2735o0349r0637
2117H63248062j03912r6436p2250m0970j4648j374n340k2354m6006o7062p9346p9269
$$ plain form
2036 865363922 865283585 865219269 865169067 865127258 865085144 865032730 864961014 864866943 864755630 864639282 864533615
2047 864533615 864450836 864394302 864356689 864319992 864265289 864176483 864049454 863893051 863724136 863560867 863414459
2058 863414459 863284454 863160782 863030090 862884216 862727280 862574615 862448502 862369156 862346115 862375412
2068 862375412 862442474 862526932 862611160 862683792 862742615 862791290 862836151 862881012 862926025 862967072 862998962 863018341 863026733
2081 863026733 863029480 863034821 863050156 863079376 863121033 863170776 863222351 863269730 863307495 863331604 863338470 863326111
2093 863326111 863295135 863249588 863194427 863135910 863078156 863022690 862971649 862928696 862900696 862894592 862914886 862960281
2105 862960281 863023148 863092651 863159790 863220520 863275757 863327789 863374939 863410110 863421783 863399048 863338699 863248062
2117 863248062 863144150 863047714 862975464 862934494 862919846 862918472 862913132 862890778 862844772 862777710 862698364 862619095
2129H62619095o6452m3869j4267J6937M4861O4621P1030O3095M3258J7777o333k2964
2141H62786789k8915k5559j5869l281R537J9074K2964J6861k213l3798p2555j08033
2153H62565002j30004j30692j10321p5226l7994p630R003J2817R308L662J984N417
2165H62115326J1368J5335J1825N34j7395l5247m5624m3717l1814j6327p477j1139
2177H61945648k7084m6845n7296m9973k2583J6785N3711P5149P3700N0736J6021j7089
2189H62010880l6469l6392j7548J0987L8223N0735M2572J5335k0675n1041o4011n5999
2201H61886597l4333j4648j3580l9139q6594j37710j70212j67236j26725o3858l662
2212H61028900K7161J6250l0212r0637j35956j46332j19629p3166l4408k7390n8288
$$ plain form
2129 862619095 862552643 862508774 862494507 862511444 862556305 862620926 862691956 862755051 862798309 862816086 862809753 862786789
2141 862786789 862757874 862732315 862716446 862713165 862722702 862741776 862764740 862781601 862779388 862745590 862673035 862565002
2153 862565002 862434998 862304306 862193985 862118759 862080765 862073135 862082138 862094955 862104263 862107925 862109909 862115326
2165 862115326 862126694 862142029 862153854 862154388 862136993 862101746 862056122 862012405 861980591 861964264 861956787 861945648
2177 861945648 861918564 861871719 861814423 861764450 861741867 861758652 861812363 861887512 861961212 862011948 862027969 862010880
2189 862010880 861974411 861938019 861920471 861931458 861969681 862020416 862062988 862078323 862057648 862006607 861942596 861886597
2201 861886597 861852264 861837616 861824036 861784897 861698303 861560593 861390381 861223145 861096420 861032562 861028900
2212 861028900 861056061 861072311 861042099 860951462 860815506 860669174 860549545 860476379 860441971 860414581 860356293
2223H60356293j14136j67618j90887j71356j15891m7836M196J9760k747m7836r0332
2234H59431610j07574r0104m4174R690M6920M8981J1215n4550j26190j77078j88828
2245H58759918j57242r3689k2659K8763M1046Q469n6839j29929j82876j95466j63574
2256H57835922j02157l7003N188R689j9912o2180r2010r0561n6305n951L4637M2343
2268H57461700R842n3482j22680j72196j84402j57929j05056m6387j068J8768J3351
2279H56660461j0757m2114p4616j07422j44729j92490k53219l21885l89633m46625
2289H54676971m86450n10254n22384n30548n36957n43976n50766n57404n66940n84106
2299H49287186o12107o52160p04117p65762q36640r13238r89533j057281j101838j111373
$$ plain form
2223 860356293 860242157 860074539 859883652 859712296 859596405 859548569 859552765 859572525 859569778 859521942 859431610
2234 859431610 859324036 859233932 859189758 859199448 859246368 859295349 859306564 859252014 859125824 858948746 858759918
2245 858759918 858602676 858508987 858486328 858515091 858556137 858564606 858507767 858377838 858194962 857999496 857835922
2256 857835922 857733765 857696762 857701950 857711639 857691727 857629547 857537537 857446976 857390671 857384720 857419357 857461700
2268 857461700 857471542 857418060 857295380 857123184 856938782 856780853 856675797 856629410 856628342 856647110 856660461
2279 856660461 856649704 856607590 856532974 856425552 856280823 856088333 855835114 855513229 855123596 854676971
2289 854676971 854190521 853680267 853157883 852627335 852090378 851546402 850995636 850438232 849871292 849287186
2299 849287186 848675079 848022919 847318802 846553040 845716400 844803162 843813629 842756348 841654510 840543137
2309H40543137j078949j008454r20028q46558q31909r15985j118470j421890j763763
2318H30637131k049485k186126k123871j884232j561203j278457j133118j146011j255570
2327H16019058j354599j351471j221389j012497q09784o80161o42929o74744p47833
2336H07523651q59833j024627j223984j359787j252060p10754L42025J768952L208847
2345H06412430M182510M286347L368682J610718n45120k567902m040527m780655m849090
2354H03077393m455414l828583l127975k421570j719971j027298l67584K22473P20062
2363G87071533J133576J498565J852036K210617K558746K862091L088456L223800L280258
2372H08779678L283692L266678L253631L256836L274765L290100L273621L191604L016892
$$ plain form
2309 840543137 839464188 838455734 837535706 836689148 835857239 834941254 833822784 832400894 830637131
2318 830637131 828587646 826401520 824277649 822393417 820832214 819553757 818420639 817274628 816019058
2327 816019058 814664459 813312988 812091599 811079102 810269318 809589157 808946228 808271484 807523651
2336 807523651 806663818 805639191 804415207 803055420 801803360 801092606 801434631 803203583 806412430
2345 806412430 810594940 814881287 818249969 819860687 819315567 816747665 812707138 807926483 803077393
2354 803077393 798621979 794793396 791665421 789243851 787523880 786496582 786128998 786351471 787071533
2363 787071533 788205109 789703674 791555710 793766327 796325073 799187164 802275620 805499420 808779678
2372 808779678 812063370 815330048 818583679 821840515 825115280 828405380 831679001 834870605 837887497
2381H37887497K741547K383804J981354J579208J214752R06143O54679M51660K89612
2390H50090256J65939Q1024L5095K2965L2501M9820O2485O3095M9438K4414n340l1357
2402H50640335m6463m6234l2959j4572l05L891j145q240r384P7J7089L1510L5705K3117
2416H50592422l128l4942o4087q1711q5220p4311n2871k8153o942L280r15j6175l4713
2429H50112534m7837n0659m6616m5089n5924q2855j17798j46866j52969j30157q3085
2440H49152679k7618J6480L4866K3880j0834n6381r8572j27945j39084j32904j14746
2451H48519821r1019o8435n1346l9749l1891k4567j5106n493p6k823j5412l4103n2261
2464H48087540o2638o3247n7755n3787o0883q1024j09711j35726j47171j37635j10626
$$ plain form
2381 837887497 840629044 843012848 844994202 846573410 847788162 848694305 849348984 849800644 850090256
2390 850090256 850256195 850337219 850372314 850395279 850427780 850477600 850540085 850603180 850652618 850677032 850671692 850640335
2402 850640335 850593872 850547638 850514679 850500107 850499802 850503693 850502548 850494308 850484924 850485001 850502090 850533600 850569305 850592422
2416 850592422 850589294 850554352 850490265 850408554 850323334 850249023 850196152 850167999 850161057 850164337 850163422 850147247 850112534
2429 850112534 850064697 850014038 849967422 849922333 849866409 849783554 849665756 849518890 849365921 849235764 849152679
2440 849152679 849125061 849141541 849176407 849200287 849189453 849133072 849034500 848906555 848767471 848634567 848519821
2451 848519821 848428802 848360367 848309021 848269272 848237381 848212814 848197708 848192215 848192139 848189316 848173904 848139801 848087540
2464 848087540 848024902 847961655 847903900 847850113 847789230 847708206 847598495 847462769 847315598 847177963 847067337
2475H47067337p8049n4397n0812o6528r2469j12609j14213r3841n7831k0599M196P248
2487H46337433j1139m2191p4539r7885j06811j01853q7967p2784o3324o3858p4692
2498H45540390r1095j04217j07499r7885p8888o0348n3253o2256q4305j07727j17569
2509H44575348j05438p2480l1967k975p7k7847p5607j23444j49154j38855r4147l1128
2521H43722229K5482N2948M1046m120o1798j05972j17569r3155m6310j297J9378N112
2533H43435974l7765q9951j28403j37634j18103q2016m8141l2044l9444o2103q6975
2544H42573395r8496q6975n3558o409L9520O8589P0724M3030n646n8365r7656j10931
2556H42277222r7504p0953m9897n0888p7514j17035j48773j52359j23825p6066l3645
$$ plain form
2475 847067337 846989288 846934891 846884079 846817551 846725082 846612473 846498260 846404419 846346588 846325989 846330185 846337433
2487 846337433 846326294 846284103 846209564 846111679 846004868 845903015 845815048 845742264 845678940 845615082 845540390
2498 845540390 845449295 845345078 845237579 845139694 845060806 845000458 844947205 844884949 844800644 844692917 844575348
2509 844575348 844469910 844397430 844365463 844362488 844362411 844334564 844258957 844135513 843986359 843847504 843753357 843722229
2521 843722229 843747711 843800659 843841705 843837585 843775787 843669815 843552246 843459091 843412781 843411484 843430862 843435974
2533 843435974 843398209 843308258 843179855 843042221 842924118 842842102 842793961 842761917 842722473 842660370 842573395
2544 842573395 842474899 842387924 842334366 842327957 842367477 842436066 842506790 842549820 842544174 842485809 842388153 842277222
2556 842277222 842179718 842108765 842058868 842007980 841930466 841813431 841664658 841512299 841388474 841312408 841278763
2567H41278763k0142m3869r4604j48011j79367j76925j45722j02462o6910m8523m5319
2578H40206909m8675m8294m1275l0518k2049j9760k3575l0899l9673n1575o8512r1018
2590H39691086j13526j26953j23520j01242o8435l7613k3117l1128n8060r2773j23597
2601H38791122j42669j50376j53427j58615j68686j79672j84250j73721j45493j04217
2611H37229996o0730k7008j1139j4267k9755m7607n9586o2561o0272n9662o6299q0796
2623H36650314r7732j08185j05133q7128n8059k8458o714%r308l0289n4702p3319p8277
2636H35913010o6605m1428j0681J3962K2659J2818j1444l8224n6839o1798n5771m9820
2648H35569839n4016p1945r8572j21612j28861j15661q7967n7450l8223l6163m9667
$$ plain form
2567 841278763 841258621 841214752 841120148 840972137 840792770 840615845 840470123 840367661 840300751 840252228 840206909
2578 840206909 840158234 840109940 840068665 840038147 840016098 839996338 839972763 839941864 839902191 839850616 839782104 839691086
2590 839691086 839577560 839450607 839327087 839225845 839157410 839119797 839096680 839065552 839007492 838914719 838791122
2601 838791122 838648453 838498077 838344650 838186035 838017349 837837677 837653427 837479706 837334213 837229996
2611 837229996 837169266 837142258 837131119 837116852 837087097 837039490 836979904 836917343 836857071 836797409 836731110 836650314
2623 836650314 836552582 836444397 836339264 836252136 836194077 836165619 836158905 836158905 836149597 836119308 836064606 835991287 835913010
2636 835913010 835846405 835804977 835794296 835808258 835830917 835843735 835832291 835794067 835737228 835675430 835619659 835569839
2648 835569839 835515823 835443878 835345306 835223694 835094833 834979172 834891205 834833755 834795532 834759369 834709702
2659H34709702o8894q3160q6823p8506o3553m7073l5859l2196l7841n0583o8665q4000
2671H33972549r1476q6594o9503m9363l6850m1351o4773r8267j28326j40458j29928
2682H33035660j02539p1106n0125m6769n8288p4463q3313p8583o2713m4175l5018m3107
2694H32285461p0724j12152j57776j95236k16065k16446j99585j72882j47247j30844
2704H30666504j27640j34201j45416j52588j52817j45492j36414j31226j35040j47247
2714H29258423j64414j80053j89896j90887j85929j80053j79062j88141k06146k27433
2724H27366409k45742k53449k49100k36664k24075k20260k29340k48947k71683k87857
2734H24899292k88925k71378k37503j93558j49230j14823r7351r8724j15738j37711
$$ plain form
2659 834709702 834640808 834557648 834470825 834392319 834328766 834281693 834245834 834213638 834175797 834125214 834056549 833972549
2671 833972549 833881073 833794479 833724976 833675613 833638763 833597412 833532639 833434372 833306046 833165588 833035660
2682 833035660 832933121 832862015 832811890 832765121 832706833 832632370 832549057 832470474 832407761 832363586 832328568 832285461
2694 832285461 832214737 832102585 831944809 831749573 831533508 831317062 831117477 830944595 830797348 830666504
2704 830666504 830538864 830404663 830259247 830106659 829953842 829808350 829671936 829540710 829405670 829258423
2714 829258423 829094009 828913956 828724060 828533173 828347244 828167191 827988129 827799988 827593842 827366409
2724 827366409 827120667 826867218 826618118 826381454 826157379 825937119 825707779 825458832 825187149 824899292
2734 824899292 824610367 824338989 824101486 823907928 823758698 823643875 823546524 823447800 823332062 823194351
2744H23194351j53198j52435j34964j09787r0561q9722j10779j45721j79138j95847
2754H21832199j91650j71356j52283j49307j70060k10266k56729k92053l06244k97165
2764H19635086k72369k43759k20337k07367k03019k02407k01416j99204j98898k05765
2774H17480545k22168k47345k74582k94266k99835k89688k68402k46887k34451k37122
2784H14865799k55051k81753l08991l27606l31039l16239k84118k39869j93100j56478
2794H12171555j41678j53275j87378k32010k69470k87170k79618k53143k20032j91803
2804H09955978j76239j71737j73645j75782j75170j72043j68152j64719j61743j59149
2814H08257599j56708j55411j54953j52969j47247j34278j17492j03684j01089j16349
$$ plain form
2744 823194351 823041153 822888718 822753754 822643967 822553406 822463684 822352905 822207184 822028046 821832199
2754 821832199 821640549 821469193 821316910 821167603 820997543 820787277 820530548 820238495 819932251 819635086
2764 819635086 819362717 819118958 818898621 818691254 818488235 818285828 818084412 817885208 817686310 817480545
2774 817480545 817258377 817011032 816736450 816442184 816142349 815852661 815584259 815337372 815102921 814865799
2784 814865799 814610748 814328995 814020004 813692398 813361359 813045120 812761002 812521133 812328033 812171555
2794 812171555 812029877 811876602 811689224 811457214 811187744 810900574 810620956 810367813 810147781 809955978
2804 809955978 809779739 809608002 809434357 809258575 809083405 808911362 808743210 808578491 808416748 808257599
2814 808257599 808100891 807945480 807790527 807637558 807490311 807356033 807238541 807134857 807033768 806917419
2824H06917419j47552j85165k16752k34146k39944k44827k62070k99759l52325m04435
2834H04330444m39071m46167m28086l99704l79181l79867m04511m46624m95377n41916
2844G99969940n79376o05316o16684o09818n85251n47714n08270m81949m80728n08194
2854G94446640n57404o13555o61087o91147p02439p02591p02743p13043p37763p76367
2864G87588501q22601q67386r01032r15527r08051q80661q42056q02688p70798p51953
2874G79125748p46003p51037p65915p91016q28323q77686r36584r96094j047668j081620
2884G70303802j095123j089325j071548j051560j038055j036987j049042j069260j089554
2893G60713348j104354j109467j109695j113434j127396j152496j178818j190414j170960
$$ plain form
2824 806917419 806769867 806584702 806367950 806133804 805893860 805649033 805386963 805087204 804734879 804330444
2834 804330444 803891373 803445206 803017120 802617416 802238235 801858368 801453857 801007233 800511856 799969940
2844 799969940 799390564 798785248 798168564 797558746 796973495 796425781 795917511 795435562 794954834 794446640
2854 794446640 793889236 793275681 792614594 791923447 791221008 790518417 789815674 789102631 788364868 787588501
2864 787588501 786765900 785898514 784997482 784081955 783173904 782293243 781451187 780648499 779877701 779125748
2874 779125748 778379745 777628708 776862793 776071777 775243454 774365768 773429184 772433090 771385422 770303802
2884 770303802 769208679 768119354 767047806 765996246 764958191 763921204 762872162 761802902 760713348
2893 760713348 759608994 758499527 757389832 756276398 755149002 753996506 752817688 751627274 750456314
2902G50456314j113434j026306r27124q37784p72400p32422p08007o85959o58646o29272
2912G42364960o10733o16608o53687p16629p91015q58536r05228r27505r32160r32159
2922G34420700r39026r58633r86634j011734j016769r88464r17359q03833o55975m86527
2932G25655746l10516j42288P172J28021K15454K65884K79694K60010K11563J40762
2942G26711502N3101m6540j55029k69241l87192n04303o15387p10526p77359p99102
2952G22499924p60346o47430m59061k05765Q3924L72543O17142P80411Q39843P90406
2962G23911591O43386M25568J70212q6899l14407m90418o06155o68640o97327p18231
2972G21568680p50427p98798q46405q58841p96509o30188l54156R918M15878Q09250
$$ plain form
2902 750456314 749342880 748316574 747389450 746551666 745779266 745046844 744338837 743652878 742994232 742364960
2912 742364960 741754227 741137619 740483932 739767303 738976288 738117752 737212524 736285019 735352859 734420700
2922 734420700 733481674 732523041 731536407 730524673 729507904 728519440 727602081 726798248 726142273 725655746
2932 725655746 725345230 725202942 725210114 725338135 725553589 725819473 726099167 726359177 726570740 726711502
2942 726711502 726764603 726718063 726563034 726293793 725906601 725402298 724786911 724076385 723299026 722499924
2952 722499924 721739578 721092148 720633087 720427322 720511246 720883789 721500931 722281342 723121185 723911591
2962 723911591 724554977 724980545 725150757 725063858 724749451 724259033 723652878 722984238 722286911 721568680
2972 721568680 720818253 720019455 719173050 718314209 717517700 716887512 716533356 716543274 716959152 717768402
2982G17768402J139603J373062J497421J520233J464005J358490J236648J126709J051789
2991G29536362J024322J048432J120224J230621J369324J523513J678696J814728J908569
3000G42254791J940460J897660J783142J614227J418457J223831J048813Q98133P65380
3009G54844894O41022N18265M01764K99454K21557J70593J38321J08948O6986M196
3019G57416000p5225j56327k22778k62222k76871k79160k87017l14560l64151m27704
3029G54749985m89884n38406n69992n89142o05774o27823o57120o88934p18384p43103
3039G48521423p68051q01697q51440r17969r94491j069870j132660j177597j205521
3048G39602127j222458j237335j255722j278839j303711j324921j335754j333008j317902
$$ plain form
2982 717768402 718908005 720281067 721778488 723298721 724762726 726121216 727357864 728484573 729536362
2991 729536362 730560684 731609116 732729340 733959961 735329285 736852798 738531494 740346222 742254791
3000 742254791 744195251 746092911 747876053 749490280 750908737 752132568 753181381 754079514 754844894
3009 754844894 755485916 756004181 756405945 756705399 756926956 757097549 757235870 757344818 757411804 757416000
3019 757416000 757340775 757184448 756961670 756699448 756422577 756143417 755856400 755541840 755177689 754749985
3029 754749985 754260101 753721695 753151703 752562561 751956787 751328964 750671844 749982910 749264526 748521423
3039 748521423 747753372 746951675 746100235 745182266 744187775 743117905 741985245 740807648 739602127
3048 739602127 738379669 737142334 735886612 734607773 733304062 731979141 730643387 729310379 727992477
3057G27992477j295394j273804j258927j254806j259461j267929j276626j283035j291199
3066G16531296j307068j335602j377182j428986j484756j540451j594086j646805j700515
3075G03115845j750489j792373j818466j824570j813736j794128j774369j760483j749801
3084F87037430j735382j706085j655655j584473j499176j410599j330108j265183j218719
3093F73632050j191178j178741j175003j170655j156082j121750j064911r88769r04770
3102F63680191q28094p71943p43255p40051p50504p56760p42416o95419o13175n01709
3112F56536865l76663k54593j50452p0800j2360L6240R0637J62430K57873L74222N01633
3123F57095032O30951P52716Q63342R61304J049652J132049J212998J296081J381379
$$ plain form
3057 727992477 726697083 725423279 724164352 722909546 721650085 720382156 719105530 717822495 716531296
3066 716531296 715224228 713888626 712511444 711082458 709597702 708057251 706463165 704816360 703115845
3075 703115845 701365356 699572983 697754517 695929947 694116211 692322083 690547714 688787231 687037430
3084 687037430 685302048 683595963 681940308 680355835 678856659 677446060 676115952 674850769 673632050
3093 673632050 672440872 671262131 670087128 668916473 667760391 666638641 665573730 664584961 663680191
3102 663680191 662852097 662080154 661336899 660596848 659846344 659089584 658347168 657651749 657038574 656536865
3112 656536865 656160202 655905609 655755157 655684357 655671997 655708237 655798874 655961304 656219177 656593399 657095032
3123 657095032 657725983 658478699 659342041 660303345 661352997 662485046 663698044 664994125 666375504
3132F66375504J464462J536331J586838J607208J595688J558151J502609J438218J367874
3141F80032883J290817J205597J114883J027375R55276R07059Q81424Q67386Q48236
3150F89130936Q10928P51724O77109N98602N25132M60052L98331L33404K61994J83639
3160F94131851J03378K4338n3711j33972k20337l11050m01612m83322n50308n99975
3170F91505280o37360o69937p05261p48749p99179q51288q96225r25140r30787r13543
3180F83427811q79135q44346q23593q32214q73032r37500j010132j072387j114884
3189F75040588j138610j154938j178665j215744j264496j312180j344909j355286j347199
3198F63728561j332473j326599j338425j367951j408844j450576j489869j526413j564483
$$ plain form
3132 666375504 667839966 669376297 670963135 672570343 674166031 675724182 677226791 678665009 680032883
3141 680032883 681323700 682529297 683644180 684671555 685626831 686533890 687415314 688282700 689130936
3150 689130936 689941864 690693588 691370697 691969299 692494431 692954483 693352814 693686218 693948212 694131851
3160 694131851 694235229 694259567 694205856 694071884 693851547 693540497 693138885 692655563 692105255 691505280
3170 691505280 690867920 690197983 689492722 688743973 687944794 687093506 686197281 685272141 684341354 683427811
3180 683427811 682548676 681704330 680880737 680048523 679175491 678237991 677227859 676155472 675040588
3189 675040588 673901978 672747040 671568375 670352631 669088135 667775955 666431046 665075760 663728561
3198 663728561 662396088 661069489 659731064 658363113 656954269 655503693 654013824 652487411 650922928
3207F50922928j606827j651459j692047j722488j740647j751937j765786j790771j828575
3216F35372391j872826j908646j923446j908684j866875j809234j750222j702499j670685
3225F18959274j648979j627769j595688j546440j480103j402130j318359j231881j141014
3234F05966911j042289r32122q14209o96144n87005m92096m08135l24211k26517j05056
3244F00339127M0893K02561L68118N28030O81687Q37860J008529J203041J421471J654282
3254F08285599J883163K090111K262421K395744K493019K562141K611008K645912K670517
3263F29899635K686310K694664K696877K692146K680283K657928K623215K576065K519531
3272F53726654K459259K401276K347946K297363K243729K181549K108154K026138J942750
$$ plain form
3207 650922928 649316101 647664642 645972595 644250107 642509460 640757523 638991737 637200966 635372391
3216 635372391 633499565 631590919 629667473 627758789 625891914 624082680 622332458 620629959 618959274
3225 618959274 617310295 615682526 614086838 612540398 611060295 609658165 608339806 607107925 605966911
3234 605966911 604924622 603992500 603178291 602482147 601895142 601403046 600994911 600670700 600444183 600339127
3244 600339127 600380020 600582581 600950699 601478729 602160416 602998276 604006805 605209846 606631317 608285599
3254 608285599 610168762 612258873 614521294 616917038 619410057 621972198 624583206 627229118 629899635
3263 629899635 632585945 635280609 637977486 640669632 643349915 646007843 648631058 651207123 653726654
3272 653726654 656185913 658587189 660935135 663232498 665476227 667657776 669765930 671792068 673734818
3281F73734818J866302J802444J752015J710052J669693J625061J573105J516953J462173
3290F88712616J414261J374664J339951J299972J245804J171112J079025R80759Q90198
3299F99508362Q18634P66601P24869O78482O15921N36194M47769L65372L02124K60086
3309G05024414K32468K08282J76697J33285P9194J8463m3793j02921j52511j85928
3319G05387650j97449j87073j64108j45416j47400j80359k39716l09448l70865m10461
3329G03035355m26484m29763m30832m37317m46625m49905m40369m19159l97110l90243
3339F98767548m10309m58374n23377n86319o30493o48270o43997o33163o32019o52466
3349F92948761o96716p58515q26111q87909r35974r68475r87549r95559r98154r99756
$$ plain form
3281 673734818 675601120 677403564 679155579 680865631 682535324 684160385 685733490 687250443 688712616
3290 688712616 690126877 691501541 692841492 694141464 695387268 696558380 697637405 698618164 699508362
3299 699508362 700326996 701093597 701818466 702496948 703112869 703649063 704096832 704462204 704764328 705024414
3309 705024414 705256882 705465164 705641861 705775146 705854340 705872803 705829010 705726089 705573578 705387650
3319 705387650 705190201 705003128 704839020 704693604 704546204 704365845 704126129 703816681 703445816 703035355
3329 703035355 702608871 702179108 701748276 701310959 700864334 700414429 699974060 699554901 699157791 698767548
3339 698767548 698357239 697898865 697375488 696789169 696158676 695510406 694866409 694233246 693601227 692948761
3349 692948761 692252045 691493530 690667419 689779510 688843536 687875061 686887512 685891953 684893799 683894043
3359F83894043j002808j008834j013337j008224r81445r25446q39310p33566o26602
3368F75754471n37415m79431m53796m51737m59366m66308m70505m78821n01556n47104
3378F70908432o14777o93206p63474q06122q09936p75223p16324o56052o14624o02493
3388F63856201o15082o34613o41098o20498n73655n12161m54330m11606l87726l74679
3398F58630753l63846l49579l34625l23868l24326l34854l50723l63846l68576l64075
3408F55152435l54690l44467l38059l37372l42636l52402l62548l69110l64304l42178
3418F51644669l01896k46963j86768j31836r0026o4011n1422m5929m2496l4790j9607
3429F50428925M425L6239P3166J08719J36185J51291J52664J43966J28556J12991R8877
$$ plain form
3359 683894043 682891235 681882401 680869064 679860840 678879395 677953949 677114639 676381073 675754471
3368 675754471 675217056 674737625 674283829 673832092 673372726 672906418 672435913 671957092 671455536 670908432
3378 670908432 670293655 669600449 668836975 668030853 667220917 666445694 665729370 665073318 664458694 663856201
3388 663856201 663241119 662606506 661965408 661344910 660771255 660259094 659804764 659393158 659005432 658630753
3398 658630753 658266907 657917328 657582703 657258835 656934509 656599655 656248932 655885086 655516510 655152435
3408 655152435 654797745 654453278 654115219 653777847 653435211 653082809 652720261 652351151 651986847 651644669
3418 651644669 651342773 651095810 650909042 650777206 650687180 650623169 650571747 650525818 650483322 650448532 650428925
3429 650428925 650433350 650469589 650542755 650651474 650787659 650938950 651091614 651235580 651364136 651477127 651576004
3440F51576004Q9951R0408J05362J40991J98364K72980L53775M27094M83245N17655
3450F54255829N32074N31082N19028M97131M65775M25720L80859L37677L02887K84577
3460F58532639K87323L14407L64685M31137M99954N53284N75790N63202N25513M85840
3470F63133774M68216M84771N27573N72815N91202N68237N10788M45252M04281M05502
3480F68112411M46930N06897N59159N85708N85862N69534N49011N30853N14450M98810
3490F73459625M89350M95681N23682N67245O05546O10733N69152M89884M06189L58810
3500F78575897L72620M38385N20859N75103N78308N40925N03768N13154N91964P27158
3510F83938141Q73184R77707J008377R63211Q68225P58362O58646N77087N07965M43421
$$ plain form
3440 651576004 651665955 651756363 651861725 652002716 652201080 652474060 652827835 653254929 653738174 654255829
3450 654255829 654787903 655318985 655838013 656335144 656800919 657226639 657607498 657945175 658248062 658532639
3460 658532639 658819962 659134369 659499054 659930191 660430145 660983429 661559219 662122421 662647934 663133774
3470 663133774 663601990 664086761 664614334 665187149 665778351 666346588 666857376 667302628 667706909 668112411
3480 668112411 668559341 669066238 669625397 670211105 670796967 671366501 671915512 672446365 672960815 673459625
3490 673459625 673948975 674444656 674968338 675535583 676141129 676751862 677321014 677810898 678217087 678575897
3500 678575897 678948517 679386902 679907761 680482864 681061172 681602097 682105865 682619019 683210983 683938141
3510 683938141 684811325 685789032 686797409 687760620 688628845 689387207 690045853 690622940 691130905 691574326
3520F91574326L86505L48892L48816M01306N08652O60782Q34121R94950J108398J145935
3530F98312683J099548R89304Q63037P75986P66220Q28705R12094R42688Q64868O78330
3540G07033463M46319K66800K22015L30887N43137P65533R16443R68781R54818R33762
3550G13381958R49478J003037J063232J101074J115647J132965J169510J195602J131287
3559G23243790Q88672M43038j19171o09359q14972o04706m425Q08639J578827K085114
3569G26895447K226028K039795J663056J264419R80835Q88596R93881J237564J500549
3578G39690170J632996J503830J065903M05197k67334o94580o91605k41165M86755
3587G42890167J217118J695480J804123J593323J228256Q89663O92673O64902P74155
$$ plain form
3520 691574326 691960831 692309723 692658539 693059845 693568497 694229279 695063400 696058350 697166748 698312683
3530 698312683 699412231 700401535 701264572 702040558 702806778 703635483 704547577 705490265 706355133 707033463
3540 707033463 707479782 707746582 707968597 708299484 708842621 709608154 710524597 711493378 712448196 713381958
3550 713381958 714331436 715334473 716397705 717498779 718614426 719747391 720916901 722112503 723243790
3559 723243790 724132462 724575500 724456329 723846970 723031998 722427292 722422867 723231506 724810333 726895447
3569 726895447 729121475 731161270 732824326 734088745 735069580 735958176 736952057 738189621 739690170
3578 739690170 741323166 742826996 743892899 744298096 744030762 743336182 742644577 742403412 742890167
3587 742890167 744107285 745802765 747606888 749200211 750428467 751318130 752010803 752675705 753449860
3596G53449860R74273J226654J488648J690597J742173J565551J149521N81513K9754
3605G63898544l19061l38135j3733N44129J136017J538009J575241J196671N16815
3614G69734497j92261n82275l76358M74167J706924K809983L229370K638778J131745
3623G80574570p79496k375488l051224k583313j207656N23834K011795K860412K986374
3632G78959808K575455J935043J356278J031723J032028J307373J686936J902160J660385
3641G93447189P77665o80008k347031l658142m084397l394775j791458J60446J787033
3650G80216522K608414K530136J834106R97315M49295M00085Q02689J429977K000122
3659G93268661K277909K133331J559982O73752l15017j161652j678772j824341j721878
$$ plain form
3596 753449860 754424133 755650787 757139435 758830032 760572205 762137756 763287277 763868790 763898544
3605 763898544 763579483 763241348 763227615 763771744 764907761 766445770 768021011 769217682 769734497
3614 769734497 769542236 768959961 768583603 769057770 770764694 773574677 776804047 779442825 780574570
3623 780574570 779795074 777419586 774368362 771785049 770577393 771101227 773113022 775973434 778959808
3632 778959808 781535263 783470306 784826584 785858307 786890335 788197708 789884644 791786804 793447189
3641 793447189 794224854 793544846 791197815 787539673 783455276 780060501 778269043 778429489 780216522
3650 780216522 782824936 785355072 787189178 788186493 788635788 789035873 789838562 791268539 793268661
3659 793268661 795546570 797679901 799239883 799913635 799598618 798436966 796758194 794933853 793211975
3668G93211975j597519j638946j871872k123185k108612j595535n46570Q43811K234116
3677G84807663L279419L754883L591308K843476J637039J48544j380081k643662l326797
3686G92711792l216705k317047q79670O70777J904907K544250K537079K018814J216355
3695G97190552L51791l89709q54493r24224n55573J49002R14841J364288J183167L01208
3705G98730850j024551k287903k953720k707596j602554k7466J474075K439118K649460
3714G94689713K169952J262207K48413o05316j146011j328736j183166p78427k06681
3723G93121948M14047R35593J182175R89532K75879q77380k175751l160248l359146
3732G87346649k512054p51496J372528L081818L709183L023758J361313n35355j890335
$$ plain form
3668 793211975 791614456 789975510 788103638 785980453 783871841 782276306 781729736 782573547 784807663
3677 784807663 788087082 791841965 795433273 798276749 799913788 800062332 798682251 796038589 792711792
3686 792711792 789495087 787178040 786298370 786969147 788874054 791418304 793955383 795974197 797190552
3695 797190552 797542343 797152634 796298141 795373917 794818344 794967346 795882187 797246475 798429642 798730850
3705 798730850 797706299 795418396 792464676 789757080 788154526 788127060 789601135 792040253 794689713
3714 794689713 796859665 798121872 798370285 797764969 796618958 795290222 794107056 793328629 793121948
3723 793121948 793535995 794471588 795653763 796643295 796919174 796041794 793866043 790705795 787346649
3732 787346649 784834595 784083099 785455627 788537445 792246628 795270386 796631699 796096344 794206009
3741G94206009k284165j842422j107407o83136q59527j446610j912841j736298p41654
3750G81591949P73011K198791K959290K821197J997299R95865L20206K08054N46493
3759G94412155R86633J168900R15146K94494m46090j020966j227646j008911m41971
3768G93631744L00980J001740J449813J499024J125641M54330k73285p94525r44443
3777G97451019p33719l33328K9831K01798J81884R8496J04065K65350N21088P33566
3787G98520050P91168O81305M83628K90832J22299r2087m47616r64050j529999j946411
3797G95909119k044297j796569j337586q72192n33600k92053J2512N36041J278610
3806G90859985K034226K478714K352829J617584M89426o75202j562195k040786k173615
$$ plain form
3741 794206009 791921844 790079422 788972015 788288879 787429352 785982742 784069901 782333603 781591949
3750 781591949 782364960 784563751 787523041 790344238 792341537 793337402 793657608 793865662 794412155
3759 794412155 795398788 796567688 797482834 797777328 797331238 796310272 795082626 794073715 793631744
3768 793631744 793932724 794934464 796384277 797883301 799008942 799463272 799189987 798395462 797451019
3777 797451019 796717300 796383972 796413803 796615601 796797485 796895981 797000046 797265396 797786484 798520050
3787 798520050 799311218 799992523 800476151 800766983 800889282 800797195 800349579 799385529 797855530 795909119
3797 795909119 793864822 792068253 790730667 789858475 789324875 789032822 789045334 789581375 790859985
3806 790859985 792894211 795372925 797725754 799343338 799832764 799157562 797595367 795554581 793380966
3815G93380966k113266j961136j696624j218720m64554M84162J394119J985931K085419
3824G91876297J725845J132126N88150K73133J62658O2790k50473q66241j655732k325668
3834G90722885k575683k266007j493606n24750L68347J060638J618042K188721K818146
3843G91916733L318939L292236K337799L34855k366486m982681o580124o485138m612427
3852G76173706j543350J701965M088593M985046M378891K806091J044007k54975q17871
3861G92562103p86972n47333m67910o96411j107407j411362j342010q13904K9526R00497
3871G86318817J511765J702270J485748J001664M25567j07650n25589p96662q98895
3880G90117035q17413n72129k40936M7989J75095J03683q0643k02484r0179L13949
$$ plain form
3815 793380966 791267700 789306564 787609940 786391220 785926666 786410828 787804947 789790878 791876297
3824 791876297 793602142 794734268 795322418 795595551 795758209 795820999 795570526 794704285 793048553 790722885
3834 790722885 788147202 785881195 784387589 783862839 784231186 785291824 786909866 789098587 791916733
3843 791916733 795235672 798527908 800865707 801200562 798834076 793851395 787271271 780786133 776173706
3852 776173706 774630356 776332321 780420914 785405960 789784851 792590942 793634949 793379974 792562103
3861 792562103 791775131 791227798 790759888 790063477 788956070 787544708 786202698 785388794 785418320 786318817
3871 786318817 787830582 789532852 791018600 792020264 792445831 792338181 791812592 791015930 790117035
3880 790117035 789299622 788727493 788486557 788534546 788709641 788813324 788732681 788530197 788440018 788753967
3890G88753967R00040J424179J614151J296692M79507o44607j769562k584839k874450
3899G86595078k576066j786346p16934L78341J280671J860351K093811K032929J758117
3908G90919952J334381Q06809K18582l58963q23517j074981j067429q39310n02243
3917G88613281j85852K8076J30921J71585K03857K42234K54669J93100L8452j75781
3927G89514542l75061m75922m26788k27814O6986L66287N67475N91964M18396J03607
3937G90123672k32620m60205n04455l89557k20719j15509j25351k07061k60697k11410
3947G87396088o9733P9346J43890J02234J4801l0060L052O0196M8446p8964k68173
3958G87401123l96576l73764k19955n8899j8616j24512k79312l51868k98843k13776
$$ plain form
3890 788753967 789654007 791078186 792692337 793989029 794468536 793823929 792054367 789469528 786595078
3899 786595078 784019012 782232666 781515732 781894073 783174744 785035095 787128906 789161835 790919952
3908 790919952 792254333 793061142 793279724 792920761 792097244 791022263 789954834 789115524 788613281
3917 788613281 788427429 788455505 788586426 788758011 788961868 789204102 789458771 789651871 789690323 789514542
3927 789514542 789139481 788663559 788236771 788008957 788075943 788442230 789009705 789601669 790020065 790123672
3937 790123672 789891052 789430847 788926392 788536835 788316116 788200607 788075256 787868195 787607498 787396088
3947 787396088 787326355 787405701 787549591 787651825 787666626 787636566 787639618 787699814 787748260 787669296 787401123
3958 787401123 787004547 786630783 786410828 786351929 786333313 786208801 785929489 785577621 785278778 785065002
3968G85065002k42233m36020o75201p45926n28412j34125J44501N8975l66668q16193
3978G81323700r21097n86929j25733l4942n65033j431122j962509j661453p40128j32141
3988G73162613q24051k918396n205917n827256l844146p47452o71692q715286k7957459
3997G16450958n6825638q8539390j13361511
4000D57724419
$$ plain form
3968 785065002 784822769 784386749 783711548 782965622 782437210 782303085 782447586 782506561 782139893 781323700
3978 781323700 780402603 779815674 779689941 779654999 779089966 777658844 775696335 774034882 773294754 773162613
3988 773162613 772338562 769420166 764214249 758386993 754542847 753795395 753123703 744408417 716450958
3997 716450958 659625320 571085930 457724419
4000 457724419
##END=$$ End of the data block
