##TITLE=$$ Begin of the data block
##JCAMP-DX=5.00 $$ ACD/SpecManager v 10.08
##SPECTROMETER/DATA SYSTEM=16PC
##DATE=11 Jun 2013 10:06:04
##DATA TYPE=INFRARED SPECTRUM
##DATA CLASS=XYDATA
##ORIGIN=
##OWNER=
##NPOINTS=3601
##FIRSTX=400.00000000
##LASTX=4000.00000000
##MAXX=4000.00000000
##MINX=400.00000000
##MAXY=77.37950134
##MINY=12.95575237
##XFACTOR=1.0000000000
##YFACTOR=0.000000100000000
##FIRSTY=41.65980911
##DELTAX=1.00000000
##XUNITS=1/CM
##YUNITS=TRANSMITTANCE
##XYDATA=(X++(Y..Y))
400 416598091 521791496 601648827 650164642 671427002 675865097 674432526 674009628 676102676
408 676102676 678673401 679196320 676794205 672438812 667721252 663518143 659596710 655241776 650188828
417 650188828 645046921 640937119 638720207 638434639 639295311 640134964 639902039 637916870 633892746
426 633892746 627916832 620529594 612823486 606349487 602715645 603011780 607377625 614982529 624425926
435 624425926 634318008 643712692 652216415 659825745 666683502 672918549 678600693 683740845 688279648
444 688279648 692072830 694940109 696791763 697764206 698247681 698741531 699603119 700849915 702151413
453 702151413 703029938 703143768 702482300 701360474 700238190 699486084 699230499 699339752 699531631 699526443
463 699526443 699171448 698494339 697677841 696965256 696538239 696415787 696429062 696294556 695755997 694716110
473 694716110 693279877 691679535 690124359 688663406 687137756 685233841 682595673 678934097 674094086
482 674094086 668089981 661132431 653650589 646279755 639771461 634819603 631849747 630863647 631417732
491 631417732 632761879 634080734 634739952 634438324 633215027 631332207 629100494 626734047 624301758
500 624301758 621784782 619204254 616738892 614761963 613761024 614173012 616210327 619765816 624440613
509 624440613 629676933 634925156 639764977 643943405 647338638 649898376 651604080 652473068 652582779
518 652582779 652081680 651161194 649994583 648673782 647175293 645380783 643144226 640381546 637139359
527 637139359 633614082 630103760 626914558 624257050 622182045 620586128 619284744 618117981 617034760
536 617034760 616115685 615519104 615381775 615721970 616396179 617133827 617634964 617688980 617255363 616468010
546 616468010 615556374 614718246 614007797 613293839 612311974 610787315 608565826 605693436 602410240
555 602410240 599073524 596053238 593649101 592049980 591330261 591457253 592294502 593602638 595054474
564 595054474 596276932 596919098 596725769 595597000 593612442 591019020 588182030 585507278 583345985
573 583345985 581902771 581173553 580941391 580839882 580467072 579510422 577832451 575485611 572653542
582 572653542 569545555 566288452 562861099 559099922 554782753 549767761 544139671 538300209 532948990
591 532948990 528936653 527024345 527633514 530682793 535579910 541369934 546976280 551436234 554053192
600 554053192 554438667 552482147 548310432 542285423 535038033 527487640 520781441 516119156 514490891
609 514490891 516412697 521767502 529825172 539444275 549384842 558617134 566522560 572935715 578045082
618 578045082 582214813 585809746 589076500 592103958 594855499 597240105 599191322 600721588 601931190
627 601931190 602969360 603967056 604974251 605940170 606745949 607276611 607491226 607453957 607310715 607227211
637 607227211 607320061 607611847 608021278 608389320 608530731 608307381 607706223 606898155 606241341 606209183
647 606209183 607252731 609654007 613436928 618380394 624118195 630266991 636513252 642634048 648473587
656 648473587 653926468 658949127 663577805 667903366 671986465 675751038 678947601 681247101 682445374
665 682445374 682663727 682404633 682394104 683274460 685313263 688294754 691654282 694769135 697234039
674 697234039 698974457 700165863 701049728 701781235 702398376 702896347 703323212 703808441 704500427 705467072
684 705467072 706636505 707826538 708844986 709596252 710127563 710595703 711177902 711983032 713006439
693 713006439 714140701 715229721 716133194 716779938 717186356 717443848 717673035 717965088 718334351 718703079
703 718703079 718931427 718878937 718469543 717727127 716765442 715737305 714770508 713923798 713177261 712464066
713 712464066 711720886 710939331 710193024 709627914 709415970 709685059 710452957 711595230 712869034 713988876
723 713988876 714727402 714992905 714845581 714443130 713943024 713412476 712792282 711934204 710686798 708985519
733 708985519 706897507 704598923 702297974 700142365 698156662 696239548 694221954 691959534 689422531
742 689422531 686741180 684187393 682098236 680766754 680348053 680813293 681972733 683551636 685287628
751 685287628 687000809 688614578 690120621 691516418 692753677 693724594 694294662 694362411 693913116
760 693913116 693035965 691895676 690666580 689459991 688276291 687003632 685466614 683504333 681044922
769 681044922 678146896 674986038 671797180 668796921 666121368 663807983 661823273 660118484 658682327
778 658682327 657563248 656853485 656644211 656978149 657822495 659071121 660575485 662191162 663821564
787 663821564 665446091 667124634 668972321 671114197 673629150 676507263 679635925 682827606 685876465
796 685876465 688623962 690999222 693017426 694733047 696176910 697305374 697992096 698066788 697382889
805 697382889 695880661 693619308 690763474 687536545 684167023 680853806 677763901 675058365 672922287
814 672922287 671579742 671273270 672212753 674511108 678128433 682853241 688330460 694132156 699852142
823 699852142 705193481 710016632 714332352 718242493 721852798 725197220 728212509 730770340 732754898
832 732754898 734142456 735041199 735664673 736251984 736969223 737847214 738780441 739594269 740140610 740379410
842 740379410 740404129 740400467 740561371 740999680 741699600 742527924 743302689 743880081 744224472 744424744 744654160
853 744654160 745087433 745820618 746825333 747961807 749041748 749912338 750521469 750936584 751309280 751801529
863 751801529 752509232 753415146 754393005 755259857 755855865 756114655 756094284 755952301 755876541 756001053
873 756001053 756347351 756816254 757234802 757436981 757337341 756968002 756459808 755981293 755660706 755528870
883 755528870 755505676 755434952 755154419 754570770 753705292 752691803 751722717 750967407 750499420 750265427
893 750265427 750113220 749863281 749390945 748676758 747806625 746918793 746130295 745470581 744851761 744085541
903 744085541 742936783 741199112 738758469 735616455 731850586 727511520 722500229 716497345 709016647
912 709016647 699604340 688129044 675026321 661356125 648597107 638233109 631299553 628094444
920 628094444 628182182 630670319 634598923 639245377 644209442 649293365 654310303 658980637 663003769
929 663003769 666258316 668987885 671829071 675625992 681101685 688542709 697644882 707590790 717313690
938 717313690 725827332 732485733 737092361 739849396 741201553 741651688 741610565 741315613 740823212
947 740823212 740059586 738910217 737315140 735339432 733184509 731121521 729360962 727910385 726495514
956 726495514 724605942 721683121 717383728 711804123 705546341 699568863 694870377 692147751 691585007
965 691585007 692873917 695442734 698764954 702581863 706932831 711996307 717852325 724309921 730895157
974 730895157 736995926 742079468 745865326 748380814 749892273 750766602 751335678 751809921 752258530
983 752258530 752638092 752846756 752786865 752416992 751782990 751012650 750271912 749694977 749321671 749073105
993 749073105 748783646 748276520 747445908 746305389 744979553 743641815 742431564 741386185 740420456
1002 740420456 739357605 738000488 736212692 733976822 731410904 728730392 726175995 723931274 722068863
1011 722068863 720544510 719241333 718040466 716880188 715775909 714790039 713969421 713287201 712616043
1020 712616043 711750488 710465393 708585892 706041031 702884750 699288101 695507965 691850891 688634262
1029 688634262 686146393 684606934 684128265 684689255 686131821 688185577 690516586 692790222 694729156
1038 694729156 696160278 697039337 697452469 697592087 697709045 698044586 698758621 699875336 701272507
1047 701272507 702723465 703981247 704873123 705363464 705557327 705642090 705794601 706097488 706502609 706857910
1057 706857910 706980743 706745071 706139908 705278778 704356308 703574142 703071213 702884674 702959976 703199539
1067 703199539 703528214 703941879 704515839 705366440 706586533 708179703 710033417 711938629 713656464
1076 713656464 715000916 715902023 716423569 716728821 717006073 717388382 717899933 718451767 718886261 719054260
1086 719054260 718886337 718429108 717828293 717266235 716881027 716704788 716651993 716558990 716262283 715675507
1096 715675507 714831696 713870392 712975159 712290268 711854095 711581116 711299286 710830917 710074921 709056778
1106 709056778 707917786 706849976 706005478 705425034 705017242 704602432 703997879 703102570 701943817
1115 701943817 700660858 699436569 698410263 697611389 696943512 696228333 695285034 694010773 692426910
1124 692426910 690667648 688917999 687328186 685943069 684680481 683369904 681830597 679955521 677758026
1133 677758026 675358276 672919540 670563431 668305359 666042175 663591766 660766754 657447052 653616257
1142 653616257 649349518 644754028 639890556 634710503 629042473 622648125 615340652 607126808 598315887
1151 598315887 589536018 581631355 575457954 571645966 570418091 571534843 574387474 578195000 582220306
1160 582220306 585919838 588983612 591272163 592712898 593215942 592652893 590896988 587889175 583685570
1169 583685570 578463860 572488213 566061554 559495201 553112068 547276573 542426682 539076233 537765274
1178 537765274 538956184 542900276 549516792 558333015 568525505 579062614 588918495 597290077
1186 597290077 603742332 608233833 611017723 612468567 612909927 612515945 611314888 609278336 606434326
1195 606434326 602944145 599101410 595259018 591721191 588655243 586059303 583796005 581671562 579521942
1204 579521942 577272949 574950981 572651596 570483627 568516808 566757965 565165710 563698730 562377396
1213 562377396 561330948 560806046 561123734 562595558 565422211 569612045 574950714 581036301 587370377
1222 587370377 593472519 598980370 603700829 607604752 610775261 613343887 615443764 617198563 618742714
1231 618742714 620253029 621960907 624131470 627004814 630724602 635281754 640500031 646076736 651663818
1240 651663818 656962204 661792526 666117554 670006866 673567505 676869965 679905243 682589722 684814987
1249 684814987 686510696 687693634 688471832 689006042 689443588 689858017 690223618 690433960 690359268 689913635
1259 689913635 689103241 688032990 686869431 685775986 684847641 684076767 683360825 682550278 681513977
1268 681513977 680193710 678622055 676897888 675131912 673385620 671635361 669774170 667650681 665127563
1277 665127563 662129059 658659286 654780960 650571213 646077652 641299896 636211510 630813904 625191803
1286 625191803 619545517 614171715 609395714 605477829 602529831 600474472 599062614 597939415 596732254
1295 596732254 595127945 592912445 589967957 586237946 581684570 576265335 569944687 562739449 554776459
1304 554776459 546330261 537809448 529681702 522357330 516079903 510874901 506590576 503013420 500006714
1313 500006714 497588577 495903206 495086365 495095558 495607414 496057854 495835304 494545746 492225761 489385643
1323 489385643 486848030 485440445 485675201 487554016 490573235 493912277 496710052 498307533 498369179
1332 498369179 496865234 493956299 489856758 484741859 478724327 471889343 464355469 456322212 448083115
1341 448083115 439996109 432424622 425663185 419874687 415053940 411033325 407527657 404205399 400765038
1350 400765038 396993599 392791328 388162842 383183289 377958679 372597008 367199936 361871796 356736603
1359 356736603 351945305 347661171 344020081 341080093 338782005 336947250 335325699 333689804 331945686
1368 331945686 330223732 328907318 328578911 329886971 333367233 339270668 347455292 357379417 368205948
1377 368205948 378980446 388825302 397084198 403376617 407564774 409667015 409774284 408007431 404528084
1386 404528084 399581795 393546867 386960831 380517578 375036430 371398544 370449715 372866821 379009933
1395 379009933 388803177 401696625 416739349 432753448 448554726 463147469 475844955 486299934
1403 486299934 494468765 500540047 504841995 507732430 509477348 510154305 509631424 507658157 504047394
1412 504047394 498859978 492476959 485496140 478493996 471791420 465384483 459108391 452957993 447367783
1421 447367783 443254051 441751289 443756104 449514198 458476562 469496536 481255798 492696304
1429 492696304 503257828 512856331 521689758 530023308 538072128 545990944 553908157 561927299
1437 561927299 570078850 578269234 586286316 593880692 600877266 607248001 613106880 618643608 624054909
1446 624054909 629510651 635151062 641068954 647249527 653496017 659411697 664504776 668395844 671028137
1455 671028137 672739716 674126358 675748291 677841873 680210876 682367096 683836899 684450455 684437408
1464 684437408 684274979 684390106 684898605 685539093 685833588 685372162 684051971 682137756 680123672
1473 680123672 678481827 677444916 676931076 676634216 676215286 675478973 674448395 673308182 672262192
1482 672262192 671390533 670587616 669609299 668205872 666268311 663910446 661439133 659221039 657503204
1491 657503204 656279449 655273285 654062271 652296295 649903336 647170029 644632187 642810974 641916962
1500 641916962 641686096 641453094 640444870 638154640 634600067 630323105 626133766 622735405 620431747
1509 620431747 619058418 618141861 617168541 615803185 613955536 611704979 609172020 606433029 603513985
1518 603513985 600435295 597247696 594030991 590865593 587811394 584910126 582194557 579675941 577307434
1527 577307434 574957161 572432556 569568748 566330795 562851830 559359436 556015816 552774887 549354286
1536 549354286 545363274 540517082 534809990 528543625 522191658 516182632 510723190 505743027 500970116
1545 500970116 496073380 490794411 485019836 478785362 472228737 465510712 458722916 451809387 444543457
1554 444543457 436593170 427672348 417716942 406987991 396025467 385449562 375698624 366836815
1562 366836815 358535690 350240211 341429863 331840782 321543999 310860195 300179977 289792099
1570 289792099 279806252 270188866 260873375 251870728 243321056 235462437 228538570 222695866 217921257
1579 217921257 214048386 210825424 208006382 205421810 202997074 200721226 198592606 196579990 194618626
1588 194618626 192639847 190608082 188542976 186515446 184626427 182981548 181677036 180795650 180407982
1597 180407982 180573025 181336155 182721615 184720306 187271652 190245380 193438873 196602097 199493580
1606 199493580 201948910 203924065 205488052 206761780 207837029 208719482 209329739 209552345 209294662
1615 209294662 208512020 207182808 205258236 202632332 199165192 194752407 189403515 183276749 176652718
1624 176652718 169861584 163205490 156915207 151150513 146025381 141628675 138022337 135219717 133169270
1633 133169270 131755419 130826445 130233784 129862480 129645452 129557524 129603882 129814081 130244455 130981131
1643 130981131 132129984 133784418 135973473 138615618 141505394 144354982 146884117 148925362 150491199
1652 150491199 151768188 153034248 154543734 156442404 158756247 161456547 164551544 168141212 172399101
1661 172399101 177489815 183481579 190306072 197793922 205753307 214037609 222555199 231219597 239880390
1670 239880390 248290825 256139145 263128262 269054661 273840714 277506962 280120010 281762886 282567616
1679 282567616 282800159 282947578 283741016 286073704 290817890 298602924 309636421 323641510 339933395
1688 339933395 357605782 375750237 393627892 410743065 426817932 441713753 455360413 467734833
1696 467734833 478887482 488977470 498270760 507078018 515655556 524120216 532428398 540435066
1704 540435066 548000450 555086327 561787720 568284035 574737167 581192055 587532539 593515129 598868217
1713 598868217 603414879 607168427 610356712 613360672 616581955 620291214 624524040 629079857 633632011
1722 633632011 637899132 641786575 645411682 648993759 652670364 656356964 659749603 662486191 664375839
1731 664375839 665553665 666455460 667613525 669390793 671808548 674570541 677261887 679594803 681551895
1740 681551895 683350067 685260391 687410812 689695816 691838684 693560791 694744492 695499344 696102524
1749 696102524 696861038 697977676 699486237 701273651 703159332 704981842 706651840 708156815 709532623
1758 709532623 710826492 712076569 713316879 714592896 715967865 717498703 719186783 720933838 722539444
1767 722539444 723764343 724439697 724567490 724351730 724131470 724245300 724893646 726073837 727607803
1776 727607803 729240341 730740509 731966324 732877731 733521652 734017487 734537277 735267258 736334000
1785 736334000 737722778 739237671 740555725 741369705 741555099 741262436 740868835 740802231 741333542 742445831
1795 742445831 743857803 745178680 746104431 746553802 746678009 746759491 747063293 747720337 748687592 749789886
1805 749789886 750810547 751585236 752062531 752309799 752472305 752704315 753106003 753693771 754411392 755170135
1815 755170135 755891953 756533203 757084808 757561035 757989273 758405075 758842087 759310760 759771805 760131760
1825 760131760 760276413 760140533 759769363 759327774 759035416 759056854 759416656 759994354 760608902 761136856
1835 761136856 761577988 762029648 762580719 763211288 763769684 764053040 763939285 763481293 762900162 762480850
1845 762480850 762434464 762809830 763499222 764318314 765102081 765762329 766285172 766690979 766998596 767215805
1855 767215805 767356567 767460861 767598038 767843552 768243027 768780746 769369202 769869919 770140533 770093002
1865 770093002 769740677 769208984 768694992 768390350 768400879 768703995 769171677 769643784 770011139 770259094
1875 770259094 770449524 770659561 770922623 771210175 771460876 771632233 771729507 771796494 771875916 771975174 772062607
1886 772062607 772096252 772058640 771972275 771882629 771828156 771820831 771851730 771912155 772008591 772154236 772346115 772548904
1898 772548904 772706680 772778015 772770615 772745132 772779160 772912979 773116074 773300018 773373871 773306732 773153610
1909 773153610 773027115 773030396 773194656 773457642 773697205 773795013 773693161 773414154 773039017 772664566
1919 772664566 772364578 772174530 772096024 772109833 772186127 772287674 772372208 772401352 772355118 772243347 772106171
1930 772106171 772000122 771974106 772047424 772200394 772381668 772530212 772595825 772559128 772434464 772262726 772093201
1941 772093201 771965027 771892700 771863556 771847458 771815414 771755981 771683655 771630478 771626358 771678619 771760406 771819992
1953 771819992 771804581 771689301 771494293 771280365 771123123 771075821 771142502 771271286 771375885 771374893 771230850
1964 771230850 770969391 770670319 770431595 770325546 770365448 770500259 770638275 770690002 770608444 770407791
1974 770407791 770154114 769931793 769802170 769777298 769816589 769850998 769819031 769697189 769510574 769317169 769176407
1985 769176407 769115753 769114609 769113846 769043961 768861313 768571777 768230820 767921295 767718506 767658157 767723083
1996 767723083 767852249 767966003 767998047 767919235 767744751 767524643 767321472 767184067 767129059 767136154 767158508
2007 767158508 767144012 767057724 766897507 766692886 766490936 766332932 766235580 766183243 766135483 766047287 765890961
2018 765890961 765671005 765424576 765205994 765065460 765024796 765067596 765142822 765186157 765146561 765009766 764805832
2029 764805832 764596176 764447174 764398422 764446259 764542618 764617615 764609909 764493256 764287033 764045181 763832626
2040 763832626 763695145 763640900 763637772 763628387 763556442 763391876 763146133 762866440 762616882 762448578 762377243
2051 762377243 762375183 762385406 762348480 762231827 762045975 761837997 761668777 761582031 761582108 761631470 761667175 761630478
2063 761630478 761493454 761270752 761013489 760785599 760635681 760577469 760583878 760600052 760566635 760445404 760234985
2074 760234985 759970779 759708328 759499054 759367142 759299011 759248581 759158707 758986206 758721085 758391342
2084 758391342 758050232 757752228 757527924 757371597 757242432 757085037 756854019 756535873 756156235 755769501
2094 755769501 755433502 755184784 755020218 754899216 754759521 754546814 754239349 753859940 753466263 753127975
2104 753127975 752894592 752774429 752729874 752695465 752607346 752433472 752188797 751927490 751717987 751608887
2114 751608887 751605988 751667709 751723175 751704788 751578751 751358337 751096802 750861511 750701828 750626831 750603180
2125 750603180 750571060 750473404 750282288 750011520 749710007 749437866 749240494 749127197 749068909 749010544 748897018
2136 748897018 748696213 748412781 748084793 747766495 747503815 747315826 747187195 747075195 746929855 746715775
2146 746715775 746426010 746085434 745737686 745425873 745173950 744975967 744799652 744601974 744349518 744034348
2156 744034348 743680344 743333969 743045654 742848511 742744904 742706223 742685776 742640305 742550812 742431183 742322693
2167 742322693 742276382 742329254 742488632 742728348 743000336 743256531 743468933 743642654 743811493 744022293
2177 744022293 744312592 744692383 745137177 745597916 746019516 746366119 746635590 746860504 747093048 747381287
2187 747381287 747743607 748160324 748579330 748938446 749194565 749341888 749416122 749477844 749585571 749769897
2197 749769897 750020370 750291595 750524445 750673904 750729980 750721359 750702972 750730896 750836945 751014404 751221008
2208 751221008 751397781 751497040 751503067 751440353 751362610 751327438 751368790 751480637 751616745 751711655 751710434 751594162
2220 751594162 751389771 751158829 750968933 750863571 750840836 750855331 750838547 750730896 750510712 750203781
2230 750203781 749873505 749594421 749420700 749364166 749392776 749445496 749460449 749401169 749271011 749108658 748969116
2241 748969116 748897095 748905869 748971100 749041290 749060669 748994675 748843994 748643417 748445435 748295059 748208923
2252 748208923 748166733 748120193 748013992 747811584 747511749 747151337 746788635 746477203 746240997 746062469
2262 746062469 745889816 745661850 745336304 744911575 744428406 743951645 743541641 743227844 742997513 742802963
2272 742802963 742585983 742306442 741963577 741601410 741292725 741110535 741094818 741230164 741445847 741638870
2282 741638870 741713638 741618195 741364365 741016464 740659103 740356140 740123901 739928055 739706039 739400330
2292 739400330 738987427 738487854 737954178 737445831 737000351 736616592 736254349 735850754 735347824 734715500
2302 734715500 733963623 733132019 732266769 731394958 730510559 729583588 728586731 727523422 726439743 725410690
2312 725410690 724502029 723728027 723026199 722264252 721284103 719965439 718286667 716352997 714371414
2321 714371414 712576981 711134796 710062790 709220581 708375092 707320251 705985107 704470673 702993317
2330 702993317 701763535 700875397 700271530 699795456 699285278 698636398 697791901 696685410 695216293
2339 695216293 693314209 691087723 688954315 687627258 687894821 690257339 694604111 700118256 705498199
2348 705498199 709411545 710968704 709990387 706961441 702728119 698124924 693712845 689725952 686185837
2357 686185837 683063507 680379562 678204193 676593323 675536499 674956436 674758377 674884033 675332489
2366 675332489 676137543 677324600 678880081 680748138 682851410 685116577 687489700 689940872 692462311
2375 692462311 695064087 697765808 700581665 703497849 706454010 709342194 712026978 714382782 716330566
2384 716330566 717857742 719013367 719884491 720564041 721124725 721605301 722012253 722331161 722546082 722656479
2394 722656479 722687073 722683411 722695694 722756577 722864685 722983704 723060303 723051529 722947617 722778931 722601166
2405 722601166 722470245 722414246 722421494 722445755 722428970 722328644 722138367 721892014 721648712 721467209 721379471
2416 721379471 721376572 721414108 721434250 721393051 721282425 721132965 720999527 720934601 720963974 721075668 721225128
2427 721225128 721355438 721422119 721411514 721347046 721277542 721256256 721317139 721457825 721639633 721802292 721889572
2438 721889572 721873779 721768799 721623306 721498566 721440277 721457672 721521301 721577072 721573410 721487656 721335983
2449 721335983 721167297 721041183 721000824 721054611 721173859 721307755 721408157 721450272 721444473 721428146 721446686
2460 721446686 721530685 721679840 721862335 722027435 722127838 722140503 722077026 721978989 721900253 721884155 721944580
2471 721944580 722061081 722187347 722273331 722288132 722233810 722145462 722074432 722066422 722139664 722277222 722434921
2482 722434921 722560883 722618027 722601013 722537613 722475891 722462997 722522583 722644119 722786179 722895050 722928772
2493 722928772 722876282 722763138 722639008 722554779 722536392 722572632 722618942 722617264 722523727 722329025 722063217
2504 722063217 721783066 721546326 721386871 721299973 721245270 721165009 721011276 720767517 720456238 720130005
2514 720130005 719846878 719645767 719529114 719461594 719387207 719255524 719043884 718768387 718476791 718225250
2524 718225250 718054276 717970047 717942276 717918777 717850571 717714233 717522202 717317810 717153244 717066422 717063065
2535 717063065 717113571 717165909 717169571 717096405 716952896 716776352 716616669 716514587 716482544 716500092 716522141
2546 716522141 716499786 716401901 716229553 716016083 715811615 715662308 715588303 715576477 715587082 715572891 715503159
2557 715503159 715377197 715225754 715094376 715021820 715020294 715068741 715122375 715133133 715071259 714938889 714768524
2568 714768524 714607010 714494553 714445648 714442978 714445267 714406052 714294891 714111481 713885269 713663635 713491364
2579 713491364 713392029 713359680 713363113 713361511 713322525 713237000 713121185 713007889 712930984 712908554 712934494 712980270
2591 712980270 713006973 712981720 712891922 712751007 712591934 712453079 712360153 712314835 712293777 712258987 712176132
2602 712176132 712031250 711837921 711632080 711455536 711336670 711278458 711256714 711232452 711170349 711055222 710898437
2613 710898437 710732956 710596848 710517120 710495987 710510178 710520630 710487823 710389099 710227356 710028229 709828644
2624 709828644 709659271 709531021 709430923 709329147 709193954 709007797 708776932 708529129 708302612 708129272
2634 708129272 708022003 707968597 707937775 707892151 707803192 707661896 707480011 707283554 707099304 706942368 706809692
2645 706809692 706681137 706530151 706335754 706093216 705817947 705538406 705285492 705079422 704922180 704796600
2655 704796600 704674454 704528732 704344711 704126587 703895493 703680038 703504791 703378754 703291550 703217850
2665 703217850 703130188 703010254 702859497 702697601 702553177 702448807 702388992 702356873 702319412 702242813 702106476
2676 702106476 701913223 701686630 701461029 701267319 701119461 701011505 700921631 700823593 700700150 700550156
2686 700550156 700390167 700246506 700144119 700094223 700088348 700100250 700096436 700049515 699950867 699814911 699673157
2697 699673157 699560699 699500046 699490585 699509964 699523239 699499893 699426880 699313736 699186859 699078140 699009018
2708 699009018 698983154 698984222 698983612 698952255 698871994 698743362 698584671 698424377 698288651 698188705 698114700 698040161
2720 698040161 697933884 697774963 697564163 697322922 697083588 696872711 696697311 696542053 696375885 696168213
2730 696168213 695904388 695592880 695263977 694956436 694702301 694514771 694384460 694284286 694182968 694058456
2740 694058456 693907776 693746033 693598633 693487778 693421478 693387604 693359375 693304520 693199539 693037186 692828751
2751 692828751 692599106 692376556 692180939 692016602 691869583 691713943 691522217 691278381 690985260 690665283
2761 690665283 690350113 690065155 689817505 689590302 689351273 689067307 688722610 688326035 687908478 687507553
2771 687507553 687151184 686845474 686573334 686303101 686005096 685663223 685282516 684885025 684498367 684143295
2781 684143295 683824310 683529510 683235092 682918167 682566299 682183533 681789093 681408691 681064072 680763397
2791 680763397 680498199 680245972 679980392 679681473 679344177 678979568 678609314 678255005 677927017 677620850
2801 677620850 677319031 677000961 676654358 676281509 675900803 675536118 675208969 674926758 674682236 674455948
2811 674455948 674226227 673977890 673708725 673429489 673159790 672918854 672717133 672550354 672399673 672238541
2821 672238541 672043457 671805038 671533051 671252441 670991592 670767899 670578232 670399094 670197144 669944458
2831 669944458 669632339 669273453 668895874 668528214 668186340 667867203 667551041 667212982 666834030 666409683
2841 666409683 665950165 665474548 665001831 664543152 664097366 663654327 663199539 662723160 662225113 661717911
2851 661717911 661224518 660770721 660376587 660047073 659770889 659521713 659268646 658987274 658668518 658321152
2861 658321152 657965393 657622375 657302246 656999283 656693726 656361389 655984497 655560684 655102081 654629517
2871 654629517 654162216 653709183 653266449 652820511 652356644 651865997 651351013 650823441 650299072 649791412
2881 649791412 649305725 648835678 648366165 647877655 647354660 646791382 646196899 645590820 644996796 644429932
2891 644429932 643888702 643352203 642788696 642169342 641482773 640741196 639975052 639218597 638492241 637792816
2901 637792816 637094574 636362267 635568504 634708290 633801804 632885513 631995316 631148911 630336685 629523468
2911 629523468 628661652 627710724 626652374 625497131 624278793 623038139 621806793 620594063 619387741
2920 619387741 618161926 616892776 615569496 614199028 612800064 611391754 609983215 608568916 607132988
2929 607132988 605659409 604144630 602604866 601075745 599601212 598219872 596950798 595785332 594689827
2938 594689827 593613892 592503052 591310959 590007629 588588905 587084274 585564804 584145012 582972870
2947 582972870 582205887 581974297 582345543 583301125 584735947 586482086 588345947 590146828 591744995
2956 591744995 593052444 594030952 594681396 595033264 595132484 595033226 594787331 594435310 593999481 593484230
2966 593484230 592880898 592178421 591372032 590471268 589498520 588485832 587468605 586478958 585543556 584681931
2976 584681931 583908081 583232841 582665367 582214088 581886177 581685486 581608810 581643677 581766129 581942444
2986 581942444 582133255 582300186 582411270 582443962 582385674 582231522 581981239 581637764 581207657 580702171
2996 580702171 580137863 579534569 578910446 578278503 577642632 576997948 576334190 575640602 574910431 574141617
3006 574141617 573336220 572493439 571606674 570659599 569629631 568496437 567252846 565915985 564531059
3015 564531059 563166313 561899071 560796547 559900017 559216537 558720436 558364067 558090744 557847176
3024 557847176 557589149 557283516 556906433 556440239 555872536 555195045 554404297 553502541 552498817 551409531
3034 551409531 550257759 549069176 547866020 546660118 545447998 544209900 542918549 541549225 540092583
3043 540092583 538560371 536981735 535392303 533818512 532267342 530723991 529160690 527549973 525877647
3052 525877647 524147606 522377090 520587311 518792114 516994133 515185585 513355026 511493073 509596672
3061 509596672 507667313 505707779 503718643 501696205 499634247 497526131 495368500 493163719 490920219
3070 490920219 488650780 486366844 484073715 481766052 479426804 477032814 474562492 472003441 469357071
3079 469357071 466635666 463854904 461025467 458148079 455213699 452209435 449123917 445952377 442697067
3088 442697067 439363327 435956764 432479820 428931541 425308876 421608124 417826996 413965225 410025673
3097 410025673 406015015 401943054 397822113 393665314 389484482 385290184 381091614 376900177 372731438
3106 372731438 368606834 364553070 360598564 356769753 353088493 349570847 346228065 343068962 340102386
3115 340102386 337337837 334785576 332454605 330352173 328482704 326848564 325450745 324289093 323361855
3124 323361855 322664337 322187729 321918526 321841354 321941986 322211151 322647057 323254814 324043159 325021133
3134 325021133 326194229 327563362 329125595 330875664 332806549 334909248 337172737 339584122 342131310
3143 342131310 344804649 347597046 350499992 353496628 356557732 359638748 362687149 365651741 368493576
3152 368493576 371191177 373736992 376128616 378357887 380404930 382240295 383832550 385158920 386211166
3161 386211166 386995697 387527618 387821617 387885895 387720413 387320518 386681213 385803642 384696655 383376045
3171 383376045 381863480 380182533 378357697 376412849 374370193 372249222 370066605 367836609 365573273
3180 365573273 363292084 361010399 358746567 356516495 354332161 352200775 350127182 348115616 346172333
3189 346172333 344303322 342512093 340795860 339144325 337542229 335973511 334426041 332893715 331376343
3198 331376343 329877090 328398056 326938400 325492058 324047623 322590828 321107407 319586506 318025208
3207 318025208 316428795 314809952 313184166 311566143 309966946 308395081 306859760 305375557 303965473
3216 303965473 302659626 301492271 300495262 299692154 299094753 298703003 298509197 298502350 298674278 299021378
3226 299021378 299543972 300242310 301112843 302145119 303323631 304630241 306048832 307567234 309176388
3235 309176388 310867214 312626286 314433193 316260109 318073902 319839306 321522026 323091164 324520149
3244 324520149 325784950 326862907 327730637 328364754 328744774 328858032 328706512 328311615 327718277 326995430
3254 326995430 326234055 325542946 325043526 324860954 325115814 325914192 327338181 329437408 332224731
3263 332224731 335672112 339712563 344243050 349132957 354236145 359403496 364497223 369401245 374025688
3272 374025688 378307571 382204247 385686111 388729668 391314888 393427124 395063400 396240883 397001991
3281 397001991 397418060 397586975 397629929 397686272 397907562 398449326 399455376 401038513 403257523 406102180
3291 406102180 409488449 413272667 417278137 421327019 425266304 428984184 432413445 435526390 438326263
3300 438326263 440836792 443093071 445131950 446984901 448673286 450209770 451603928 452867928 454022331
3309 454022331 455092812 456105118 457075920 458010406 458901291 459736252 460504990 461205406 461844635 462435722
3319 462435722 462991486 463518410 464014778 464471779 464878731 465228577 465520782 465761108 465956383 466109238
3329 466109238 466215172 466263351 466240997 466139908 465959244 465706749 465393677 465030060 464619713 464159660
3339 464159660 463641319 463055573 462396698 461666298 460873260 460030670 459150391 458237076 457285805 456282921
3349 456282921 455211716 454060555 452828064 451525002 450169754 448781128 447369957 445935326 444464798
3358 444464798 442940025 441343155 439664536 437905350 436077461 434198532 432285347 430347595 428384972
3367 428384972 426388321 424342957 422234955 420055885 417804718 415487328 413113518 410692863 408231735
3376 408231735 405730782 403186836 400594826 397954178 395273247 392571335 389877548 387224159 384638634
3385 384638634 382136612 379720154 377382317 375115509 372921715 370819511 368842812 367034645 365433807
3394 365433807 364062996 362921410 361984749 361214638 360572739 360032234 359583549 359229469 358975029 358814621
3404 358814621 358726883 358676186 358622093 358529892 358378029 358157387 357864952 357495384 357035332 356462746 355752792
3415 355752792 354885254 353851738 352658501 351324081 349873123 348329353 346709557 345021210 343264198
3424 343264198 341435585 339535255 337570534 335558319 333523331 331495247 329502716 327568398 325706482
3433 325706482 323924522 322229424 320634766 319166183 317859344 316753101 315877953 315248489 314863377
3442 314863377 314713383 314792137 315104237 315663376 316483860 317568111 318900814 320450783 322181320
3451 322181320 324060211 326064873 328180313 330391502 332677841 335013313 337373772 339744415 342125282
3460 342125282 344527702 346965141 349442177 351947021 354450722 356915169 359303818 361593857 363784866
3469 363784866 365899506 367977371 370062828 372188797 374364967 376574364 378780594 380945168 383046112
3478 383046112 385088310 387100639 389120979 391177902 393279381 395414925 397568855 399734001 401916962
3487 401916962 404130058 406378288 408651619 410929184 413194122 415446892 417706223 419993782 422313957
3496 422313957 424642067 426932755 429145317 431267967 433327446 435373573 437450981 439574356 441724014
3505 441724014 443864441 445969238 448038864 450098381 452178459 454295883 456445084 458604584 460751534
3514 460751534 462873459 464968529 467037697 469076424 471071663 473005791 474865456 476645851 478352966
3523 478352966 480003166 481622391 483246536 484917068 486671600 488528976 490477753 492476234 494467545
3532 494467545 496406364 498281403 500123863 501990356 503929253 505947227 507993774 509978294 511812286
3541 511812286 513455048 514939041 516357346 517818604 519395943 521098785 522882957 524692497 526502037 528330460
3551 528330460 530219727 532197037 534253082 536353912 538477898 540639954 542875977 545185242 547473106
3560 547473106 549544373 551177101 552245293 552822533 553195152 553761597 554868164 556663742 559054756
3569 559054756 561772804 564509392 567040367 569284439 571289291 573180122 575108070 577211800 579581223
3578 579581223 582212448 584967766 587581329 589738350 591215477 592014198 592403488 592830315 593727036
3587 593727036 595319710 597539062 600081978 602581673 604783897 606634331 608248863 609809608 611464005
3596 611464005 613286667 615299072 617506599 619904137 622443466 624998970 627372818 629360733 630849113
3605 630849113 631885223 632679138 633530769 634716644 636387024 638509483 640870590 643132706 644938736
3614 644938736 646047974 646471863 646544876 646864853 648075638 650554581 654149170 658124008 661398849
3623 661398849 663004150 662540054 660397720 657613297 655419388 654725800 655792236 658235397 661320190
3632 661320190 664339523 666881638 668886261 670540543 672128983 673925552 676128769 678793945 681738129
3641 681738129 684482956 686331177 686623459 685086899 682080383 678552094 675679092 674354706 674804535
3650 674804535 676546326 678703995 680480194 681512527 681943741 682221832 682806625 683965454 685734634
3659 685734634 687987823 690508575 693012695 695154190 696587219 697095795 696718216 695751648 694594345
3668 694594345 693503265 692434540 691093674 689185867 686705399 684067688 681983261 681146317 681925049
3677 681925049 684227524 687583237 691350098 694897079 697684784 699274979 699356918 697844009 694998245
3686 694998245 691464081 688130341 685842056 685100250 685901718 687802353 690148087 692331009 693948669
3695 693948669 694828568 694975281 694527359 693754883 693055649 692876816 693538971 695032425 696919556 698440628
3705 698440628 698821564 697642593 695078354 691872177 689043808 687476044 687576828 689170685 691637650
3714 691637650 694202271 696219711 697341690 697531662 696978455 695983124 694874115 693959656 693495712
3723 693495712 693647919 694446869 695746689 697217255 698385010 698735733 697878113 695731964 692669220
3732 692669220 689514236 687330627 687024155 688910370 692472382 696488266 699526520 700589371 699564896
3741 699564896 697219925 694722672 692967987 692105408 691556015 690493698 688473740 685800476 683399506
3750 683399506 682280731 682942810 685085983 687799988 690080109 691343384 691647339 691526260 691595993
3759 691595993 692189941 693220215 694292221 694953613 694915085 694151535 692875824 691448975 690273819
3768 690273819 689695435 689905548 690868607 692302551 693752975 694754181 695013580 694529877 693578033
3777 693578033 692563782 691828156 691502914 691496735 691602325 691654663 691638947 691684875 691963043 692556381 693397903
3788 693397903 694316559 695152130 695849609 696458893 697031784 697499084 697632904 697147446 695887375 693973083
3798 693973083 691786423 689789047 688283005 687285690 686608734 686087112 685786438 686019058 687133331
3807 687133331 689212189 691895752 694471054 696191559 696628342 695835571 694238129 692337265 690446854
3816 690446854 688624191 686816177 685077209 683678131 683013992 683372421 684728470 686714172 688787842
3825 688787842 690496750 691670227 692428513 693015366 693571014 693987503 693941040 693076782 691243057 688633041
3835 688633041 685753174 683227463 681547852 680909729 681223907 682289124 683996429 686406555 689614105
3844 689614105 693461761 697295074 699979782 700262299 697355652 691451645 683854904 676602173 671704559
3853 671704559 670359650 672514114 676978455 682009659 686061478 688335953 688911133 688458176 687754288
3862 687754288 687266922 687001724 686635132 685810394 684407883 682650452 681009674 679983978 679874420
3871 679874420 680669022 682075806 683666611 685050812 685989227 686415100 686380463 685980606 685313950 684483414
3881 684483414 683616333 682859116 682328644 682050323 681931763 681815338 681591034 681303558 681172943 681493225
3891 681493225 682452164 683973694 685682526 687023392 687479630 686778488 684985428 682457047 679700089
3900 679700089 677213364 675381927 674428482 674410400 675230026 676659698 678387527 680089417 681504822
3909 681504822 682481918 682972870 682996674 682605515 681881714 680959549 680028229 679287033 678865814 678760910
3919 678760910 678843994 678947830 678974304 678943481 678947144 679040298 679159546 679139175 678820877 678180084 677373352
3930 677373352 676669235 676306610 676372375 676772614 677297974 677729645 677922363 677831268 677500458 677033005
3940 677033005 676558838 676192322 675983582 675888977 675791397 675577087 675220490 674815292 674516754 674431000
3950 674431000 674534225 674689026 674745712 674644470 674439011 674224701 674042358 673848724 673578491 673235474
3960 673235474 672914810 672726822 672682648 672658234 672483673 672089996 671580048 671144791 670890579 670731201
3970 670731201 670458832 669943466 669279709 668729095 668484421 668463364 668340759 667824020 666940155 666051865
3980 666051865 665536804 665393600 665152054 664246674 662574005 660714188 659497147 659172745 658910675
3989 658910675 657246170 653344345 648103027 643887787 642488098 642280884 636609726 615108299 568058243
3998 568058243 491805916 392173119
4000 392173119
##END=$$ End of the data block
