##TITLE=c12 $$ Begin of the data block
##JCAMP-DX=5.00 $$ ACD/SpecManager v 10.08
##SPECTROMETER/DATA SYSTEM=Alpha
##DATE=14 Mar 2014 09:56:10
##DATA TYPE=INFRARED SPECTRUM
##DATA CLASS=XYDATA
##ORIGIN=
##OWNER=
##NPOINTS=1765
##FIRSTX=399.75695801
##LASTX=3997.56933594
##MAXX=3997.56933594
##MINX=399.75695801
##MAXY=0.77449232
##MINY=0.08668034
##XFACTOR=1.0000000000
##YFACTOR=1.000000000000000e-9
##FIRSTY=0.62727064
##DELTAX=2.03957629
##XUNITS=1/CM
##YUNITS=ARBITRARY UNITS
##XYDATA=(X++(Y..Y))
399.8 627270639 635227382 621254563 604657352 601289570 609853804 626412868 650418162 672756255
416.1 672756255 683825076 681984544 675034523 667267442 659860134 658151329 666327000 679679811
432.4 679679811 688833714 690519214 689464152 690045595 690343916 687295914 683463037 682558596 682669640
450.7 682669640 680159092 676273584 674796999 675502419 674134672 670641303 668865204 668835163 666735649
469.1 666735649 661902845 658104837 656240404 652201712 644404411 635972261 630361438 628601551
485.4 628601551 628665030 627611339 623966813 616864085 608660460 606776893 614632130 624841571 628082812
503.8 628082812 624280393 618189871 610180020 596940756 578720272 560861468 550578356 553479791
520.1 553479791 569348991 592423022 614853442 629251063 633910418 633296311 631472409 627688468
536.4 627688468 619613111 608458281 596685886 583950460 570084155 561083257 565701604 584535360
552.7 584535360 607656658 624930263 634858787 640113235 641109109 638060987 634064376 631401718
569 631401718 628590405 623822570 618346393 614409566 611050785 606016934 600041151 595630288 592397749
587.4 592397749 587921083 581943750 576678455 572658300 567574501 560381293 552770913 545856655
603.7 545856655 537501156 525186598 509931922 497464627 492693543 492507786 489785373 483362973
620 483362973 477625459 474910438 473277986 470074952 465054750 458491683 451123506 444835901 441136718
638.4 441136718 439564437 439097762 440156341 443340242 447730571 451135725 452778608 452919126 450581759
656.7 450581759 443453044 429956108 409386694 383092612 350076556 345790178 403587371 466078073
673.1 466078073 487118065 460754812 411470354 353852212 291639626 239164442 231864840 289476633
689.4 289476633 380600572 460033000 512838483 544792831 563239157 571821988 572552264 568500638
705.7 568500638 562585115 555092454 544693589 531817317 517980278 503215134 485738516 465180933
722 465180933 442548841 417464852 387304723 348419517 298757434 240783498 188264534 175531924
738.3 175531924 240574539 368766844 487677306 548967361 564033270 560275197 551692665
752.6 551692665 541862071 531933665 523973584 519233584 516851246 515607476 515794635 517869771 520446718
771 520446718 520611286 515469551 501079142 470357776 415911645 342962384 283175290 276565433
787.3 276565433 327671260 401305288 463862151 505796134 530022144 539203823 533393323 508200526
803.6 508200526 453060359 363490283 275478750 263062596 349596560 470106602 561122417
817.9 561122417 615628004 649022818 670764506 684354842 692930400 699681044 705150783 707994819
834.2 707994819 708502352 708667457 708914518 707636058 704362094 700886726 697997689 694082379 687830806
852.5 687830806 680473328 673373997 665370286 654249668 639340222 620261788 594145179 555569649
868.9 555569649 497999012 421022832 358707547 381198436 500594556 631644249 704326630
883.1 704326630 722691178 712498605 686740756 647574663 590870976 513339818 439601958
897.4 439601958 424866676 488172352 581390500 651668906 687426925 700602114 700620830 690539420
913.7 690539420 671709299 644006729 604982555 553875625 501067042 474238843 498274446
928 498274446 559990406 618235350 644567370 629634440 593630433 590807676 635279536 680927157
944.3 680927157 701687634 706860840 706486702 704893589 703155994 700450838 696520686 692543268
960.6 692543268 688886046 684543371 678902507 673291147 669013679 665504396 661453485 656794488
977 656794488 652229369 647036254 639129996 626526892 608417511 589967847 585064232 594948888
993.3 594948888 598717391 584812641 572189867 580308795 595130920 597235560 589187980 577220142
1009.6 577220142 562438011 544906914 523801148 497924119 465768456 428211242 392120212
1023.9 392120212 360261559 329721034 320637017 367117047 459029108 545406818 596285522
1038.1 596285522 617541611 622701764 618695140 608741462 595191300 578863204 559138000 535324812
1054.5 535324812 507342219 474803925 436312675 389888048 334102929 274209350 234678403
1068.7 234678403 252938777 333777905 428453684 490968138 518650115 524349451 517053962 505609214
1085 505609214 493118554 478830963 467012674 458743632 444793999 419269204 390717208 372386456
1101.4 372386456 363430202 348190308 321186930 301600188 311121583 347221553 389923722 427530766
1117.7 427530766 464808166 509056628 557776630 602571726 638377249 664822221 682995558
1132 682995558 694223523 700281918 702734530 702244818 699139833 694148660 688098669 681165159 673032105
1150.3 673032105 663385034 651636243 636220157 614408553 583450258 547966778 528274655
1164.6 528274655 539783061 566784263 586537778 597524643 605422497 610207081 611259937 609367490
1180.9 609367490 604360759 595486701 583040714 567891479 549782634 527408898 498979777 461212367
1197.2 461212367 411235064 355785459 323514104 350721657 433756709 523815334 583117545
1211.5 583117545 610903800 620905280 623352170 623056233 621669292 619457662 616149426 611320019
1227.8 611320019 604941010 597535789 589726865 582027733 575161636 569724202 565300882 560630322
1244.1 560630322 554662764 547133267 538234591 528182328 517110109 505432248 493736356 482127011
1260.4 482127011 469768614 454945534 435423017 410274953 387661189 387202680 414533675 444812119
1276.8 444812119 454623401 446336478 432801306 421609282 413520455 405857116 395065963 380305856
1293.1 380305856 371121645 378458172 392821580 395915359 385165006 367215514 346528351 327780813
1309.4 327780813 315490186 307308406 296730876 281941772 264990360 246940836 227593720
1323.7 227593720 207695186 189028934 173138216 160330489 149179682 136860073 121310256
1338 121310256 103679135 89667313 86680338 99242501 125026405 155102268 181627929 203637734
1354.3 203637734 224907786 248362824 275648832 309150785 348045945 388419688 427363306
1368.5 427363306 459532559 478618771 472907007 434639394 390763521 386319607 427395493 478729695
1384.9 478729695 517036676 540325105 553053379 560843945 566871822 571428180 574317753 574929893
1401.2 574929893 572002709 564690948 554407239 543079317 531612575 521220505 513503015 510213137
1417.5 510213137 512925982 519457698 526335359 532203674 535039961 532692790 524804652 515692830
1433.8 515692830 509901941 505377710 496962816 489144415 486964136 482866317 470301002 461106241
1450.1 461106241 468047827 486346096 504675567 512719095 509758115 501015306 486924201 469666392
1466.4 469666392 452341944 431791663 404616922 382619530 378855944 390286535 406384110
1480.7 406384110 416939735 417825431 410652667 397497922 381178051 365781963 350546002 334369898
1497 334369898 321300238 313782930 310286105 309459925 310975730 311749816 308098614 298478246 281588852
1515.4 281588852 257657260 229415327 195107549 161676615 135842070 117163241 107330441
1529.7 107330441 104431182 110893279 130644023 164871395 220477477 279987484 324531436 361437917
1546 361437917 392632574 420426011 445831001 469338894 490656853 514403999 540758610 556677282
1562.3 556677282 566780269 575438976 582910240 588248193 587691844 575892329 546807349 514242291
1578.6 514242291 498146653 505247891 528826118 553887188 574988604 593277991 609173059
1592.9 609173059 623239636 636288524 648400426 659390092 669182479 677213669 683116198 687753260
1609.2 687753260 692599952 697546184 701704264 705046713 707406700 709469616 713311672 719340563
1625.5 719340563 726209641 733377576 739129484 742022812 742755592 744016051 746447444 749184370
1641.8 749184370 751500785 753428459 756084681 758284926 758612752 759114027 761273980 762646437 762676537
1660.2 762676537 762478709 763208449 763816774 763254523 762958586 763556421 763833344 764112711 764911413 765574515
1680.6 765574515 765823245 766727865 768655360 770293891 771733940 772870660 773052514 772836745 772952914
1699 772952914 773813188 774492323 773060858 769572794 765429139 761680067 759703457 760538697 764209092
1717.3 764209092 768544436 770627320 770250022 768589556 766518056 764111042 761120677 756830096
1733.6 756830096 752626240 748840392 742657185 732939959 720856190 710580409 708293498 717031360
1749.9 717031360 732970059 747807443 758751214 765995860 769814312 771897674 773204684 773235500
1766.3 773235500 772005975 770584881 770101488 770715892 771182656 770884097 770174503 769141376 767249942
1784.6 767249942 764309406 760080040 752636790 740397036 726824045 718252897 720767379 734608054
1800.9 734608054 750504255 761334181 766967773 768877089 768586934 767802298 767275095 766727030 765799820
1819.3 765799820 764304876 762196898 759527743 755783141 749651849 741919696 735793591 734134495
1835.6 734134495 738473535 746301115 753349483 757835150 759979486 760476589 760048270 759367049 758697867
1854 758697867 757946134 756866097 755274177 753065765 750132680 746264935 741751611 738838077 739693701
1872.3 739693701 743418813 747542679 750242352 750921547 749544680 746226907 741132498 735614479
1888.6 735614479 733548880 736613691 741150141 743436635 743191063 742145479 741689980 741825163 741527617
1907 741527617 739996612 737104058 732788622 726736844 718596876 708528817 697621286 690409482
1923.3 690409482 693720400 706484079 720773816 731190622 736805558 738763213 738767326 737953246
1939.6 737953246 736630142 735045671 733458221 731794596 730224609 729328334 729530752 730496049 731308341
1958 731308341 731167257 729799211 727321923 723836541 719280243 713123798 704235494 692724288 683760047
1976.3 683760047 685506821 698413730 713578880 724001288 728981495 730422199 730646968 731306970
1992.6 731306970 732444882 733252823 733500719 733393788 733036458 732430458 731589854 730575442 729422033
2011 729422033 728192925 727133870 726601839 726604104 726686120 726480782 726059020 725653112 725379169 725270569
2031.4 725270569 725436032 725961268 726654351 727136075 727238476 727161765 727089107 726995826 726849079 726756275
2051.8 726756275 726804793 726906419 726909280 726752281 726455271 725929797 725109577 724206209 723475099 722857237
2072.2 722857237 722032785 720788956 719347239 718288660 717972279 718113303 718149722 717813969 717151165
2090.5 717151165 716335773 715599537 715110183 714857817 714691401 714531779 714447439 714467049 714488626 714376748
2110.9 714376748 714093626 713684797 713163793 712535918 711836159 711076260 710294783 709610343 709176719 709093392
2131.3 709093392 709306955 709690452 710099459 710346222 710300505 709978998 709503651 708978713 708414435 707823932
2151.7 707823932 707276106 706868947 706713259 706723630 706618667 706249595 705749273 705301642 704910934 704515934
2172.1 704515934 704125226 703734994 703242183 702519715 701542139 700432241 699365854 698477268 697814763
2190.5 697814763 697334826 696990550 696750283 696484506 695991158 695250273 694508970 694016218 693730772 693397880
2210.9 693397880 692752957 691618323 690175772 689161062 689288020 690415084 691725135 692560375 692772567
2229.2 692772567 692548513 692221522 692083478 692189932 692332208 692227542 691767097 691056252 690224588 689195633
2249.6 689195633 687775373 686248422 685586333 686213315 687238514 687645495 687194645 686058939 684481621
2268 684481621 682814658 681523681 680931687 680889904 680964887 680923223 680813611 680691004 680506647 680264771
2288.4 680264771 679975510 679521799 678818166 677934945 676859736 675386250 673521221 671905637 671552062
2306.7 671552062 672845840 674988866 676821411 677821875 678101659 677983224 677825570 677824020 677872241
2325.1 677872241 677679360 676853836 675212502 673017502 670640886 668450058 666878581 666090190 665725112
2343.5 665725112 665501535 665693939 666138053 666278601 665910542 665155470 663956761 662352145 660664260
2361.8 660664260 659207940 657958448 656587720 655138433 654368699 654915810 656525671 658430219 660087526
2380.2 660087526 661263704 661826849 661715388 660913169 659396946 657151580 654350758 651561499 649521053
2398.5 649521053 648553550 648452282 648924828 649805963 650846064 651692152 652150333 652190268 651822567 651103318
2418.9 651103318 650097907 648812115 647143900 644945502 642221749 639171541 636115491 633442819
2435.2 633442819 631405771 629950643 628838897 627921164 627391636 627649486 628776491 630434692 632360578
2453.6 632360578 634629190 637196600 639614165 641509116 642899930 643828928 644107580 643566787 642351627
2471.9 642351627 640932441 639761031 638897061 638030112 636836946 635239601 633381009 631448925 629542053
2490.3 629542053 627650499 625719488 623758435 621952236 620712280 620345354 620663106 621170104 621477902
2508.7 621477902 621387839 620944262 620476842 620207846 619881928 619009793 617425203 615463018 613631427
2527 613631427 612151980 610910475 609741926 608601570 607566178 606702209 605949938 605122149 604094505
2545.4 604094505 603019178 602307618 602300048 602843881 603364885 603375554 602762461 601757646 600779414 600141525
2565.8 600141525 599676371 598584831 595925927 591674387 587493360 585722268 587153971 590799272
2582.1 590799272 595494688 600330353 604318500 606816769 607854426 607805848 607028842 605790198 604347885
2600.4 604347885 602996230 602033913 601649761 601662457 601570070 600994110 599893093 598526120 597363770
2618.8 597363770 596764028 596641958 596689284 596720636 596653461 596464038 596237779 596159160 596436381 597230673
2639.2 597230673 598499000 599892676 600964367 601335943 600796223 599565864 598168015 596905828 595722079
2657.5 595722079 594460189 593080103 591639102 590218663 588866234 587470353 585847318 584034622
2673.9 584034622 582334518 580979764 579853892 578617036 577042341 575193465 573270321 571399152
2690.2 571399152 569637299 567991853 566415131 564862609 563297212 561704397 560140550 558684766
2706.5 558684766 557357311 556133628 555031121 554149747 553583860 553284347 553064942 552680671 551984370
2724.8 551984370 551030934 549823940 548142195 545607686 541849494 537089407 532648683 530120850
2741.2 530120850 529820263 530609071 531116009 530713022 529604554 528342009 527307034 526571333 526018798
2759.5 526018798 525515497 524974346 524331152 523569643 522685230 521629870 520318687 518672347 516790926
2777.9 516790926 515036702 513814747 513355553 513595879 514127195 514435768 514324129 513914585 513297856
2796.2 513297856 512439728 511266172 509721756 507740259 505245328 502231836 498721987 494736165
2812.5 494736165 490417659 486095518 482145846 478861123 476405978 474738121 473624110 472802937
2828.9 472802937 472101420 471450686 470851004 470273525 469558239 468447328 466737300 464328527 461167991
2847.2 461167991 457266688 452724665 447701871 442492664 437622786 433827817 431882799 432219416
2863.5 432219416 434468925 437555045 440505654 442963928 444931060 446442395 447547376 448261887
2879.9 448261887 448476255 448010385 446772397 444952577 442990094 441251665 439829051 438576430 437237829
2898.2 437237829 435621351 433657289 431350440 428743422 425887257 422775209 419222802 414924085
2914.5 414924085 409779608 404082507 398435265 393570006 389886290 387190759 385179460 384475499
2930.8 384475499 387638777 397807777 414746761 433595449 448865712 458371103 462911338 464069903
2947.2 464069903 463082969 460774958 457691371 454108924 450124294 445760965 440899014 435237348
2963.5 435237348 428404719 420046359 409713238 396594554 379707754 359729439 342229366 337272882
2979.8 337272882 351083726 377961248 404366583 420120418 422800988 415117323 404479265 402967513
2996.1 402967513 417557299 440846890 460242450 471327454 476682186 479241580 480433434 480873823
3012.4 480873823 480830222 480364650 479433209 477951586 475830734 472965479 469438046 465913028 463549137
3030.8 463549137 463126659 464185596 465448618 466037363 465864033 465136200 463989824 462482899 460653365
3049.1 460653365 458648503 456613988 454511642 452283949 449941188 447456568 444736600 441703528
3065.5 441703528 438374519 434740841 430654466 426126987 421747833 418214798 415178031 411306292
3081.8 411306292 405639410 398352325 390730470 384614408 381566733 383019596 389095157 396303982
3098.1 396303982 400493294 401127338 399898291 398122102 396558970 395681977 395503402 395535737 395145655
3116.4 395145655 394032687 392283350 390140951 387872636 385600716 383287460 380872518 378365278
3132.8 378365278 375862181 373430520 370945871 368198782 365213871 362160385 359053135 355875105
3149.1 355875105 352661043 349321514 345810831 342317790 338961452 335622907 332146078 328481942
3165.4 328481942 324646771 320669144 316604197 312488407 308302790 304031253 299744070 295536757
3181.7 295536757 291461557 287547350 283783913 280183494 276838571 273800582 271047384 268607050
3198 268607050 266541690 264905483 263723612 262933195 262451380 262313455 262564301 263122916 263895720
3216.4 263895720 264852613 266019553 267405093 268931687 270553917 272296816 274184138 276090354
3232.7 276090354 277680576 278922647 280106425 281263858 282308847 283249617 283885211 283969611 283648908
3251.1 283648908 283151865 282394201 281170785 279504508 277513444 275207430 272631288 269915313 267080724
3269.4 267080724 263814837 259975791 255897850 251865536 248013169 244403645 241071403 238144398
3285.7 238144398 235789523 234215677 233416483 233154088 233417824 234378919 236214265 239097118 242970765
3304.1 242970765 247342363 251749575 256258667 261199176 266720861 272637278 278730541 285000890
3320.4 285000890 291464657 297962159 304232568 310239434 316219181 322261006 328347564 334471017
3336.7 334471017 340359509 345829546 351026386 355992079 360836148 365773946 370496809 374622017
3353 374622017 378361940 382042527 385616183 388847858 391777903 394686759 397528738 399869204 401504695
3371.4 401504695 402826399 404273778 405818760 407348901 408868790 410482228 412396640 414738983
3387.7 414738983 417587340 420769751 423983663 427405864 431452274 435991168 440399200 444522858
3404 444522858 448863000 453610718 458445400 463123173 467589945 471892357 476146251 480343521 484331042
3422.4 484331042 488074690 491703510 495261759 498594880 501680493 504641950 507340491 509603322
3438.7 509603322 511639714 513731241 515872478 517989397 520074069 522118092 524137855 526166856
3455 526166856 528235853 530321956 532268226 534092665 536056399 538104892 539857984 541212916 542490959
3473.4 542490959 543902874 545423388 546901822 548194647 549492478 550978601 552549183 554105103
3489.7 554105103 555657923 557174921 558592618 559901714 561119020 562237740 563189447 563996315 564788103
3508 564788103 565669298 566671669 567620158 568348289 568946004 569557905 570238531 570864379 571338832 571838617
3528.4 571838617 572487652 573201239 573895037 574509084 575028479 575560212 576114655 576525211 576758027 577051640
3548.8 577051640 577505589 578061819 578737676 579435170 580083251 580705404 581100166 581069767 581119895 581895351
3569.2 581895351 582869172 583464742 583873451 584320724 584828138 585422695 585941434 586033225 585883677 586274564
3589.6 586274564 586973071 587394834 587824285 588551164 589329958 590047777 590698361 590996146 590980828 591163635
3610 591163635 591621280 592214942 592730463 592923701 593405545 594458520 595287442 595290065 594714403 595065117
3630.4 595065117 596311927 597266912 597796619 598092139 598310113 598554134 598568022 597976625 597317994 597964406
3650.8 597964406 599422991 600346088 600933373 601840913 602551401 602773964 602847934 602627397 601976097 601812959
3671.2 601812959 601970255 601587176 601843536 602873504 603585362 603843272 603623867 602697432 601449132
3689.6 601449132 600928605 601037800 601029932 600695729 600154638 599683344 599686265 599816620 599405646 598567545
3709.9 598567545 598253727 599019706 599972308 600374401 600342751 600257099 600221038 600254357 600437999 600277066
3730.3 600277066 599360228 598294377 598000705 598426044 598643959 597801268 596447349 596253157 596364558
3748.7 596364558 595973730 596276939 597120523 597328067 596821010 596494377 596450329 596104145 595553637 595042229
3769.1 595042229 594860613 595083177 595202386 595030308 594888449 595083952 595359981 595527112 595733464 595880330
3789.5 595880330 595800221 595358491 594625533 594053030 593357086 592476666 592379451 592450798 592389524 592804372
3809.9 592804372 593090951 592550993 591601968 591161907 590721726 590377092 590776443 591110528 591121316 590881526
3830.3 590881526 590368748 589886725 589256585 588495016 588324845 588614166 588907719 589068532 588904440 588010073
3850.7 588010073 586090326 584974706 585658908 586315572 586204052 585632980 585233808 585058033 584541261
3869 584541261 584099412 584148169 584270179 584270120 583866417 583501697 583548665 583523214 583653748 583731055 583366096
3891.5 583366096 583220422 583281398 582772970 581712961 580736697 580241978 580453992 581121266 581603706 581680715
3911.9 581680715 581453383 580982625 580541670 580428958 580477297 580424190 580367625 580343008 580167294 579940379
3932.3 579940379 579865873 579798400 579567671 579158902 578630388 578169405 577699423 577099264 576566219 576111794
3952.7 576111794 575624764 575182438 574868500 574696183 574717402 574894905 575059772 575104475 574963093 574608088
3973.1 574608088 574186325 573882341 573706329 573600769 573528767 573406637 573106229 572598934 571969390 571233392
3993.4 571233392 570383072 569496930
3997.5 569496930
##END=$$ End of the data block
