##TITLE=$$ Begin of the data block
##JCAMP-DX=5.00 $$ ACD/SpecManager v 10.08
##SPECTROMETER/DATA SYSTEM=16PC
##DATE=04 Jun 2013 10:26:34
##DATA TYPE=INFRARED SPECTRUM
##DATA CLASS=XYDATA
##ORIGIN=
##OWNER=
##NPOINTS=3601
##FIRSTX=400.00000000
##LASTX=4000.00000000
##MAXX=4000.00000000
##MINX=400.00000000
##MAXY=78.05775452
##MINY=6.44335604
##XFACTOR=1.0000000000
##YFACTOR=0.000000100000000
##FIRSTY=41.61872101
##DELTAX=1.00000000
##XUNITS=1/CM
##YUNITS=TRANSMITTANCE
##XYDATA=(X++(Y..Y))
400D16187210J05668144Q1452828N1312866K5120850R093246L724899M960175P448349
408G04968567P695541N345230K274323N84183J016540K712326M136429M255829L097534
417G36086502J456451J68381m27551n12543m42505m09927l83682k84195j57929j67465
427G34925537m22897q45108j205826j319733j213989j119385j288681j792145k463531
436G23254242l035126l348007l466873l621521m036560m784928n771789o829376p831498
445F80528564q735046r539032j0211563j0656357j0738258j0329514r344406p751465
453F03222923n579529k943458o4392K747154N168762O973419Q101616Q651314Q794365
462F35072174Q681412Q401108Q006286P566071P176971O918717O784591O657563O366424
$$ y = [416187210, 521855354, 603308182, 654621048, 679741898, 688835144, 692560043, 697520218, 704968567, 712664108, 718009338, 720283661, 720867844, 721884384, 724596710, 728733139, 732988968, 736086502, 737542953, 737711334, 737283783, 736771240, 736328735, 735918808, 735535126, 735250931, 735093002, 734925537, 734502640, 733657532, 732451706, 731131973, 729917984, 728798599, 727509918, 725717773, 723254242, 720219116, 716871109, 713404236, 709782715, 705746155, 700961227, 695189438, 688360062, 680528564, 671793518, 662254486, 652042923, 641386566, 630648308, 620318794, 610974388, 603222923, 597643394, 594699936, 594635544, 597382698, 602551460, 609524879, 617626495, 626277809, 635072174, 643753586, 652154694, 660160980, 667727051, 674904022, 681822739, 688607330, 695264893, 701631317]
471G01631317N789795M942322L979263L112335K502823K187042K075348K009812J835556
480G30065613J454391Q49762Q7433p05719j392670j895904k255707k632370l227157
489G20347672m152604n334549o509475p341767p583160p172928o215362m864884l211899
498F67961044j274414R03626L126983N017014O118851O084518M795761K329407j195145
507F93867645n735931j1261368j7475738k3512230k7869378k8770904k4885788j6073608
515E38282700l732377R515992K0718536K7664948K9622764K7406273K2796402J7667389
523F89942627J3272171R999847P607041N678253L996963K634049J783371J519699J675415
532G38109436J903305J871109J438370P14569k7161n09109n88455l12348J21842M62341
$$ y = [701631317, 707421112, 712363434, 716342697, 719455032, 721957855, 724144897, 726220245, 728230057, 730065613, 731520004, 732369766, 732457199, 731751480, 730358810, 728462906, 726207199, 723574829, 720347672, 716195068, 710860519, 704351044, 697009277, 689426117, 682253189, 676037827, 671172943, 667961044, 666686630, 667590256, 670717239, 675734253, 681853104, 687937622, 692733383, 695062790, 693867645, 688131714, 676870346, 659394608, 635882378, 608013000, 579242096, 554356308, 538282700, 534550323, 544066315, 564784851, 592449799, 622072563, 649478836, 672275238, 689942627, 703214798, 713214645, 720821686, 726499939, 730496902, 733130951, 734914322, 736434021, 738109436, 740012741, 741883850, 743322220, 744036789, 744009628, 743500519, 742912064, 742599716, 742721558, 743183899]
542G43183899N13763K13242l42789r40323j341095j393585j112213o80313l69339m06494
552G37324753q68530j650162k536164l330764l973923m575119n337067o409988p740479
561G00902557r003906r667663r175034p190018l788681M88968M775696Q159714R998398
570F85500031J0130233Q890457O934510M957428L440399K534561K100067J854630J541061
579G27883377J039581L92151k45743o92672q31452o70700l52173j01089j25275n11703
589G25784302j183090j941758k595443l083268l519973m112854m989853o058274o994857
598F91304932p400895p038726o001358m687348l581314k953720k672043k256164j163102
607F53550262Q53196L515777O087570P699280P778549O342087L999329J659775J11999
$$ y = [743183899, 743697662, 743910904, 743568115, 742627792, 741286697, 739893112, 738780899, 738100586, 737731247, 737324753, 736456223, 734806061, 732269897, 728939133, 724965210, 720390091, 715053024, 708643036, 700902557, 691898651, 682230988, 673055954, 665865936, 662077255, 662566223, 667341919, 675501633, 685500031, 695630264, 704520721, 711455231, 716412659, 719853058, 722387619, 724487686, 726342316, 727883377, 728922958, 729315109, 729069366, 728376694, 727545242, 726874542, 726522369, 726421280, 726296005, 725784302, 724601212, 722659454, 720064011, 716980743, 713460770, 709347916, 704358063, 698299789, 691304932, 683904037, 676865311, 670863953, 666176605, 662595291, 659641571, 656969528, 654713364, 653550262, 654403458, 657919235, 664006805, 671706085, 679484634, 685826721, 689826050, 691485825, 691597824]
616F91597824l05405K18430J148071J907578K128372J719208P71866n82734k237243
625F96365967m043732n699615o711502o526566m804382j675110K187881N760880Q065185
634F82919006Q564377P363739N112839K675934P49893l78571q44116j019897j271973
643G03871231j787567k541504l381424m150009m770660n268403n736999o299362p076340
652F62858963q167801r622269j1383628j3234482j4774475j5479584j4851570j2611122
660E62734032q858719m106102Q52241N190964Q318825J0036278J0512352J0109939
668E94789810R168358P866974O239433M300919K186737J85737j354713k195129k327958
677F18860168j975822j473846j114197j053162j316643j868972k672921l705406m950218
$$ y = [691597824, 691292419, 691510849, 692658920, 694566498, 696694870, 698414078, 699185944, 698603210, 696365967, 692322235, 686622620, 679911118, 673384552, 668580170, 666905060, 669092941, 674853821, 682919006, 691483383, 698847122, 703959961, 706635895, 707385788, 707007217, 706163101, 705143204, 703871231, 702083664, 699542160, 696160736, 692010727, 687240067, 681971664, 676234665, 669935303, 662858963, 654691162, 645068893, 633685265, 620450783, 605676308, 590196724, 575345154, 562734032, 553875313, 549769211, 550621452, 555812416, 564131241, 574167519, 584679871, 594789810, 603958168, 611825142, 618064575, 622365494, 624552231, 624737968, 623383255, 621188126, 618860168, 616884346, 615410500, 614296303, 613243141, 611926498, 610057526, 607384605, 603679199, 598728981]
686E98728981o418343q214187j0575218j3795510j7985153k2773285k7163963k9736405
694D62066917k9200668k5063591j8016090r753189k232476L256607O698647R255791
702C97011948J2502174J7413635K3695336K9833793L3839493L4246445L0814476K4584083
710F03941383J7315941J0678902N636368K297210J99318j229438k323456l103066l419952
719F29993210l173256k438355j455001n20592J23558L49350J41144m34761j257935
728F21327362k174568l023605l681565m107132m361648m580193m900360n390091o023178
737E83085022o720428p433701q208122r160996j0371818j1745339j2952156j3528404
745E02964058j3116264j1732674r887352q436508q203392r534073j2045937j4718933
$$ y = [598728981, 592310638, 584096451, 573521233, 559725723, 541740570, 518967285, 491803322, 462066917, 432866249, 407802658, 389786568, 380033379, 377800903, 381057510, 387756157, 397011948, 409514122, 426927757, 450623093, 480456886, 514296379, 548542824, 579357300, 603941383, 621257324, 631936226, 637572594, 639869804, 640069122, 638839684, 636516228, 633413162, 629993210, 626819954, 624381599, 622926598, 622406006, 622529564, 622878914, 623020058, 622585297, 621327362, 619152794, 616129189, 612447624, 608340492, 603978844, 599398651, 594498291, 589108200, 583085022, 576364594, 568930893, 560722771, 551561775, 541189957, 529444618, 516492462, 502964058, 489847794, 478115120, 468227768, 459791260, 451587868, 442053795, 430007858, 415288925]
753D15288925j6315994j5925179j3345298r125634m269142K21062L696518N966377
761C66191635P154198P457466O983452N750351L814010J395684j095772l177223m473153
770C90000648m857025m484405l700676k890129k331619k125626k196388k356835k394638
779C62663307k150078j559295o61240M37470J611518K766457L861618M906616N928192
788C77804565O935540P894516Q723297R309654R544601R363518Q781243P910842O948433
797D53216209O123009N625420N542984N835800O368141O977730P546692Q034096Q450965
806E13721046Q803177R041176R058991Q746338Q058929P060318N896072M713669L570557
815E78670273K393951J028672o47469k594833m546853o049690o601295n829125l636627
$$ y = [415288925, 398972931, 383047752, 369702454, 360576820, 356307678, 356528740, 360225258, 366191635, 373345833, 380803299, 387786751, 393537102, 397351112, 398746796, 397651024, 394473801, 390000648, 385143623, 380659218, 376958542, 374068413, 371736794, 369611168, 367414780, 365057945, 362663307, 360513229, 358953934, 358292694, 358730164, 360341682, 363108139, 366969757, 371876373, 377804565, 384740105, 392634621, 401357918, 410667572, 420212173, 429575691, 438356934, 446267776, 453216209, 459339218, 464964638, 470507622, 476343422, 482711563, 489689293, 497235985, 505270081, 513721046, 522524223, 531565399, 540624390, 549370728, 557429657, 564489975, 570386047, 575099716, 578670273, 581064224, 582092896, 581445427, 578850594, 574303741, 568254051, 561652756, 555823631, 552187004]
824E52187004k55051L809243P905693J1396408J3793373J4843712J4557762J3180351
832F31418495J1117821Q832321O726761N052490L867111L064499K456131J875229J250916
841F75661774O28967J31607j11313k1591L98560J080322J920166K810440L654861M367524
851F90521317M869232N091171M987946M557495L852539K977905K071152J268081O64215
860G20861053K89765R6435k2659j94397n19485j030732j684112k383804l032837l582383
870G08796844m057769m537125n087662n690918o194610o324616n769729m310074j936569
879F64887772J093673M300919P118225R066544R899520R662171Q640747P235413N814056
888G27719040M606323L676529K963944K363357J797333J251602P67212M05121K03247
$$ y = [552187004, 551931953, 555741196, 563646889, 575043297, 588836670, 603680382, 618238144, 631418495, 642536316, 651368637, 658095398, 663147888, 667014999, 670079498, 672535629, 674410858, 675661774, 676290741, 676422348, 676311035, 676289444, 676688004, 677768326, 679688492, 682498932, 686153793, 690521317, 695390549, 700481720, 705469666, 710027161, 713879700, 716857605, 718928757, 720196838, 720861053, 721150818, 721247253, 721224594, 721030197, 720510712, 719479980, 717795868, 715412064, 712379227, 708796844, 704739075, 700201950, 695114288, 689423370, 683228760, 676904144, 671134415, 666824341, 664887772, 665981445, 670282364, 677400589, 686467133, 696366653, 706028824, 714669571, 721904984, 727719040, 732325363, 736001892, 738965836, 741329193, 743126526, 744378128, 745145340, 745550461, 745753708]
897G45753708J53885K01721K66190K72293J74408l0671l13263o30188r42611j226731
907G43678741j467437j648865j749191j749192j651535j495437j348038j271744j279144
916G30018158j307831j233902r31244l44696M60739J308976J980514K305145K232590
925G34488449J843109J298294P59354L21503n875k70615n27343p96738j058502j274262
935G34777374j420440j507874j580124j691131j877671k143860k462310k786484l072586
944G16234894l295212l456955l585129l716583l876572m056472m198761m201279l937836
953F81910095l298416k232895p91244Q64486K479782L768311M498596M575958M087372
962F95862045L280487K475739J942596J797791J970215K254104K419968K326584J974792
$$ y = [745753708, 745907593, 746109314, 746375504, 746647797, 746822205, 746791534, 746478271, 745848083, 744905472, 743678741, 742211304, 740562439, 738813248, 737064056, 735412521, 733917084, 732569046, 731297302, 730018158, 728710327, 727476425, 726545181, 726200485, 726661224, 727970200, 729950714, 732255859, 734488449, 736331558, 737629852, 738389206, 738710709, 738704834, 738434219, 737906876, 737110138, 736051636, 734777374, 733356934, 731849060, 730268936, 728577805, 726700134, 724556274, 722093964, 719307480, 716234894, 712939682, 709482727, 705897598, 702181015, 698304443, 694247971, 690049210, 685847931, 681910095, 678611679, 676378784, 675587540, 676452026, 678931808, 682700119, 687198715, 691774673, 695862045, 699142532, 701618271, 703560867, 705358658, 707328873, 709582977, 712002945, 714329529, 716304321]
971G16304321J481018R92813O03104L10898M3640k81677p05643j213837j759491k299728
981G13475418k807007l250198l568726l667526l452301k891540k059021j129227l19596
990F90330276J92948L25088Q7281m59595j253128k241058l348465m431916n272522
999F73928909n636596n380555m544220l368530k209549j394958j091004j252365j679153
1008F47371979k137680k477265k682342k846298l098298l531875m170227m972038n860787
1017F15595169o755791p593307q337021q977547r508476r881172r948235r440117q011703
1026E37141800n379257j498032L303719Q324585J2661628J5496292J6375962J5361252
1034F01787949J2969551R954109P022476M627686K903900J743622R42306L28598j80969
$$ y = [716304321, 717785339, 718778152, 719381256, 719692154, 719735794, 719454117, 718748474, 717534637, 715775146, 713475418, 710668411, 707418213, 703849487, 700181961, 696729660, 693838120, 691779099, 690649872, 690330276, 690523224, 690848312, 690935593, 690475998, 689222870, 686981812, 683633347, 679201431, 673928909, 668292313, 662911758, 658367538, 654999008, 652789459, 651394501, 650303497, 649051132, 647371979, 645234299, 642757034, 640074692, 637228394, 634130096, 630598221, 626427994, 621455956, 615595169, 608839378, 601246071, 592909050, 583931503, 574423027, 564541855, 554593620, 545153503, 537141800, 531762543, 530264511, 533568230, 541892815, 554554443, 570050735, 586426697, 601787949, 614757500, 624711609, 631734085, 636361771, 639265671, 641009293, 641951599, 642280197, 642099228]
1043F42099228n95017q98590j097755j232681j362419j543999j811753k174644k616043
1052F28766327l102570l592834m049187m453010m811440n157089n534859n983200o519012
1061E85563126p135315p810440q524666r273606j0071296j0946160j1927490j3033142
1069E06841011j4262199j5589104j6971245j8357086j9699097k0960388k2110596k3109436
1077C55781860k3889122k4345951k4357223k3817215k2680969k0989590j8862534j6456527
1085A80382729j3916550j1341305q785639o291437l921947j774102M8581J488266K587909
1094A38476505L514920M540844N977182Q084688J0981922J4575024J8536224K2345085
1102B27032394K5399304K7177124K7402210K6155853K3876954K1238594J8931007J7427101
$$ y = [642099228, 641504211, 640605621, 639507866, 638275185, 636912766, 635368767, 633557014, 631382370, 628766327, 625663757, 622070923, 618021736, 613568726, 608757286, 603600197, 598065338, 592082138, 585563126, 578427811, 570617371, 562092705, 552819099, 542747803, 531801643, 519874153, 506841011, 492578812, 476989708, 460018463, 441661377, 421962280, 401001892, 378891296, 355781860, 331892738, 307546787, 283189564, 259372349, 236691380, 215701790, 196839256, 180382729, 166466179, 155124874, 146339235, 140047798, 136125851, 134351749, 134400330, 135888596, 138476505, 141991425, 146532269, 152509451, 160594139, 171576061, 186151085, 204687309, 227032394, 252431698, 279608822, 307011032, 333166885, 357043839, 378282433, 397213440, 414640541]
1110D14640541J6824608J6822777J6851082J6297645J4755325J2190705Q978195N782547
1118E23143425L340797K220231K637977M407845P015724R792824J2110099J3534050
1126E78202972J3896294J3277168J1928559J0167541Q277703O439399M705506L027191
1134F49922333J323242m40903k200927l795929n032006n765724n960808n683975n043335
1143F17321968m122696k956505j566047k9602J478157K712402L451347L596001L216286
1152F23101311K512550J717186R95941M04701q9225n48477j017418j509324k024498
1161F23542747k569694l159370l797379m450836n039330n443840n539283n248757m607429
1170E83686829l816452l240433l311424m335823o272088q605461j0433578j0786247
$$ y = [414640541, 431465149, 448287926, 465139008, 481436653, 496191978, 508382683, 517360878, 523143425, 526484222, 528704453, 531342430, 535750275, 542765999, 552558823, 564668922, 578202972, 592099266, 605376434, 617304993, 627472534, 635750237, 642189636, 646895142, 649922333, 651245575, 650804672, 648603745, 644807816, 639775810, 634010086, 628049278, 622365303, 617321968, 613199272, 610242767, 608676720, 608647118, 610125275, 612837677, 616289024, 619885025, 623101311, 625613861, 627331047, 628326988, 628731689, 628642464, 628093987, 627076569, 625567245, 623542747, 620973053, 617813683, 614016304, 609565468, 604526138, 599082298, 593543015, 588294258, 583686829, 579870377, 576629944, 573318520, 568982697, 562710609, 554105148, 543671570, 532885323]
1178E32885323r065438n387497o26487L900222O970940P955208P017937M942817K692414
1187E51285439R59854o3248o22025j130600j896019k982788m262390n558891o773949
1196E28955383p916794r049034j0210762j1393280j2564773j3717537j4890099j6145553
1204D33067551j7528229j9035034k0620194k2219314k3767014k5189094k6375637k7164059
1212B51168976k7354965k6761513k5270558k2883729j9725514j6018677j2042417q088913
1220I3022690m420815j231994J386089L459578N118284O551599P949887R453258J1129093
1229A32417669J2976303J4946833J6965942J8940411K0761795K2311325K3473740K4159584
1237B86953602K4325294K3987446K3225784K2176705K1012421J9906234J8988381J8305206
$$ y = [532885323, 523819885, 518432388, 517805901, 521706123, 528677063, 536632271, 543650208, 548593025, 551285439, 552245293, 552182045, 551560020, 550429420, 548533401, 545550613, 541288223, 535729332, 528955383, 521038589, 511989555, 501778793, 490385513, 477820740, 464103203, 449213104, 433067551, 415539322, 396504288, 375884094, 353664780, 329897766, 304708672, 278333035, 251168976, 223814011, 197052498, 171781940, 148898211, 129172697, 113154020, 101111603, 93022690, 88601875, 87369881, 88755970, 92215548, 97333832, 103885431, 111835318, 121288576, 132417669, 145393972, 160340805, 177306747, 196247158, 217008953, 239320278, 262794018, 286953602, 311278896, 335266342, 358492126, 380668831, 401681252, 421587486, 440575867, 458881073]
1245D58881073J7803612J7356071J6814995J6069260J5075836J3845215J2404289J0768433
1253E79018784Q947067O970100M901428K803612O67076j643371m356118p657547j1509170
1262E78141861j5531693j9055862k1342659k1871185k0539360j7665291j3800240r481353
1270D38854218n081864q39424K989693N995674P632789P410851N149193J129761l961907
1279D59278984r280815j4110031j8032265k0908203k2715149k3377151k2711449k0516625
1287C07627296j6735153j1575927n524712P58190O588516J1386605J4752845J6503277
1295C23780937J6683159J5567093J3615761J1369133R283714P575378O137238M591255
1303D08603668K458420o16875m673195r346771j3908539j7413215j8917160j7713394
$$ y = [458881073, 476684685, 494040756, 510855751, 526925011, 542000847, 555846062, 568250351, 579018784, 587965851, 594935951, 599837379, 602640991, 603308067, 601664696, 597308578, 589651031, 578141861, 562610168, 543554306, 522211647, 500340462, 479801102, 462135811, 448335571, 438854218, 433772354, 432932930, 435922623, 441918297, 449551086, 456961937, 462111130, 463240891, 459278984, 449998169, 435888138, 417855873, 396947670, 374232521, 350855370, 328143921, 307627296, 290892143, 279316216, 273791504, 274549694, 281138210, 292524815, 307277660, 323780937, 340464096, 356031189, 369646950, 381016083, 390299797, 397875175, 404012413, 408603668, 411062088, 410445213, 405772018, 396425247, 382516708, 365103493, 346186333, 328472939]
1311C28472939j3539181o699734J936989J1093521J9363365K5540543K8893699K9303360
1319D24365501K7221260K3488198J9083214J4883194J1496391R184265P876358P255821
1327E44854202O888199O354294N344467L690262J338654j679917n238457r035225j2503890
1336E40012589j4805565j4994355j2348289o743240J122169R810219J7551765K2825585
1344E42430878K4852485K3784638K0520057J6261406J2044754Q452721N593567L281403
1352F57221909J269531o03638k408600m203872o122284q370362j1140785j4465408
1360F11176491j8090706k1438294k3697586k4036750k1884194j7184334j0520973l034592
1368D71289062L864708Q899460J1287804J0929909Q350372M443054J50833l783798
$$ y = [328472939, 314933758, 308234024, 310171013, 321264534, 340627899, 366168442, 395062141, 424365501, 451586761, 475074959, 494158173, 509041367, 520537758, 529722023, 537598381, 544854202, 551742401, 558096695, 563441162, 567131424, 568470078, 566790161, 561551704, 552516479, 540012589, 525207024, 510212669, 497864380, 491121140, 492243309, 502053528, 519605293, 542430878, 567283363, 591068001, 611588058, 627849464, 639894218, 648346939, 653940506, 657221909, 658491440, 657887802, 655479202, 651275330, 645153046, 636782684, 625641899, 611176491, 593085785, 571647491, 547949905, 523913155, 502028961, 484844627, 474323654, 471289062, 475153770, 484053230, 495341034, 506270943, 514621315, 519064369, 519215202, 515431404]
1376E15431404o918678r070206j0211181j0388909r701652q317833o486321m508400
1384D49828224k660103j113205J08109J108475K046661L041916M105530N122223N894088
1393D67481918O219712N976562N170250L928604K447205R18007n28031j836509l007584
1402D86770134m057579m993439n813179o519966p132912p678260q168030q582802q877220
1411D24946747r005585q949051q721123q344268p813111p073250o034812m619828k817955
1420C61567764p19490J493416L596649N387841O742286P634888Q126678Q321152Q311920
1429D10463104Q143921P803459P242966O424408N358620M115677K803573J528092L58467
1438D54242287o77681j582718k373314l081169l771324m547615n519867o737442q115387
$$ y = [515431404, 508512726, 499442520, 489231339, 478842430, 469140778, 460822945, 454336624, 449828224, 447168121, 446054916, 446163025, 447271500, 449318161, 452360077, 456465607, 461587830, 467481918, 473701630, 479678192, 484848442, 488777046, 491224251, 492142258, 491614227, 489777718, 486770134, 482712555, 477719116, 471905937, 465385971, 458253059, 450574799, 442406769, 433823967, 424946747, 415941162, 406992111, 398270988, 389926720, 382113609, 375040359, 369005547, 364385719, 361567764, 360848274, 362341690, 365938339, 371326180, 378068466, 385703354, 393830032, 402151184, 410463104, 418607025, 426410484, 433653450, 440077858, 445436478, 449552155, 452355728, 453883820, 454242287, 453564606, 451981888, 449608574, 446527405, 442756081, 438208466, 432688599, 425951157, 417835770]
1447D17835770r414902j0307732j0510978r924431q694535p163124n725021m669838
1455C51425209m089088l885575l862304l827362l656807l294030k714500j893883q12988
1464C23388672N10521J992035L481483M804154N819130O462249O751900O756783O550216
1473C66517143O180878N671692N042152M332924L614769K975197K496757K243424K258873
1482D01333809K566261L155785L953056M795647N452575N710373N500870N005989M654198
1491D42128563M978332O376801Q896904J2159271J5479012J8123970J9581756J9697724
1499E47422333J8644295J6766166J4416771J1879807R379806P126618N323715M111671
1507F35071182L497124L329506L363266L372192L243485K991714K696076K410965K125396
$$ y = [417835770, 408420868, 398113136, 387602158, 377677727, 368983192, 361820068, 356095047, 351425209, 347336121, 343450546, 339588242, 335760880, 332104073, 328810043, 326095543, 324201660, 323388672, 323899193, 325891228, 329372711, 334176865, 339995995, 346458244, 353210144, 359966927, 366517143, 372698021, 378369713, 383411865, 387744789, 391359558, 394334755, 396831512, 399074936, 401333809, 403900070, 407055855, 411008911, 415804558, 421257133, 426967506, 432468376, 437474365, 442128563, 447106895, 453483696, 462380600, 474539871, 490018883, 508142853, 527724609, 547422333, 566066628, 582832794, 597249565, 609129372, 618509178, 625635796, 630959511, 635071182, 638568306, 641897812, 645261078, 648633270, 651876755, 654868469, 657564545, 659975510, 662100906]
1516F62100906J786499J360474Q79059M28848J03607m3869j4801J54572M15191P09229
1526F67879715R62143J087875J027222Q02383N31845L85361M74930P62558J047287
1535F74961319J059952O19049k48566j301422k196197k653351k581940k097931j443481
1544F64117432q61283m96292l57818l44010l01590r7961L12500Q45260J289444J376877
1554F65482559R04694j35803j498032k744675l421859l273316k374344j111679m883
1563F51822662N38788M07791j85012q42209j208268j154327q25500n33982n62820j005478
1573F46451645j733856k502213l120804l570938l980255m479599n034790n394783n213699
1582F11420708m284287k735710j046410J59417M17976l51410j850929l624802n337181
$$ y = [662100906, 663887405, 665247879, 666126938, 666555786, 666659393, 666615524, 666600723, 666755295, 667170486, 667879715, 668841858, 669929733, 670956955, 671759338, 672291183, 672676544, 673151474, 673914032, 674961319, 676021271, 676640320, 676391754, 675090332, 672894135, 670240784, 667658844, 665560913, 664117432, 663256149, 662759857, 662402039, 662058029, 661756439, 661658478, 661970978, 662816238, 664105682, 665482559, 666387253, 666251450, 664753418, 662008743, 658586884, 655313568, 652939224, 651827545, 651822662, 652361450, 652769241, 652584229, 651742020, 650533752, 649379425, 648553925, 648019943, 647457123, 646451645, 644717789, 642215576, 639094772, 635523834, 631543579, 627063980, 622029190, 616634407, 611420708, 607136421, 604400711, 603354301, 603513718, 603931694, 603580284, 601729355, 598104553, 592767372]
1591E92767372o915321q455696r973641j1191292j1545982j0452156p672348l566322
1599E22994614R53560M749221O905556P066574N509491K955704K40898j987114l433228
1608E45955276m153633m435577m633827n021553n701561o592293p492828q191338q573990
1617D91158676q675918q653946q697815q937416r397087j0014153j0695000j1364631
1625D14722710j1981850j2534218j3028145j3503532j4044991j4765472j5743370j6945591
1633C02175541j8186779j9173069j9617634j9368973j8471126j7124958j5577450j4010296
1641A60645256j2491236j0998182r470959p838859o008959l839722j156597K175331
1649A11016073O152077J0568886J5047416J9143534K2477608K4821911K6104088K6358833
$$ y = [592767372, 585852051, 577396355, 567422714, 556231422, 544685440, 534233284, 526560936, 522994614, 523948174, 528697395, 535602951, 542669525, 548179016, 551134720, 551375618, 549388504, 545955276, 541801643, 537366066, 532732239, 527710686, 522009125, 515416832, 507924004, 499732666, 491158676, 482482758, 473828812, 465130997, 456193581, 446796494, 436782341, 426087341, 414722710, 402740860, 390206642, 377178497, 363674965, 349629974, 334864502, 319121132, 302175541, 283988762, 264815693, 245198059, 225829086, 207357960, 190233002, 174655552, 160645256, 148154020, 137155838, 127684879, 119846020, 113837061, 109997339, 108840742, 111016073, 117168150, 127737036, 142784452, 161927986, 184405594, 209227505, 235331593, 261690426]
1657B61690426K5673237K4162731K1981411J9327698J6422004J3461571J0581856P861328
1665D01162262N359650L155708J343613k0180r75723j668625k288323k962074l682060
1674C99424248m327507m772148n012284n221863n683250o635551q131638r997368j1924209
1683C37718430j3632012j5003586j6113643j7143364j8246689j9449177k0627193k1561528
1691A95941238k2013111k1780176k0727939j8807478j6086150j2777214r237075n893745
1699F8618350l115263j069527L50743J484613K754145M472041O701488R217673J1585397
1708A00999660J3299990J3927889J3207188J1086416P725210L466835j206035n737448
1716A56769705r584294j2310447j3662319j3601895j2283220r987097p037620l731881
$$ y = [261690426, 287363663, 311526394, 333507805, 352835503, 369257507, 382719078, 393300934, 401162262, 406521912, 409677620, 411021233, 411001053, 410025330, 408356705, 406068382, 403106308, 399424248, 395096741, 390324593, 385312309, 380090446, 374407196, 367771645, 359640007, 349642639, 337718430, 324086418, 309082832, 292969189, 275825825, 257579136, 238129959, 217502766, 195941238, 173928127, 152147951, 131420012, 112612534, 96526384, 83749170, 74512095, 68618350, 65503087, 64433560, 64784303, 66268916, 69023061, 73495102, 80196590, 89414263, 100999660, 114299650, 128227539, 141434727, 152521143, 160246353, 163713188, 162507153, 156769705, 147185411, 134874964, 121212645, 107610750, 95327530, 85340433, 78302813, 74570932]
1724G4570932k95996L124490O451530R646616J2677193J5488844J7990379K0059833
1732A59713821K1573029K2446461K2673645K2340355K1605053K0655860J9657250J8714600
1740C29380074J7864494J7087898J6340065J5574379J4759674J3889504J2987480J2106743
1748D49990311J1322593J0712090J0325279J0159378J0154495J0210953J0225792J0128746
1756E33229637R898682R555893R145508Q717193Q318710P992898P768478P640800P555657
1765F09823456P413902P107468O578483N863343N096359M451599M063873L961106M054794
1774F58414383M192963M234085M108963L829879L461914L081055K749710K517090K421036
1783F89011078K478866K659760K870560K973785K851334K474746J942139J442413J161728
$$ y = [74570932, 74274936, 77399426, 83850956, 93497572, 106174765, 121663609, 139653988, 159713821, 181286850, 203733311, 226406956, 248747311, 270352364, 291008224, 310665474, 329380074, 347244568, 364332466, 380672531, 396246910, 411006584, 424896088, 437883568, 449990311, 461312904, 472024994, 482350273, 492509651, 502664146, 512875099, 523100891, 533229637, 543128319, 552684212, 561829720, 570546913, 578865623, 586858521, 594626999, 602267799, 609823456, 617237358, 624344826, 630923309, 636786652, 641883011, 646334610, 650398483, 654359589, 658414383, 662607346, 666841431, 670950394, 674780273, 678242187, 681323242, 684072952, 686590042, 689011078, 691489944, 694149704, 697020264, 699994049, 702845383, 705320129, 707262268, 708704681, 709866409]
1792G09866409J181412J428528J712875J827088J656952J237564P31353L41874K18505
1801G20202560L92380P76978J216659J559677J715699J683578J533203J364517J257248
1810G31702499J240235J288833J351853J389389J393585J389008J406631J458893J529694
1819G44150620J587600J607437J581498J515197J410218J259765J062241Q41217O52008
1828G55667801N60532O01501P46078R12400J013260J017913R74274R75418J085358
1837G63554535J277313J432572J407852J130142O56357J53427j86844k51389n7907
1846G69116058K65580N58548P11593P05719N95780M61578L59726L06320K87552K85873
1856G73654327K95868L27225L93372M95758O14319P08236P23877O18820L83377N6305
$$ y = [709866409, 711047821, 712476349, 714189224, 716016312, 717673264, 718910828, 719642181, 719984055, 720202560, 720594940, 721371918, 722588577, 724148254, 725863953, 727547531, 729080734, 730445251, 731702499, 732942734, 734231567, 735583420, 736972809, 738366394, 739755402, 741162033, 742620926, 744150620, 745738220, 747345657, 748927155, 750442352, 751852570, 753112335, 754174576, 755015793, 755667801, 756228333, 756829834, 757575912, 758488312, 759501572, 760519485, 761493759, 762469177, 763554535, 764831848, 766264420, 767672272, 768802414, 769458771, 769612198, 769425354, 769173965, 769116058, 769381638, 769940186, 770651779, 771357498, 771953278, 772414856, 772774582, 773080902, 773368454, 773654327, 773950195, 774277420, 774670792, 775166550, 775780869, 776489105, 777212982, 777831802, 778215179, 778271484]
1866G78271484k82058n39551o55747o31713n29633m37698m22135m92706o07147p03583
1876G72969513p39746p13425o49643n73959m91715l92685k72598j50986o7901o0730
1886G68856125j34277k52076l53927l87650l35083k16217p1564O0425J55182K00272
1896G67521210J89666J23978J9302q6593j43128j12838J907J50833K59552K72370J91726
1907G68387985Q2550L8834J28555L50571O32248Q63952R55048Q76923O69403M15573
1917G73401642J99814P3013M3030Q2168J48468K02866K17972J83716J04065k213j07193
1928G74547348j82953k10800j90125j38855q4304n2948n6916r2849j47095k02866k48718
1939G72938919k82135l08609l38516l85437m61045n70220p05109q42667r47571r84039
$$ y = [778271484, 777989426, 777449875, 776794128, 776162415, 775632782, 775195084, 774772949, 774280243, 773673096, 772969513, 772229767, 771516342, 770866699, 770292740, 769801025, 769408340, 769135742, 768984756, 768916855, 768856125, 768721848, 768469772, 768115845, 767728195, 767393112, 767176895, 767105331, 767165756, 767320938, 767521210, 767710876, 767834854, 767854156, 767767563, 767624435, 767511597, 767513504, 767664337, 767923889, 768196259, 768387985, 768470535, 768509369, 768637924, 768988495, 769620743, 770484695, 771439743, 772316666, 772986069, 773401642, 773601456, 773674469, 773717499, 773799667, 773948135, 774151001, 774368973, 774552689, 774656754, 774654541, 774547348, 774364395, 774153595, 773963470, 773824615, 773740311, 773687363, 773630447, 773537598, 773390503, 773187637, 772938919, 772656784, 772348175, 772009659, 771624222, 771163177, 770592957, 769887848, 769045181, 768097610, 767113571]
1949G67113571r29870p89261n91812l80249j89133k9907J12152K65350M47235O48270
1959G65676346Q28018R32541R20715P86438N67856L29056J34277J9455j9379j8081
1969G70157242j9531m9439j00174j37329j17111j2741J70593L93524N98526P33490
1979G71617050P72476P26090O33316N43976M96368M99497N32836N57633N38254M61654
1989G77379150L44544K26364J50757J44195K04392L00598L87268M24423L92685K98767
1999G80253143J72272N1270l0518n6686l2273J9760O6910Q1787N1880j5793r7427j66855
2011G80297470k04773k08206j89743j68381j59378j67007j84861j99508j99356j78452
2021G78437805j38016q3923k6016K3880N6686O5689N1499K3727k594j1673M807M4021
$$ y = [767113571, 766183701, 765394440, 764802628, 764422379, 764233246, 764203339, 764315491, 764580841, 765028076, 765676346, 766504364, 767436905, 768357620, 769144058, 769711914, 770040970, 770175247, 770194702, 770175323, 770157242, 770137711, 770088272, 769988098, 769850769, 769733658, 769720917, 769891510, 770285034, 770883560, 771617050, 772389526, 773115616, 773748932, 774292908, 774789276, 775288773, 775821609, 776379242, 776917496, 777379150, 777723694, 777950058, 778100815, 778245010, 778449402, 778750000, 779137268, 779561691, 779954376, 780253143, 780425415, 780476685, 780446167, 780389481, 780357208, 780376968, 780443878, 780525665, 780577545, 780561752, 780464325, 780297470, 780092697, 779884491, 779694748, 779526367, 779366989, 779199982, 779015121, 778815613, 778616257, 778437805, 778299789, 778215866, 778189850, 778213730, 778270416, 778336105, 778387604, 778411331, 778408737, 778397064, 778401871, 778445892]
2033G78445892R1095J26496J32675J04217M8218j6785o9351r1781p9651m1962L82K4414
2045G78673859J4572l0594r5368j56173j90430j89056j59836j24283j05667j18942
2055G77518082j64185k27508k88010l28903l41645l30276l06931k86178k78168k85034
2065G74681244k99835l10517l05633k79083k33536j79215j29318r3613p4005o5460
2075G72711029n8060m1351r842L6545R1782J45721J87073K06146J97754J64413J16730
2086G73747940P1106M3411M1428O2027Q8959J02844Q8730M5547j2970o4316q6975p1792
2098G74055939k6017K9831P0954Q0185N5313P629m1199p0037o7597l4714J3962N8136
2110G74132385P7591O2485J7242m0893q7433j00861p4005j6632M5395Q2932P6446K5635
$$ y = [778445892, 778536987, 778663483, 778796158, 778900375, 778948593, 778931808, 778862457, 778770676, 778691025, 778649063, 778649445, 778673859, 778688431, 778657837, 778562469, 778406296, 778215866, 778026810, 777866974, 777742691, 777637024, 777518082, 777353897, 777126389, 776838379, 776509476, 776167831, 775837555, 775530624, 775244446, 774966278, 774681244, 774381409, 774070892, 773765259, 773486176, 773252640, 773073425, 772944107, 772850494, 772776489, 772711029, 772652969, 772611618, 772601776, 772638321, 772730103, 772875824, 773062897, 773269043, 773466797, 773631210, 773747940, 773819046, 773862457, 773903885, 773965912, 774054871, 774157715, 774246445, 774291992, 774279022, 774214706, 774127731, 774055939, 774029922, 774059753, 774130707, 774210892, 774266205, 774273834, 774232635, 774162598, 774095001, 774060287, 774074249, 774132385, 774209976, 774272461, 774289703, 774248810, 774161377, 774060516, 773986511, 773969879, 774015274, 774098206, 774174652, 774200287]
2122G74200287m9286j17569j50681j38702r1247l5096L82l662m8447j14746j73798
2133G73277435j98669j75171j08032j9150O3171J13297J21155R4833N6915L4104M4250
2144G73304138Q7280J46103J92566K02561J65405R0561M043o2789q7281o3400o866
2155G73972321N2642Q3695O6223J297q9035j71738k15759k06757j54342q6365l8147
2166G73214035l5934q4610j66779k48795k96020k88239k28042j39618n9586j9378l3036
2177G71613998r0255j61057k08511k06528j50070n7907L5782R5977J03913O3934Q39
2188G71040115m9972o1341k4948M4938J16653J56403J43585P9345j3122r9793j50528
2199G71181335j52816j15815o5612l3570m0512q8730j60598k27509k62375k51694j99890
$$ y = [774200287, 774151001, 774033432, 773882751, 773744049, 773652802, 773617706, 773618088, 773614426, 773565979, 773451233, 773277435, 773078766, 772903595, 772795563, 772776413, 772839584, 772952881, 773074036, 773168869, 773225784, 773259888, 773304138, 773391418, 773537521, 773730087, 773932648, 774098053, 774188614, 774192657, 774129868, 774042587, 773979187, 773972321, 774024963, 774108658, 774174881, 774176178, 774087143, 773915405, 773699646, 773492889, 773338547, 773252182, 773214035, 773178101, 773093491, 772926712, 772677917, 772381897, 772093658, 771865616, 771725998, 771666412, 771647034, 771613998, 771523743, 771362686, 771154175, 770947647, 770797577, 770739670, 770775452, 770871429, 770975342, 771039276, 771040115, 770990143, 770928802, 770903854, 770948792, 771065445, 771221848, 771365433, 771444778, 771431656, 771331863, 771181335, 771028519, 770912704, 770847092, 770813522, 770773010, 770684280, 770523682, 770296173, 770033798, 769782104, 769582214]
2210G69582214j28250o4087l0517l6927p6522j31073j78147k01873j97754j74027j46484
2221G68216553j32447j42898j78375k28577k76947l06854l08533k84119k44369k06452
2231G65906982j83563j80664j90964k00348j95007j67770j22299p2480l3416j7929
2241G64542542k8840n7449q8882j05210r4299n5008K899N8670R2468R0027N0125j3351
2253G64393692p9117j27029j44806j33896j06506q0109p0114q3618j18103j61286j97296
2264G63091812k10571j93329j48697r0637l6774m501R15j5716m0970n7907n4550k6856
2276G62212219K0294P6523J26267J54800J49689J08108L6164m9515j28632j86233k18506
2287G62301178k33612k47192k71454l10440l57361l99018m22515m21372l97339l59421
$$ y = [769582214, 769453964, 769389877, 769359360, 769322433, 769245911, 769114838, 768936691, 768734818, 768537064, 768363037, 768216553, 768084106, 767941208, 767762833, 767534256, 767257309, 766950455, 766641922, 766357803, 766113434, 765906982, 765723419, 765542755, 765351791, 765151443, 764956436, 764788666, 764666367, 764593887, 764560471, 764542542, 764513702, 764456253, 764367371, 764262161, 764167862, 764112854, 764115753, 764174423, 764266891, 764356918, 764407043, 764393692, 764314575, 764187546, 764042740, 763908844, 763802338, 763722229, 763652115, 763568497, 763450394, 763289108, 763091812, 762881241, 762687912, 762539215, 762448578, 762411804, 762407303, 762408218, 762392502, 762351532, 762293625, 762239075, 762212219, 762232513, 762309036, 762435303, 762590103, 762739792, 762847900, 762884064, 762834549, 762705917, 762519684, 762301178, 762067566, 761820374, 761548920, 761238480, 760881119, 760482101, 760059586, 759638214, 759240875, 758881454]
2297G58881454l21426k96020k91748l07770l35312l62015l80783l96042m23736m79737
2307G55286865n66635o62460p25250p11899o03638m24652k39716j33438j74103l80477
2317G50664597p06711j051178j293183j341018j175843q68530n55801l80860m22744
2326G42868729o54374r50927j157074j168671r89609p22351n01098m15421m70428o15311
2336G35223465q07343j051712j378173j760865k042007j947937j211929K39639K159195
2345G27422333M006653N145874N131912L919144J888809l30048k142486l220597l576202
2354G38245392l459625l170319k898407k675934k434082k104187j684799j240234q50068
2363G17727737n53665l33557j35727Q7357L53927O46134R31015J179504J375199J516571
$$ y = [758881454, 758560028, 758264008, 757972260, 757664490, 757329178, 756967163, 756586380, 756190338, 755766602, 755286865, 754720230, 754057770, 753332520, 752620621, 752016983, 751592331, 751352615, 751219177, 751045074, 750664597, 749957886, 748906708, 747613525, 746272507, 745096664, 744228134, 743672333, 743291473, 742868729, 742214355, 741263428, 740106354, 738937683, 737948074, 737225723, 736724625, 736309204, 735838776, 735223465, 734416122, 733364410, 731986237, 730225372, 728183365, 726235428, 725023499, 725263138, 727422333, 731428986, 736574860, 741706772, 745625916, 747514725, 747184677, 745042191, 741821594, 738245392, 734785767, 731615448, 728717041, 726041107, 723607025, 721502838, 719818039, 718577805, 717727737, 717174072, 716840515, 716704788, 716792145, 717146072, 717792206, 718723221, 719902725, 721277924, 722794495]
2373G22794495J614608J690979J774292J888199K037812K194976K304535K303925K154846
2382G40758667J865463J492081J115494Q09860O13632N21240M94004M81033M41971
2391G48593445L60031K44751J24435L2425p477Q469N9280J08567J20163P4539j9836
2402G49698792j30845k16827k47040k15301j41754o3630j6327j8615o5384j30081j79139
2413G48273849j86233j44959p0877M960N0354M5928o027q3008j54571j93558j90582
2424G47345276j55945j13754r3079j13220j77383k69928l63846m27475m40445l99018
2434G44791183l20587k34070j69982j45264j55792j79520j86844j55716q3084J4038
2444G43174362J05591J62735J69830J31455O8741J0681j7853n875L8987R4757J33896
$$ y = [722794495, 724409103, 726100082, 727874374, 729762573, 731800385, 733995361, 736299896, 738603821, 740758667, 742624130, 744116211, 745231705, 746041565, 746655197, 747176437, 747670441, 748151474, 748593445, 748953476, 749198227, 749322662, 749355087, 749347610, 749356079, 749415359, 749523926, 749644089, 749718628, 749698792, 749567947, 749351120, 749104080, 748888779, 748747025, 748683395, 748667068, 748648453, 748583069, 748452988, 748273849, 748087616, 747942657, 747871780, 747876740, 747927094, 747973022, 747966995, 747883987, 747729416, 747535858, 747345276, 747189331, 747075577, 746982498, 746869278, 746691895, 746421967, 746058121, 745630646, 745190201, 744791183, 744470596, 744236526, 744066544, 743921280, 743765488, 743585968, 743399124, 743243408, 743160324, 743174362, 743279953, 743442688, 743612518, 743743973, 743812714, 743823395, 743805542, 743799667, 743838654, 743933411, 744067307]
2455G44067307J35116R3002J9532n9891j16959j33972j10855o4926k3728j1596l9673
2466G43753357j00784j73493k31552k56042k42920k04850j64337j43127j53732j92872
2476G41889648k43606k83890k95563k72216k23008j66778j25656j15662j39923j87149
2486G39836197k36359k65197k60239k22550j68304j21994j05057j26114j76544k34680
2496G37919159k75574k83508k58255k14996j77002j63956j84174k30713k85186l25775
2506G35520020l35618l09906k57110j95542j46560j25351j35269j67084k02026k21558
2516G33423996k14767j82953j38932j00174q1863q8272j14365j44958j62583j54647
2526G32040482j17646n9280K899N0201O8055N2871J4954k7924n5923n6076k9602J1825
$$ y = [744067307, 744202423, 744295425, 744314957, 744255066, 744138107, 744004135, 743893280, 743828354, 743804626, 743793030, 743753357, 743652573, 743479080, 743247528, 742991486, 742748566, 742543716, 742379379, 742236252, 742082520, 741889648, 741646042, 741362152, 741066589, 740794373, 740571365, 740404587, 740278931, 740163269, 740023346, 739836197, 739599838, 739334641, 739074402, 738851852, 738683548, 738561554, 738456497, 738330383, 738153839, 737919159, 737643585, 737360077, 737101822, 736886826, 736709824, 736545868, 736361694, 736130981, 735845795, 735520020, 735184402, 734874496, 734617386, 734421844, 734275284, 734149933, 734014664, 733847580, 733645554, 733423996, 733209229, 733026276, 732887344, 732787170, 732705307, 732617035, 732502670, 732357712, 732195129, 732040482, 731922836, 731863556, 731866455, 731916656, 731984711, 732037582, 732052536, 732024612, 731968689, 731912613, 731883011, 731894836]
2538G31894836M9515O7673O0043L0594p248l7689m9133l8376j1063J9760L9902L8529
2550G32057343J2664l0899p8582j14594j28479j20010r9259q3923q9188j21841j75934
2561G31027298k33459k73819k82059k56882k10647j65482j43051j54953j99051k58789
2571G28849106l11814l37600l27835k88697k38113k00043j92413k21252k75345l33100
2581G26122894l69796l68577l28903k67563k10113j81656j93634k40250l01590l52096
2591G23308716l73154l61099l26767k91061k74735k89688l33023l88413m33502m48150
2601G19789124m23737l66974k97089k39639k14004k25144k61612l00369l17230k98386
2611G16844940k48260j86692j41143j31836j64109k24151k84043l16619l04566k50702
$$ y = [731894836, 731944351, 732012024, 732072067, 732102661, 732095413, 732057724, 732008591, 731970215, 731959152, 731978912, 732018814, 732057343, 732070007, 732039108, 731960526, 731845932, 731717453, 731597443, 731498184, 731414261, 731325073, 731203232, 731027298, 730793839, 730520020, 730237961, 729981079, 729770432, 729604950, 729461899, 729306946, 729107895, 728849106, 728537292, 728199692, 727871857, 727583160, 727345047, 727145004, 726952591, 726731339, 726455994, 726122894, 725753098, 725384521, 725055618, 724788055, 724577942, 724396286, 724202652, 723962402, 723660812, 723308716, 722935562, 722574463, 722247696, 721956635, 721681900, 721392212, 721059189, 720670776, 720237274, 719789124, 719365387, 718998413, 718701324, 718461685, 718247681, 718022537, 717760925, 717460556, 717143326, 716844940, 716596680, 716409988, 716268845, 716137009, 715972900, 715748749, 715464706, 715148087, 714843521, 714592819]
2621G14592819j75857j10169p8354r1095j38473j96381k37121k41700k08664j52740
2631G12962265r9716p2708q3695j27945j86233k33460k47345k19879j58691q5526k5863
2642G11421204j221j6480n9967j07193j32370j19705p1869q087M3335N9357L2654k6703
2654G11012955r3537j39999j49078j18485o4239j1139J6327N340m0054j02158j56555
2665G10159378j82877j73950j38244r6436p2784q2550j26038j88446k44980k72980
2675G08580093k62222k18201j61514j16730j02615j24512j71737k25373k65731k81525
2685G06649933k75040k58255k47803k56729k87170l30734l72162l95050l91007l62701
2695G03473282l23792k93884k88773l14636l63922m19769m62647m79354m68903m42276
$$ y = [714592819, 714416962, 714306793, 714228439, 714137344, 713998871, 713802490, 713565369, 713323669, 713115005, 712962265, 712862549, 712789841, 712706146, 712578201, 712391968, 712158508, 711911163, 711691284, 711532593, 711447067, 711421204, 711419983, 711403503, 711343536, 711236343, 711103973, 710984268, 710912399, 710904312, 710947647, 711007004, 711039658, 711012955, 710919418, 710779419, 710630341, 710511856, 710447617, 710436478, 710452805, 710458145, 710418091, 710315933, 710159378, 709976501, 709802551, 709664307, 709567871, 709495087, 709412537, 709286499, 709098053, 708853073, 708580093, 708317871, 708099670, 707938156, 707821426, 707718811, 707594299, 707422562, 707197189, 706931458, 706649933, 706374893, 706116638, 705868835, 705612106, 705324936, 704994202, 704622040, 704226990, 703835983, 703473282, 703149490, 702855606, 702566833, 702252197, 701888275, 701468506, 701005859, 700526505, 700057602, 699615326]
2705F99615326m15802m06723m22669m62646n15595n66101o00280o11420o01044n80291
2715F94432755n63813n63812n85327o23017o63375o91681o97785o81610o51626o21109
2725F88089600o01349n97916o09207o28357o47278o60095o63757o59104o49566o39878
2735F81733093o34079o33926o35986o33088o16912n81742n28564m66233m08325l69491
2745F76224747l58353l74756m10766m53263m89654n12543n21927n24673n30854n49087
2755F71498871n82504o27060o72531p07093p21130p12433o85120o50100o19126o02493
2765F64919281o05316o26602o59638o94885p24335p44247p57294p72400p99026q42667
2775F57692871q98971r55048r93347j000214r70993r12247q38928p66678p05948o59790
$$ y = [699615326, 699199524, 698792801, 698370132, 697907486, 697391891, 696825790, 696225510, 695614090, 695013046, 694432755, 693868942, 693305130, 692719803, 692096786, 691433411, 690741730, 690043945, 689362335, 688710709, 688089600, 687488251, 686890335, 686281128, 685652771, 685005493, 684345398, 683681641, 683022537, 682372971, 681733093, 681099014, 680465088, 679829102, 679196014, 678579102, 677997360, 677468796, 677002563, 676594238, 676224747, 675866394, 675491638, 675080872, 674627609, 674137955, 673625412, 673103485, 672578812, 672047958, 671498871, 670916367, 670289307, 669616776, 668909683, 668188553, 667476120, 666791000, 666140900, 665521774, 664919281, 664313965, 663687363, 663027725, 662332840, 661608505, 660864258, 660106964, 659334564, 658535538, 657692871, 656793900, 655838852, 654845505, 653845291, 652874298, 651962051, 651123123, 650356445, 649650497, 648990707]
2785F48990707o23931n91279n57098n20401m85153m58756m48379m59595m90875n35278
2795F43819962n80368o13633o28814o26984o18362o16227o29539o57578o89392p08923
2805F37450142p03774o70051o15387n54695n02739m68407m51927m45671m39415m23966
2815F32174110l94249l52211l05481k65922k47498k59742l04184l72086m47159n11665
2825F28713913n54695n77507n92194o15310o59790p26052q02498q71620r17702r34715
2835F21461830r29108r16709r15146r38225r89952j064835j149025j226005j283264
2844F12049561j315461j329040j336785j353721j389313j440773j496429j540947j563416
2853E99283676j565208j558380j561432j589508j648407j733551j833344j936226k035064
$$ y = [648990707, 648366776, 647775497, 647218399, 646697998, 646212845, 645754089, 645305710, 644846115, 644355240, 643819962, 643239594, 642625961, 641997147, 641370163, 640751801, 640135574, 639506035, 638848457, 638159065, 637450142, 636746368, 636076317, 635460930, 634906235, 634403496, 633935089, 633483162, 633037491, 632598076, 632174110, 631779861, 631427650, 631122169, 630856247, 630608749, 630349007, 630044823, 629672737, 629225578, 628713913, 628159218, 627581711, 626989517, 626374207, 625714417, 624988365, 624185867, 623314247, 622396545, 621461830, 620532722, 619616013, 618700867, 617762642, 616772690, 615707855, 614558830, 613332825, 612049561, 610734100, 609405060, 608068275, 606714554, 605325241, 603884468, 602388039, 600847092, 599283676, 597718468, 596160088, 594598656, 593009148, 591360741, 589627190, 587793846, 585857620, 583822556]
2862E83822556k128373k218132k305030k385979k453232k496223k504426k471351k396355
2871E62463455k287369k160949k038880j946106j902847j920433j997566k121544k272949
2880E43814812k432938k589950k741280k891274l046226l207207l368110l517914l646431
2889E16373482l749123l831367l904648l981247m067650m160004m243087m295617m293479
2898D79847260m217568m058990l822060l526421l202362k884521k600365k363815k171402
2907D50999756k008896j859016j714936j581726j475258j414070j408920j458473j551552
2916D36526909j671372j801757j929436k046356k145501k220687k266198k276077k244797
2925D17924728k168121k043228j871224j659088j421928j178589r48486p43103n63317
$$ y = [583822556, 581694183, 579476051, 577171021, 574785042, 572331810, 569835587, 567331161, 564859810, 562463455, 560176086, 558015137, 555976257, 554030151, 552127304, 550206871, 548209305, 546087761, 543814812, 541381874, 538791924, 536050644, 533159370, 530113144, 526905937, 523537827, 520019913, 516373482, 512624359, 508792992, 504888344, 500907097, 496839447, 492679443, 488436356, 484140739, 479847260, 475629692, 471570702, 467748642, 464222221, 461019859, 458135338, 455534973, 453171158, 450999756, 448990860, 447131844, 445416908, 443835182, 442359924, 440945854, 439536934, 438078461, 436526909, 434855537, 433053780, 431124344, 429077988, 426932487, 424711800, 422445602, 420169525, 417924728, 415756607, 413713379, 411842155, 410183067, 408761139, 407582550, 406634064, 405890961, 405327644]
2934D05327644l99170k35786o3324J18485K96630M50135N56945O01311N78728M96063
2944D07727661L68042K13623N0888j06048k47231l68385m66767n41915n91431o11878
2954D05426559n99403n51529m71229l68691k60467j68190j14136j17111j89591l36609
2964D02249603n54809q33359j154671j494941j828614k129822k374992k542610k609482
2973C86726303k550316k335663j940231j353226n89828L01018J241836K141991K918663
2982C84560547L517723L922462M150963M241333M236336M170570M068680L948860L830109
2991D20647583L733673L678627L673706L710251L760834L787880L755684L643074L449936
3000D53841248L196258K914620K639884K400017K210388K072030J972045J888962J797562
$$ y = [405327644, 404928474, 404692688, 404629364, 404747849, 405044479, 405494614, 406051559, 406652870, 407231598, 407727661, 408095703, 408309326, 408360214, 408254166, 408006935, 407638550, 407171783, 406629868, 406038437, 405426559, 404827156, 404275627, 403804398, 403435707, 403175240, 403007050, 402892914, 402775803, 402586212, 402249603, 401694794, 400861435, 399706764, 398211823, 396383209, 394253387, 391878395, 389335785, 386726303, 384175987, 381840324, 379900093, 378546867, 377957039, 378258057, 379499893, 381641884, 384560547, 388078270, 392000732, 396151695, 400393028, 404629364, 408799934, 412868614, 416817474, 420647583, 424381256, 428059883, 431733589, 435443840, 439204674, 442992554, 446748238, 450391312, 453841248, 457037506, 459952126, 462592010, 464992027, 467202415, 469274445, 471246490, 473135452, 474933014]
3009D74933014J676750J515083J313973J085052Q44651O05964L74794J49460p5493
3018D82423248l02314n27077p39327r25979j076546j185570j254234j287460j294861
3027D73829880j289025j286392j305961j362153j457786j576691j682167j728134j674156
3036D60467415j505356j243858r46274o87294n34821n27572o66085r17587j232338
3045D52206230j564140j881600k172126k434311k669297k874565l041763l161926l228340
3054D29178162l240128l203392l130989l041687k959251k907906k906952k964668l072891
3063D01750298l209839l343888l444023l488693l469238l392906l278008l151665l042679
3072C71929359k976608k968674l020057l116493l232995l342285l424034l471374l487549
$$ y = [474933014, 476609764, 478124847, 479438820, 480523872, 481368523, 481974487, 482349281, 482498741, 482423248, 482120934, 481593857, 480854530, 479928551, 478852005, 477666435, 476412201, 475124741, 473829880, 472540855, 471254463, 469948502, 468586349, 467128563, 465551872, 463869705, 462141571, 460467415, 458962059, 457718201, 456771927, 456084633, 455549812, 455022240, 454356155, 453438568, 452206230, 450642090, 448760490, 446588364, 444154053, 441484756, 438610191, 435568428, 432406502, 429178162, 425938034, 422734642, 419603653, 416561966, 413602715, 410694809, 407787857, 404823189, 401750298, 398540459, 395196571, 391752548, 388263855, 384794617, 381401711, 378123703, 374972038, 371929359, 368952751, 365984077, 362964020, 359847527, 356614532, 353272247, 349848213, 346376839, 342889290]
3081C42889290l478928l444023l368492l230057l010292k709808k356034k001285j705780
3090C17584591j518669j462021j525192j674481j868019k069397k255306k411327k526875
3099C00273304k586842k575569k483005k312718k086410j837559j600056j395187j226521
3108B82169437j080017r34314p71599n85194l81565j74847J8349J87111L27187M40540
3118B79215088N35431O21471P10163Q12207R34829J079712J241455J407585J565514
3127B88123455J704674J823425J929360K033195K144165K262211K377720K473869K535210
3136C07407284K553711K532406K482643K420330K358074K303276K257423K216988K177391
3145C28709526K133293K079163K009888J921081J810799J680526J536370J387024J241378
$$ y = [342889290, 339410362, 335966339, 332597847, 329367790, 326357498, 323647690, 321291656, 319290371, 317584591, 316065922, 314603901, 313078709, 311404228, 309536209, 307466812, 305211506, 302800179, 300273304, 297686462, 295110893, 292627888, 290315170, 288228760, 286391201, 284791145, 283395958, 282169437, 281089420, 280155106, 279383507, 278798313, 278416748, 278241901, 278260250, 278447361, 278774548, 279215088, 279750519, 280371990, 281082153, 281894360, 282829189, 283908901, 285150356, 286557941, 288123455, 289828129, 291651554, 293580914, 295614109, 297758274, 300020485, 302398205, 304872074, 307407284, 309960995, 312493401, 314976044, 317396374, 319754448, 322057724, 324315147, 326532135, 328709526, 330842819, 332921982, 334931870, 336852951, 338663750, 340344276, 341880646, 343267670, 344509048]
3154C44509048J104508R77516Q56323P35245O09818M77523L40538K00959O0234q1406
3164C49790306k24762l68690n09034o39610p54814q52699r35211j008225j075706j137658
3174C42283897j188392j221657j232033j220627j194381j163407j136780j120338j114464
3183C31691818j116791j123008j130219j137466j145859j157112j174584j199340j232109
3192C21275330j272736j320381j375580j439056j510964j589527j670666j748428j817436
3201C07530556j875763j925335j971054k018090k069358k124386k181416k238483k294808
3210B88831863k350177k405205k458248k508354k554265k595405k632046k663441k687950
3219B65976772k702884k705231k693634k666836k624302k565307k488213k393970k287198
$$ y = [344509048, 345613556, 346591072, 347447395, 348182640, 348792458, 349269981, 349610519, 349811478, 349871712, 349790306, 349565544, 349196854, 348687820, 348048210, 347293396, 346440697, 345505486, 344497261, 343421555, 342283897, 341095505, 339873848, 338641815, 337421188, 336226807, 335063400, 333926620, 332806282, 331691818, 330575027, 329452019, 328321800, 327184334, 326038475, 324881363, 323706779, 322507439, 321275330, 320002594, 318682213, 317306633, 315867577, 314356613, 312767086, 311096420, 309347992, 307530556, 305654793, 303729458, 301758404, 299740314, 297670956, 295546570, 293365154, 291126671, 288831863, 286481686, 284076481, 281618233, 279109879, 276555614, 273960209, 271328163, 268664722, 265976772, 263273888, 260568657, 257875023, 255208187, 252583885, 250018578, 247530365, 245136395, 242849197]
3228B42849197k175903k069511j974221j889553j806717j712894j595669j449661j277313
3237B26897755j088066q92201o96182n00050k99415q7777J38131L78074O28682Q87355
3247B25366306J153279J428013J713333K008686K310257K612915K912655L208942L504372
3256B46218758L802471M104500M407577M705525M990768N256920N498676N713329N898400
3265B90596924O051502O171608O259060O316299O347237O355438O343727O314240O268959
3274C47024994O210441O141434O066094N987014N906945N828361N752564N679168N605126
3283D00202141N525627N434608N329400N210647N083313M954567M828758M705849M581337
3292D45856247M449959M307632M155464L997078L836098L672943L504372L325805L134499
$$ y = [242849197, 240673294, 238603783, 236629562, 234740009, 232933292, 231220398, 229624729, 228175068, 226897755, 225809689, 224917488, 224221306, 223721256, 223421841, 223334064, 223472195, 223850269, 224478951, 225366306, 226519585, 227947598, 229660931, 231669617, 233979874, 236592789, 239505444, 242714386, 246218758, 250021229, 254125729, 258533306, 263238831, 268229599, 273486519, 278985195, 284698524, 290596924, 296648426, 302820034, 309079094, 315395393, 321742630, 328098068, 334441795, 340756035, 347024994, 353235435, 359376869, 365442963, 371429977, 377336922, 383165283, 388917847, 394597015, 400202141, 405727768, 411162376, 416491776, 421702423, 426785736, 431740303, 436569061, 441274910, 445856247, 450306206, 454613838, 458769302, 462766380, 466602478, 470275421, 473779793, 477105598, 480240097]
3301D80240097K934189K733498K542839K369499K216034K078361J951790J833305J723824
3310E00623436J627655J547852J484489J434555J394081J361084J336327J320495J311264
3319E13441238J300431J277961J235810J173439J098137J021690R52644Q92716Q37021
3328E23231087P79381P18345O60057O14701N91507N92498O11267O35529O52885O55136
3338E29742393O39725O09894N72052N32570M97513M67033M37164L96614L31002K28691
3348E34454651Q6098q8768k76871m56200o08253p22962q00132q43125q53233q25157
3358E29066048p47452o07872m01535j35155J69487M80309P64007R93157J154823J248779
3368E31984596J286202J281433J245727J186943J107865J009903Q95843P69806O37207
$$ y = [480240097, 483174286, 485907784, 488450623, 490820122, 493036156, 495114517, 497066307, 498899612, 500623436, 502251091, 503798943, 505283432, 506717987, 508112068, 509473152, 510809479, 512129974, 513441238, 514741669, 516019630, 517255440, 518428879, 519527016, 520548706, 521501350, 522394066, 523231087, 524010468, 524728813, 525388870, 526003571, 526595078, 527187576, 527798843, 528434372, 529087257, 529742393, 530382118, 530992012, 531564064, 532096634, 532594147, 533061180, 533498344, 533894958, 534225960, 534454651, 534540749, 534451981, 534175110, 533718910, 533110657, 532387695, 531587563, 530744438, 529891205, 529066048, 528318596, 527710724, 527309189, 527174034, 527343521, 527823830, 528587837, 529580994, 530735817, 531984596, 533270798, 534552231, 535797958, 536984901, 538092766, 539102669, 539998512, 540768318, 541405525]
3377E41405525N03273L72963K51160J43509N4893j0414n0888o5842n3901j2055O4011
3388E42602234J75743L17917M74777O23016P38869Q06122Q22945Q01658P62444P23343
3398E48849068O93931O71501O45714O06652N50041M81033M09851L48549L04832K81449
3408E53842621K75917K83546K96517L06129L02162K76909K27928J61820R3384M1122
3418E56108055J8005K6703N8518R7198J28136J43738J45530J40763J37176J39733J48658
3429E57292213J62507J80549K01950K26670K54325K83509L13072L41110L64571L78265
3439E59998741L75405L52325L11890K66227K33231K29988K63062L25431L98865M61693
3449E63216858N00221N11818N04112M88358M73328M61463M52042M44031M37660M33083
$$ y = [541405525, 541908798, 542281761, 542532921, 542676430, 542731323, 542720909, 542670021, 542604179, 542550278, 542538223, 542602234, 542777977, 543095894, 543570671, 544193687, 544932556, 545738678, 546561623, 547363281, 548125725, 548849068, 549542999, 550214500, 550860214, 551466866, 552016907, 552497940, 552907791, 553256340, 553561172, 553842621, 554118538, 554402084, 554698601, 555004730, 555306892, 555583801, 555811729, 555973549, 556066933, 556108055, 556126060, 556152763, 556211281, 556308479, 556436615, 556580353, 556725883, 556866646, 557003822, 557143555, 557292213, 557454720, 557635269, 557837219, 558063889, 558318214, 558601723, 558914795, 559255905, 559620476, 559998741, 560374146, 560726471, 561038361, 561304588, 561537819, 561767807, 562030869, 562356300, 562755165, 563216858, 563717079, 564228897, 564733009, 565221367, 565694695, 566156158, 566608200, 567052231, 567489891, 567922974]
3459E67922974M29420M22859M10614L93906L80135L78570L94974M25377M56733M74816
3469E72090378M72565M56199M40941M41551M60587M86107M98848M84352M44336L95660
3479E76671524L60336L52974L72544M06456M39872M66576M89044N13535N39703N59921
3489E81172485N64728N53131N37148N35507N59883O02532O37664O36216N85327M99763
3499E86884384M16107L72086L83606M37622M99611N37071N37987N15213M96139N02968
3509E91582794N40810N97038O51741O91452P13234P22809P25403P21435P05986O74515
3519E98327217O27098N69802N10559M58259M20189M03938M17557M65546N43060O33011
3529F03376236P08008P43408P30476O86493O48575O57272P31087Q51402R65844J010475
$$ y = [567922974, 568352394, 568775253, 569185867, 569579773, 569959908, 570338478, 570733452, 571158829, 571615562, 572090378, 572562943, 573019142, 573460083, 573901634, 574362221, 574848328, 575347176, 575831528, 576275864, 576671524, 577031860, 577384834, 577757378, 578163834, 578603706, 579070282, 579559326, 580072861, 580612564, 581172485, 581737213, 582290344, 582827492, 583362999, 583922882, 584525414, 585163078, 585799294, 586384621, 586884384, 587300491, 587672577, 588056183, 588493805, 588993416, 589530487, 590068474, 590583687, 591079826, 591582794, 592123604, 592720642, 593372383, 594063835, 594777069, 595499878, 596225281, 596946716, 597652702, 598327217, 598954315, 599524117, 600034676, 600492935, 600913124, 601317062, 601734619, 602200165, 602743225, 603376236, 604084244, 604827652, 605558128, 606244621, 606893196, 607550468, 608281555, 609132957, 610098801, 611109276]
3539F11109276R45396P77855N65109L86811L05099L32680M29954N30854N85212N87922
3549F16556168N73997N91278O62193P70264Q78334R62181J033097J124916J251831
3558F24404259J370659J381607J181373P39823J47781m00314o92902o08139j77574
3567F27346573M29497R92584J343498J428986J306724J092491R00078Q08716Q58498
3576F36507645J054687J360817J684761J885147J818543J416931P52869L6315m64782
3585F46052933n57251k20413L78723R75647J342544J392822J197129R15069O95420
3594F52172623O10275O52237P80716R65042J192932J443405J657181J741638J615753
3603F62831802J268387P85141L25775N3940O7139L53851P99637J229095J462479J372070
$$ y = [611109276, 612054672, 612832527, 613397636, 613784447, 614089546, 614422226, 614852180, 615383034, 615968246, 616556168, 617130165, 617721443, 618383636, 619153900, 620032234, 620994415, 622027512, 623152428, 624404259, 625774918, 627156525, 628337898, 629077721, 629225502, 628825188, 628132286, 627524147, 627346573, 627776070, 628768654, 630112152, 631541138, 632847862, 633940353, 634840431, 635649147, 636507645, 637562332, 638923149, 640607910, 642493057, 644311600, 645728531, 646481400, 646517715, 646052933, 645495682, 645275269, 645653992, 646629639, 647972183, 649365005, 650562134, 651477203, 652172623, 652782898, 653435135, 654215851, 655180893, 656373825, 657817230, 659474411, 661216049, 662831802, 664100189, 664885330, 665211105, 665265045, 665332184, 665686035, 666485672, 667714767, 669177246, 670549316]
3613F70549316R33228K56882m12369p62634n40009L01056J512299K601471L026275
3622F77465515K465210J008606q38242k371063l014984k590256j370315Q9187J244050
3631F72087708J802673J796188J475220J128387R50776J014175J307526J772003K284393
3640F85619049K631455K536468J786346L95966j300507k740631l387222l011322j830292
3649F80699310m00543O78406J068115Q26111L07159q0795r8343K51999Q08640J388702
3659F85448761J872101K194900K297745K113037J616669Q96225J50986m03138o72607
3668F95514679p59811q98819j281968j896591k492904k714158k309722j286622R3995
3677F81968079J455459K482071L013382L024445K549820J633682L61786j074295k354813
$$ y = [670549316, 671482544, 671739426, 671327057, 670564423, 670024414, 670325470, 671837769, 674439240, 677465515, 679930725, 680939331, 680101089, 677730026, 674715042, 672124786, 670754471, 670843658, 672087708, 673890381, 675686569, 677161789, 678290176, 679240952, 680255127, 681562653, 683334656, 685619049, 688250504, 690786972, 692573318, 692969284, 691668777, 688928146, 685540924, 682529602, 680699310, 680298767, 680977173, 682045288, 682871399, 683178558, 683097763, 682999420, 683251419, 684060059, 685448761, 687320862, 689515762, 691813507, 693926544, 695543213, 696439438, 696590424, 696187286, 695514679, 694754868, 693856049, 692574081, 690677490, 688184586, 685470428, 683160706, 681874084, 681968079, 683423538, 685905609, 688918991, 691943436, 694493256, 696126938, 696488724, 695414429, 693059616]
3686F93059616l115387l105240k325058j048050K95716J310424J784134J725006J289826
3695F89870987O74438M4556m64249p26089o28510j37329O28739J378631J741257J438141
3705F93820572M53949r13010k156219k786637k557067j569062k10037J036606J800613
3714F86919708J949845J587524R49631K78091k59552n87082o88553n71060k52533K25983
3724F89552002P80945J277237J543045J412735P95440k51007j473388k451554k733154
3733F88452301k042541m73328J464386L012237L507996K731628J048356p60041j913833
3742F95027161k057801j438446p19146n41001j110458k073364k751999k586975j496964
3751F80251007O9275J408615J976624J675338Q56476O5766k85035j14822L46909P50122
$$ y = [693059616, 689944229, 686838989, 684513931, 683465881, 683761597, 685072021, 686856155, 688581161, 689870987, 690545425, 690589981, 690125732, 689399643, 688771133, 688633804, 689262543, 690641174, 692382431, 693820572, 694274521, 693361511, 691205292, 688418655, 685861588, 684292526, 684082489, 685119095, 686919708, 688869553, 690457077, 691406708, 691684799, 691425247, 690838165, 690149612, 689578552, 689326019, 689552002, 690332947, 691610184, 693153229, 694565964, 695361404, 695110397, 693637009, 691185455, 688452301, 686409760, 685936432, 687400818, 690413055, 693921051, 696652679, 697701035, 696940994, 695027161, 692969360, 691530914, 690811768, 690270767, 689160309, 687086945, 684334946, 681747971, 680251007, 680320282, 681728897, 683705521, 685380859, 686237335, 686303101, 686018066, 685903244, 686250153, 687000275]
3761F87000275Q33892N37415j7853o26373j094589j291733j162567p28226r1934N67398
3771F83925705J036606J147156Q56399K80304l49274p93991r20105p54089m47464j79596
3781F83801651n2261m5395n0354M0512K56347N28946P47834Q44955Q40454Q18863Q42743
3792F88574295Q77304P89795M39835j98594r74044j616822j893081j752472j361084
3801F82885132r82895p90405p35398n84793j05438P32574J680756K330933K357406
3810F86787872J718216O80313l45764j047210j360703j443710j503754j615067j665267
3819F80204926j453782q67157P63Q80051J472549J628342J422806J089554Q61130Q18481
3829F86057663Q44269P08999K30484n93490j554260k325974k631149k380295j707077
$$ y = [687000275, 687834167, 688371582, 688353729, 687727356, 686632767, 685341034, 684178467, 683450241, 683358307, 683925705, 684962311, 686109467, 686965866, 687246170, 686896896, 686102905, 685182800, 684428711, 683981247, 683801651, 683749390, 683703995, 683653641, 683694153, 683950500, 684479446, 685227280, 686072235, 686912689, 687731552, 688574295, 689451599, 690241394, 690681229, 690482635, 689508591, 687891769, 685998688, 684246216, 682885132, 681902237, 681111832, 680376434, 679791641, 679686203, 680418777, 682099533, 684430466, 686787872, 688506088, 689186401, 688840637, 687793427, 686432724, 684989014, 683485260, 681870193, 680204926, 678751144, 677883987, 677884750, 678764801, 680237350, 681865692, 683288498, 684378052, 685239182, 686057663, 686901932, 687610931, 687841415, 687247925, 685693665, 683367691, 680736542, 678356247, 676649170]
3838F76649170q75092j11923N22614J144485J912384K827454L611297L764267K819519
3847F92264175O61164k279206n099182o772995o619491m638367j539536J568299L668518
3856F71213379M255829L487777K012711N95169k49863m38385k51388r7046k55890p37991
3866F79534302j314850j671829j589051j052322k42767N61294J116410J308288J167069
3875F77816544Q17031L98102P477l14331n57175p10296p51877o72379n02700l22571
3885F75207825k23236k46201l36914l56674j60294L02887R27277J475448J683808J395340
3895F79669266O39572l78952j375427k100602k419433k321549j883010j219025m55322
3904F68155518K80914Q71658J229096J322555J185303Q93707N26886J42136k24457
$$ y = [676649170, 675774078, 675662155, 676184769, 677329254, 679241638, 682069092, 685680389, 689444656, 692264175, 692925339, 690646133, 685546951, 678773956, 672154465, 667516098, 665976562, 667544861, 671213379, 675469208, 678956985, 680969696, 681564865, 681315002, 680876617, 680625229, 680528183, 680272293, 679534302, 678219452, 676547623, 674958572, 673906250, 673663483, 674224777, 675341187, 676649475, 677816544, 678633575, 679031677, 679039154, 678724823, 678167648, 677457352, 676705475, 676033096, 675530396, 675207825, 674984589, 674738388, 674401474, 674044800, 673884506, 674187393, 675114670, 676590118, 678273926, 679669266, 680308838, 679929886, 678554459, 676453857, 674034424, 671712875, 669829865, 668610840, 668155518, 668436432, 669308090, 670537186, 671859741, 673045044, 673938751, 674465637, 674607773, 674383316]
3913F74383316n32989p27005p54700o10657l61481j24511Q39n646p2021r5291k6169
3924F71073685Q5983J23215m883k84653n89905p56607o86569m04282l3721K76031M29230
3935F69227524M09164K57035L7841j82647l43781m00619l44849k24838j31684j43051
3945F68160095k65274m17709m85001m04129k17132l9139K7466k7542j24741j72730
3955F66034164j50756j21537j62582k78626l83758l77808k45208q7433m1581j57547
3965F64027328l42025m37012l63541k06451j44196k80685n30090o74286n63278k75116
3975F60210648p5608j86004n56031q69979q18940m16488n3559j82724q72650j644363
3985F54534302j822434j178360l02200k59323j656418l852615n141144m104042j344376
$$ y = [674383316, 673850327, 673123322, 672368622, 671757965, 671396484, 671271973, 671272812, 671267166, 671195145, 671099854, 671073685, 671159668, 671282883, 671278000, 670993347, 670403442, 669646835, 668960266, 668555984, 668522263, 668798294, 669227524, 669636688, 669893723, 669931564, 669748917, 669405136, 669004517, 668659668, 668434830, 668303146, 668160095, 667894821, 667477112, 666992111, 666587982, 666370850, 666331711, 666359177, 666331635, 666206894, 666034164, 665883408, 665761871, 665599289, 665320663, 664936905, 664559097, 664313889, 664226456, 664184875, 664027328, 663685303, 663248291, 662884750, 662678299, 662534103, 662253418, 661723328, 661049042, 660485764, 660210648, 660135040, 659949036, 659393005, 658523026, 657704086, 657287598, 657234039, 657051315, 656178665, 654534302, 652711868, 651533508, 651231308, 650971985, 649315567, 645462952, 640321808, 636217766, 634873390]
3994F34873390k39715n725708k1407547m6604462p5337296r8306198
4000C87252464
$$ y = [634873390, 634633675, 628907967, 607500420, 560895958, 485558662, 387252464]
##END=$$ End of the data block
