##TITLE=$$ Begin of the data block
##JCAMP-DX=5.00 $$ ACD/SpecManager v 10.08
##SPECTROMETER/DATA SYSTEM=16PC
##DATE=04 Jun 2013 10:36:40
##DATA TYPE=INFRARED SPECTRUM
##DATA CLASS=XYDATA
##ORIGIN=
##OWNER=
##NPOINTS=3601
##FIRSTX=400.00000000
##LASTX=4000.00000000
##MAXX=4000.00000000
##MINX=400.00000000
##MAXY=79.20747375
##MINY=15.03696251
##XFACTOR=1.0000000000
##YFACTOR=0.000000100000000
##FIRSTY=43.77912903
##DELTAX=1.00000000
##XUNITS=1/CM
##YUNITS=TRANSMITTANCE
##XYDATA=(X++(Y..Y))
$$ plain form
400 437791290 540640335 623761826 681075516 713650818 727992706 732631226 734716644 738064957
408 738064957 743169785 748660507 753085251 756010132 758042984 760104980 762641983 765342102 767471313
417 767471313 768492126 768481064 768060608 767935333 768391647 769121017 769477310 768968735 767637939 766066742
427 766066742 765013580 764927826 765661621 766555939 766832962 766042404 764288483 762119064 760170364 758792038
437 758792038 757869263 756921387 755387497 752919235 749517136 745458527 741085892 736587906 731894836
446 731894836 726736450 720820770 714045181 706637039 699160080 692382507 687054291 683682938 682399368
455 682399368 682967987 684936447 687852554 691440201 695646896 700542221 706132812 712212219 718345566
464 718345566 724017792 728866272 732864075 736334610 739774628 743573303 747782516 752071381 755896072
$$ packed form
400D37791290J02849045Q3121491N7313690L2575302J4341888M638520K085418L348313
408G38064957N104828N490722M424744K924881K032852K061996K537003K700119K129211
417G67471313J020813j1062m20456j25275M56314P29370L56293n08575j330796j571197
427G66066742j053162q5754P33795Q94318K77023p90558j753921k169419j948700j378326
437G58792038r22775r47876j533890k468262l402099m058609m372635m497986m693070
446G31894836n158386n915680o775589p408142p476959o777573n328216l371353j283570
455F82399368N68619J968460K916107L587647M206695M895325N590591O079407O133347
464G18345566N672226M848480L997803L470535L440018L798675M209213M288865L824691
$$ plain form
473 755896072 758794174 760637817 761703568 762519531 763574295 765052567 766744766 768172684 768862991
482 768862991 768605881 767562561 766158371 764831619 763778915 762837753 761567993 759486618 756322708
491 756322708 752165909 747433167 742690964 738435822 734952393 732308426 730468597 729435120 729322739
500 729322739 730314941 732522888 735822678 739746017 743479156 745957413 746028595 742647705 735086441
509 735086441 723152161 707389755 689200516 670789566 654869308 644129333 640590286 645046539
517 645046539 656802292 673824997 693280258 712274857 728551178 740918961 749315186 754532394
525 754532394 757762604 760135193 762397690 764802246 767190857 769203644 770521317 771047363 770972748
534 770972748 770699081 770660934 771122360 772050171 773126450 773909302 774062958 773541794 772624817 771774597
$$ packed form
473G55896072K898102J843643J065751Q15963J054764J478272J692199J427918O90307
482G68862991k57110j043320j404190j326752j052704r41162j269760k081375l163910
491G56322708m156799m732742m742203m255142l483429k643967j839829j033477j12381
500G29322739R92202K207947L299790L923339L733139K478257P1182l380890p561264
509G35086441j1934280j5762406j8189239j8410950j5920258j0739975l539047M456253
517F45046539J1755753J7022705J9455261J8994599J6276321J2367783Q396225N217208
525G54532394L230210K372589K262497K404556K388611K012787J317673N26046p4615
534G70972748k73667l8147M61426R27811J076279P82852J53656n21164r16977q50220
$$ plain form
544 771774597 771390381 771588593 772132950 772556152 772410889 771509933 770024261 768382645 767028809 766166992
554 766166992 765630569 764942017 763523407 760949097 757115173 752260361 746850739 741411743 736398849
563 736398849 732160110 728979721 727136841 726915131 728527679 731984940 736980591 742871399 748795090
572 748795090 753901367 757609100 759783401 760745850 761107407 761492996 762278976 763461304 764714127
581 764714127 765600281 765825806 765402069 764637299 763963852 763699722 763876648 764223938 764314880 763784943
591 763784943 762501068 760588074 758312454 755898132 753396835 750683975 747584610 744039688 740210190
600 740210190 736448059 733149796 730580521 728776169 727581406 726802139 726376343 726457138 727347488
609 727347488 729313507 732377167 736204376 740159912 743518143 745738220 746677780 746645813 746271973
$$ packed form
544G71774597l84216J98212N44357M23202j45263r00956j485672j641616j353836q61817
554G66166992n36423o88552j418610k574310l833924m854812n409622n438996n012894
563G36398849m238739l180389j842880k21710J612548L457261M995651N890808N923691
572G48795090N106277L707733K174301R62449L61557L85589P85980J182328J252823
581G64714127Q86154K25525m23737p64770o73447k64130J76926L47290R0942n29937
591G63784943j283875j912994k275620k414322k501297k712860l099365l544922l829498
600G40210190l762131l298263k569275j804352j194763p79267m25796Q0795Q90350
609G27347488J966019L063660L827209L955536L358231K220077R39560l1967l73840
$$ plain form
618 746271973 746239548 746996231 748557358 750477524 752005844 752364502 751049881 748047943 743880310
627 743880310 739465637 735841599 733850021 733899384 735887680 739304428 743452377 747685242 751562653
636 751562653 754868164 757521133 759458008 760571976 760751419 759984131 758447266 756499176 754553986
645 754553986 752888489 751492462 750054169 748101349 745227585 741275177 736369553 730782471 724712296
654 724712296 718126602 710779419 702422562 693102188 683369446 674262924 667039413 662755203 661893768
663 661893768 664209976 668859253 674739838 680877304 686681671 691978302 696839981 701340485 705370102
672 705370102 708611526 710675964 711318893 710616379 709004898 707152176 705710983 705059052 705145416
681 705145416 705517349 705523453 704598694 702489700 699287186 695227051 690342178 684162750 675664749
$$ packed form
618G46271973l2425P56683J561127J920166J528320L58658j314621l001938m167633
627G43880310m414673l624038j991578M9363J988296L416748M147949M232865L877411
636G51562653L305511K652969J936875J113968J79443p67288j536865j948090j945190
645G54553986j665497j396027j438293j952820k873764l952408m905624n587082o070175
654G24712296o585694p347183q356857r320374r732742r106522p223511m284210q61435
663F61893768K316208M649277N880585O137466N804367N296631M861679M500504M029617
672G05370102L241424K064438O42929p02514j611481j852722j441193o51931Q6364
681G05145416L71933O104r24759k108994l202514m060135m884873o179428q498001
$$ plain form
690 675664749 663579102 646987686 625953255 601865425 577277451 555232353 538341370 528013458
698 528013458 524189224 525692062 531004219 539066582 549694901 563415833 580839157 601926231
706 601926231 625565529 649691010 671894684 690220490 703759308 712775269 718354263 721795731
714 721795731 724068222 725570755 726254044 725955582 724722290 722926407 721138077 719852600 719243088
723 719243088 719086456 718892517 718160248 716621780 714348145 711679459 709022064 706629333 704474564
732 704474564 702277222 699659653 696351700 692327805 687803802 683086166 678350754 673473358 668019409
741 668019409 661426010 653304291 643711624 633237076 622818260 613346634 605230713 598138084
749 598138084 591065331 582738228 572180252 559199944 544575462 529851418 516841660 507055740
$$ packed form
690F75664749j2085647j6591416k1034431k4087830k4587974k2045098j6890983j0327912
698E28013458l824234J502838N312157Q062363J0628319J3720932J7423324K1087074
706F01926231K3639298K4125481K2203674J8325806J3538818R015961N578994L441468
714G21795731K272491J502533O83289k98462j233292j795883j788330j285477o09512
723G19243088j56632j93939p32269j538468k273635k668686k657395k392731k154769
732G04474564k197342k617569l307953m023895m524003m717636m735412m877396n453949
741F68019409o593399q121719r592667j0474548j0418816r471626q115921p092629
749E98138084p072753q327103j0557976j2980308j4624482j4724044j3009758r785920
$$ plain form
757 507055740 501285515 499494400 500995522 504789467 509877090 515428696 520789986 525402451 528748169
766 528748169 530386810 530075073 527889786 524263611 519887619 515502243 511670494 508624725 506256676
775 506256676 504242516 502242241 500081520 497844315 495848236 494526100 494272346 495319633 497691498
784 497691498 501239510 505742798 511016884 516984863 523673325 531137619 539349976 548108406 557020111
793 557020111 565579224 573316956 579960976 585533142 590333672 594820366 599432907 604444427 609904938
802 609904938 615694008 621643028 627652626 633740540 639994812 646464462 653060150 659523087 665491257
811 665491257 670627136 674736099 677807541 679954681 681286774 681791382 681306076 679611053 676616592
820 676616592 672551193 668053894 664105072 661799622 662046356 665301361 671443176 679832382 689519882
$$ packed form
757E07055740n770225j791115J501122L793945N087623N551606N361290M612465L345718
766E28748169J638641l11737k185287l626175m375992m385376l831749l045769k368049
775E06256676k014160k000275k160721k237205j996079j322136k53754J047287K371865
784D97691498L548012M503288N274086N967979O688462P464294Q212357Q758430Q911705
793E57020111Q559113P737732O644020N572166M800530M486694M612541N011520N460511
802F09904938N789070N949020O009598O087914O254272O469650O595688O462937N968170
811F65491257N135879M108963L071442K147140J332093N04608m85306j695023k994461
820F76616592m065399m497299l948822k305450K46734L255005O141815Q389206R687500
$$ plain form
829 689519882 699520111 709041214 717596436 724985123 731185455 736232224 740148849 742953796 744719620
838 744719620 745629807 745982742 746124420 746340637 746763763 747351227 747954330 748448868 748859329 749404755
848 749404755 750434189 752272186 755045013 758579407 762427673 766021652 768884354 770809021 771915207
857 771915207 772561798 773156891 773958817 774961395 775916519 776476288 776380234 775590363 774307709 772862396
867 772862396 771534348 770394897 769249344 767715073 765397415 762088776 757898636 753259354 748808212
876 748808212 745198975 742924194 742216263 743055038 745254211 748572464 752783508 757681198 763028717
885 763028717 768504105 773694839 778166962 781591263 783866119 785170746 785905685 786536255 787402878
894 787402878 788586273 789894485 790981216 791539307 791472549 790959930 790374527 790098114 790322189 790940399
$$ packed form
829F89519882J0000229R521103Q555222P388687O200332N046769L916625K804947J765824
838G44719620R10187L52935J41678K16217M23126N87464O03103M94538M10461N45426
848G49404755J029434J837997K772827L534394L848266L593979K862702J924667J106186
857G71915207O46591N95093Q01926J002578R55124N59769r6054p89871j282654j445313
867G72862396j328048j139451j145553j534271k317658l308639m190140m639282m451142
876G48808212l609237k274781p07931Q38775K199173L318253M211044M897690N347519
885G63028717N475388N190734M472123L424301K274856J304627P34939O30570Q66623
894G87402878J183395J308212J086731N58091o6758n12619n85403k76413K24075O18210
$$ plain form
904 790940399 791590576 791827469 791344070 790128937 788479004 786859283 785679550 785099335 784958649
913 784958649 784874039 784446411 783481827 782110596 780743790 779889297 779915314 780880051 782507401 784321136
923 784321136 785864792 786897430 787469940 787846527 788322906 789037094 789880447 790549316 790715408 790214157
933 790214157 789151611 787865829 786760406 786096573 785852814 785730896 785304871 784237671 782455063
942 782455063 780181198 777821503 775752640 774125519 772787399 771361389 769442673 766815796 763584061
951 763584061 760151062 757067184 754817123 753650055 753526077 754190445 755326843 756706924 758258820
960 758258820 760032806 762092361 764400330 766772156 768926086 770609665 771733475 772436752 773039093
969 773039093 773891983 775198746 776894608 778652115 780021591 780640640 780408325 779537277 778444901
$$ packed form
904G90940399O50177K36893m83399j215133j649933j619721j179733n80215j40686
913G84958649q4610m27628r64584j371231j366806q54493K6017R64737J627350J813735
923G84321136J543656J032638N72510L76587M76379P14188Q43353O68869J66092n01251
933G90214157j062546j285782j105423o63833k43759j21918m26025j067200j782608
942G82455063k273865k359695k068863j627121j338120j426010j918716k626877l231735
951G63584061l432999l083878k250061j167068j23978O64368J136398J380081J551896
960G58258820J773986K059555K307969K371826K153930J683579J123810P03277O02341
969G73039093Q52890J306763J695862J757507J369476O19049k32315q71048j092376
$$ plain form
978 778444901 777537613 776995163 776669006 776155014 775009079 773001633 770278854 767344055 764858856
987 764858856 763359680 763025589 763606415 764546814 765233307 765244064 764478760 763117905 761453476 759690628
997 759690628 757836685 755734100 753208466 750244064 747075348 744134369 741872940 740548248 740081635
1006 740081635 740072556 739962387 739272385 737799454 735672302 733245163 730883255 728750992 726708450
1015 726708450 724363632 721252213 717046890 711692276 705403976 698544235 691457672 684368515 677405090
1024 677405090 670740356 664761200 660150909 657799454 658545151 662841263 670494690 680611267 691794586
1033 691794586 702534714 711636658 718518219 723265305 726441116 728752441 730728455 732550125
1041 732550125 734084320 735072861 735359573 735030975 734401550 733860397 733671417 733835678 734090347 734043198
$$ packed form
978G78444901r07288n42450l26157n13992j145935k007446k722779k934799k485199
987G64858856j499176l34091N80826R40399O86493J0757p65304j360855j664429j762848
997G59690628j853943k102585k525634k964402l168716k940979k261429j324692m66613
1006G40081635r079j10169o90002j472931k127152k427139k361908k132263k042542
1015G26708450k344818l111419m205323n354614o288300o859741p086563p089157o963425
1024F77405090o664734n979156m610291k351455P45697M296112P653427J0116577J1183319
1033F91794586J0740128R101944O881561M747086L175811K311325J976014J821670
1041G32550125J534195R88541K86712l28598o29425n41153j88980J64261K54669m7149
$$ plain form
1051 734043198 733369064 731966705 729994812 727774582 725609360 723621597 721685410 719490356 716695709
1060 716695709 713094559 708700104 703712311 698384094 692860947 687074127 680743408 673481979 664946365
1069 664946365 654953690 643506393 630718079 616684608 601371536 584581680 566021996 545439987
1077 545439987 522767868 498211060 472246056 445539780 418832016 392833710 368177681 345420418
1085 345420418 325070534 307602596 293427296 282817535 275817013 272176952 271364460 272665710
1093 272665710 275368366 278980618 283412189 289051266 296688557 307291832 321684685 340227509
1101 340227509 362608795 387830925 414405632 440705833 465357170 487535057 507073174 524353828
1109 524353828 540040474 554759407 568853340 582282524 594689941 605579185 614526062 621347466
$$ packed form
1051G34043198o74134j402359j971893k220230k165222j987763j936187k195054k794647
1060G16695709l601150m394455m987793n328217n523147n786820o330719p261429q535614
1069F64946365r992675j1447297j2788314j4033471j5313072j6789856j8559684k0582009
1077E45439987k2672119k4556808k5965004k6706276k6707764k5998306k4656029k2757263
1085C45420418k0349884j7467938j4175300j0609761p000522l640061q12492J301250
1093B72665710K702656L612252M431571N639077P637291J0603275J4392853J8542824
1101C40227509K2381286K5222130K6574707K6300201K4651337K2177887J9538117J7280654
1109E24353828J5686646J4718933J4093933J3429184J2407417J0889244Q946877O821404
$$ plain form
1117 621347466 626183281 629487190 631946907 634362030 637505798 641986160 648127594 655896912 664900742
1126 664900742 674471893 683831100 692281189 699369431 704959564 709186020 712317047 714588928 716087646
1135 716087646 716730881 716352310 714842987 712274551 708945770 705326309 701929092 699170532 697282486
1144 697282486 696307526 696163254 696733246 697928848 699691772 701948471 704551773 707256622 709755707
1153 709755707 711762085 713101578 713764572 713891754 713696671 713364563 712970810 712455673 711660538 710404053
1163 710404053 708566360 706147766 703288116 700240784 697310257 694762039 692723618 691102676 689557495
1172 689557495 687553864 684517288 680049820 674140167 667277451 660399780 654669266 651140671 650438995
1181 650438995 652572327 656947556 662577591 668392868 673531723 677511749 680242004 681904221 682781830
$$ packed form
1117F21347466M835815L303909K459717K415123L143768M480362O141434P769318R003830
1126F64900742R571151R359207Q450089P088242N590133M226456L131027K271881J498718
1135G16087646O43235l78571j509323k568436l328781l619461l397217k758560j888046
1144F97282486r74960j44272N69992J195602J762924K256699K603302K704849K499085
1153G09755707K006378J339493O62994J27182j95083l32108l93753n15137p95135j256485
1163G10404053j837693k418594k859650l047332k930527k548218k038421j620942j545181
1172F89557495k003631l036576m467468n909653o862716o877671n730514l528595p01676
1181F50438995K133332M375229N630035N815277N138855L980026K730255J662217Q77609
$$ plain form
1190 682781830 683109589 682991486 682394409 681188049 679203262 676284256 672323608 667280731 661179886
1199 661179886 654085922 646058884 637100182 627108612 615872345 603096542 588460579 571673508
1207 571673508 552506371 530794601 506430893 479376793 449720192 417767410 384139061 349816170
1215 349816170 316093178 284429760 256233215 232629509 214292603 201377182 193567219 190221100
1223 190221100 190562992 193872395 199623127 207546062 217613430 229958973 244767361 262167645
1231 262167645 282155952 304559937 329039383 355107002 382158966 409511185 436448288 462293358
1239 462293358 486493301 508702240 528830872 547038078 563657570 579082108 593642387 607523918
1247 607523918 620741577 633173103 644626083 654907227 663875198 671461945 677666473 682525024
$$ packed form
1190F82781830L27759j18103n97077j206360j984787k919006l960648n042877o100845
1199F61179886p093964q027038q958702r991570j1236267j2775803j4635963j6787071
1207E71673508j9167137k1711770k4363708k7054100k9656601l1952782l3628349l4322891
1215C49816170l3722992l1663418k8196545k3603706j8336906j2915421p809963l346119
1223A90221100L41892L309403N750732P922935J0067368J2345543J4808388J7400284
1231B62167645J9988307K2403985K4479446K6067619K7051964K7352219K6937103K5845070
1239D62293358K4199943K2208939K0128632J8207206J6619492J5424538J4560279J3881531
1247F07523918J3217659J2431526J1452980J0281144Q967971P586747O204528M858551
$$ plain form
1255 682525024 686065140 688249893 688932648 687842407 684622040 678925629 670551605 659570999 646401291
1264 646401291 631792526 616733971 602309151 589553871 579343719 572321396 568841591 568913536
1272 568913536 572143936 577706528 584384918 590712547 595194473 596552200 593911400 586876831 575492401
1281 575492401 560137024 541432610 520218277 497590981 474950600 453970375 436435165 423959122
1289 423959122 417659149 417898674 424199181 435352173 449694710 465457001 481077423 495412025
1297 495412025 507809372 518063431 526281052 532701378 537508583 540672417 541864471 540489273
1305 540489273 535852661 527448540 515288277 500166130 483743248 468381271 456734200 451189117
1313 451189117 453313026 463469658 480722694 503059540 527868271 552525902 574928970 593825226
$$ packed form
1255F82525024L540116K184753O82755j090241l220367n696411q374024j0980606j3169708
1264F46401291j4608765j5058555j4424820j2755280j0210152p022323l479805P1945
1272E68913536L230400N562592O678390O327629M481926J357727k640800p034569j1384430
1281E75492401j5355377j8704414k1214333k2627296k2640381k0980225j7535210j2476043
1289D23959122o299973K39525O300507J1152992J4342537J5762291J5620422J4334602
1297D95412025J2397347J0254059Q217621O420326M807205L163834J192054j375198
1305E40489273m636612q404121j2160263j5122147j6422882j5361977j1647071n545083
1313D51189117K123909J0156632J7253036K2336846K4808731K4657631K2403068J8896256
$$ plain form
1321 593825226 608877563 620479927 629425850 636560326 642531815 647698746 652171631 655913773
1329 655913773 658816681 660704269 661285095 660126190 656730194 650748825 642276764 632101822 621760101
1338 621760101 613307877 608835907 609875984 616919441 629239616 645098038 662257385 678606415
1346 678606415 692661209 703778305 712050934 717986984 722150803 724921799 726440430 726703262
1354 726703262 725689545 723420715 719906158 715026169 708455048 699720078 688417130 674518051
1362 674518051 658624191 642034302 626549835 614061127 606045914 603161354 605070801 610562134
1370 610562134 617898865 625269890 631184235 634700661 635461922 633580399 629464226 623664894 616787567
1379 616787567 609454231 602281723 595837440 590567055 586721306 584323082 583205872 583116417 583837738
$$ packed form
1321E93825226J5052337J1602364Q945923P134476N971489N166931M472885L742142
1329F55913773K902908J887588N80826j158905l395996n981369q472061j0174942j0341721
1338F21760101q452224m471970J040077P043457J2320175J5858422J7159347J6349030
1346F78606415J4054794J1117096Q272629N936050M163819K770996J518631K62832
1354G26703262j013717k268830l514557m879989o571121q734970j1302948j3899079
1362F74518051j5893860j6589889j5484467j2488708q015213k884560J909447N491333
1370F10562134P336731P371025N914345L516426P61261j881523m116173n799332o877327
1379F16787567p333336p172508o444283n270385l845749k398224j117210q9455P21321
$$ plain form
1388 583837738 585276527 587467499 590495491 594373665 598941040 603836823 608565178 612624397 615640907
1397 615640907 617447777 618081207 617702789 616492424 614563942 611935120 608556862 604375038 599389572
1406 599389572 593681641 587400589 580721970 573798714 566728020 559546738 552257538 544875221 537480278
1415 537480278 530259247 523516159 517644806 513064957 510137177 509085808 509953194 512606506 516785812
1424 516785812 522172775 528449745 535325432 542528877 549788742 556824112 563361397 569170685 574101830
1433 574101830 578094444 581154633 583313408 584592896 585004044 584575119 583385277 581568413 579269562
1442 579269562 576565018 573391495 569534912 564707336 558689194 551477165 543361549 534886208 526696968
1451 526696968 519340935 513102722 507947044 503584595 499626160 495747871 491802673 487841072 484055634
$$ packed form
1388E83837738J438789K190972L027992L878174M567375M895783M728355M059219L016510
1397F15640907J806870O33430l78418j210365j928482k628822l378258m181824m985466
1406E99389572n707931o281052o678619o923256p070694p181282p289200p382317p394943
1415E37480278p221031o743088n871353m579849k927780j051369Q67386K653312M179306
1424E16785812N386963O276970O875687P203445P259865P035370O537285N809288M931145
1433E74101830L992614L060189K158775J279488M11148m28925j189842j816864k298851
1442E79269562k704544l173523l856583m827576o018142p212029q115616q475341q189240
1451E26696968p356033o238213n155678m362449l958435l878289l945198l961601l785438
$$ plain form
1460 484055634 480692177 477974968 476076241 475121574 475212593 476434326 478836403 482395897 486981010
1469 486981010 492340851 498133163 503982620 509552574 514605942 519032593 522841339 526119537 528983192
1478 528983192 531539764 533877754 536085167 538280106 540625458 543310928 546495934 550238380 554449463
1487 554449463 558910675 563364716 567656746 571864967 576357269 581730843 588641014 597576027 608661499
1496 608661499 621571960 635585098 649757996 663158798 675071945 685110092 693216629 699575500
1504 699575500 704488220 708267365 711184235 713470383 715347061 717046585 718801270 720794983 723101654
1513 723101654 725643082 728195953 730458069 732154083 733138275 733455048 733324432 733060074 732952194
1522 732952194 733166275 733701248 734423676 735157013 735781708 736299057 736826859 737535553 738556976 739912643
$$ packed form
1460D84055634l363457k717209j898727r54667R1019J221733K402077L559494M585113
1469D86981010N359841N792312N849457N569954N053368M426651L808746L278198K863655
1478E28983192K556572K337990K207413K194939K345352K685470L185006L742446M211083
1487E54449463M461212M454041M292030M208221M492302N373574O910171Q935013J1085472
1496F08661499J2910461J4013138J4172898J3400802J1913147J0038147Q106537O358871
1504F99575500M912720L779145K916870K286148J876678J699524J754685J993713K306671
1513G23101654K541428K552871K262116J696014R84192L16773j30616k64358j07880
1522G32952194K14081N34973P22428P33337O24695N17349N27802P08694J021423J355667
$$ plain form
1532 739912643 741493073 743095474 744493484 745506821 746035538 746059875 745611877 744750748 743557739
1541 743557739 742147980 740683823 739365845 738395309 737918549 737983627 738533707 739442139 740571060
1550 740571060 741816635 743111115 744380112 745486908 746208801 746278152 745488205 743813705 741481781
1559 741481781 738941727 736729126 735275955 734750824 735002594 735635452 736177979 736268005 735773087 734796982
1569 734796982 733589096 732403488 731378708 730482635 729532318 728269043 726450348 723934021 720732346
1578 720732346 717029877 713159180 709531479 706533203 704414368 703211136 702736282 702648315 702565765
1587 702565765 702171097 701247253 699635620 697153702 693552780 688574677 682118301 674437485 666255341
1596 666255341 658690262 652974930 650059204 650258408 653110733 657518387 662119675 665733566 667693329
$$ packed form
1532G39912643J580430J602401J398010J013337N28717K4337m47998q61129j193009
1541G43557739j409759j464157j317978r70536m76760O5078N50080R08432J128921
1550G40571060J245575J294480J268997J106796P21893O9351p89947j674500k331924
1559G41481781k540054k212601j453171n25131K51770O32858N42527R0026m94918r76105
1569G34796982j207886j185608j024780q96073r50317j263275j818695k516327l201675
1578G20732346l702469l870697l627701k998276k118835j203232m74854q7967q2550
1587G02565765l94668r23844j611633k481918l600922m978103o456376p680816q182144
1596F66255341p565079n715332k915726J99204K852325M407654M601288L613891J959763
$$ plain form
1605 667693329 667938004 666859512 665001602 662772980 660296249 657436218 653956451 649696732 644677124
1614 644677124 639087372 633186874 627180748 621141396 615000381 608604317 601790237 594443855 586518478
1623 586518478 578020935 568981323 559423790 549344177 538693771 527362595 515170975 501875458
1631 501875458 487208672 470947380 452999916 433478775 412728806 391289406 369794846 348844795
1639 348844795 328886642 310156631 292702866 276485558 261523018 248033524 236521645 227775879
1647 227775879 222769642 222484035 227696400 238785801 255605907 277459049 303179359 331305656
1655 331305656 360300064 388755417 415544281 439880295 461299133 479588432 494713554 506768150
1663 506768150 515959625 522609444 527138329 530013657 531667976 532417870 532425919 531728973 530322418
$$ packed form
1605F67693329K44675j078492j857910k228622k476731k860031l479767m259719n019608
1614F44677124n589752n900498o006126o039352o141015o396064o814080p346382p925377
1623E86518478q497543r039612r557533j0079613j0650406j1331176j2191620j3295517
1631E01875458j4666786j6261292j7947464j9521141k0749969k1439400k1494560k0950051
1639C48844795j9958153j8730011j7453765j6217308j4962540j3489494j1511879q745766
1647B27775879n006237k85607N212365J1089401J6820106K1853142K5720310K8126297
1655C31305656K8994408K8455353K6788864K4336014K1418838J8289299J5125122J2054596
1663E06768150R191475O649819M528885K875328J654319P49894Q049o96946j406555
$$ plain form
1672 530322418 528258057 525699768 522899361 520100212 517412186 514721909 511689835 507839088 502698174
1681 502698174 495936584 487429543 477229271 465458870 452178116 437281151 420471916 401333466
1689 401333466 379480400 354751968 327393837 298165474 268325863 239476910 213283539 191144314
1697 191144314 173911858 161765079 154287233 150730734 150369625 152804222 158088522 166632462
1705 166632462 178912926 195114155 214837875 236990166 259878139 281469460 299720840 312880135
1713 312880135 319702892 319566154 312502460 299174118 280804291 259059467 235878277 213260098
1721 213260098 193041725 176712208 165306759 159395933 159154243 164468422 175036697 190427704
1729 190427704 210095387 233367157 259437370 287392216 316272774 345166397 373298645 400101357
$$ packed form
1672E30322418k064361k558289k800407k799149k688026k690277l032074l850747n140914
1681E02698174o761590q507041j0200272j1770401j3280754j4896965j6809235j9138450
1689D01333466k1853066k4728432k7358131k9228363k9839611k8848953k6193371k2139225
1697A91144314j7232456j2146779p477846l556499l61109K434597N284300Q543940
1705A66632462J2280464J6201229J9723720K2152291K2887973K1591321J8251380J3159295
1713C12880135O822757j36738p063694j3328342j8369827k1744824k3181190k2618179
1721B13260098k0218373j6329517j1405449n910826k41690N314179J0568275J5391007
1729A90427704J9667683K3271770K6070213K7954846K8880558K8893623K8132248K6802712
$$ plain form
1737 400101357 425236435 448573532 470134468 490023575 508366508 525272408 540820580 555067863
1745 555067863 568067169 579883118 590606461 600361671 609312325 617658119 625620613 633413162
1753 633413162 641194229 649022598 656830597 664440689 671625061 678197479 684097290 689426117 694415436
1762 694415436 699329529 704347229 709473495 714526825 719213562 723253784 726505737 729027863 731054306
1771 731054306 732894974 734811172 736924210 739192810 741464996 743567352 745389481 746924057 748252945
1780 748252945 749498672 750767593 752116318 753545761 755018997 756483078 757883530 759169922 760296402
1789 760296402 761229019 761956863 762503586 762928314 763309021 763714676 764175949 764673157 765145721 765521393
1799 765521393 765753174 765847092 765868607 765925446 766133881 766579132 767283173 768193512 769194946 770144272
$$ packed form
1737D00101357K5135078K3337097K1560936J9889107J8342933J6905900J5548172J4247283
1745E55067863J2999306J1815949J0723343R755210Q950654Q345794P962494P792549
1753F33413162P781067P828369P807999P610092P184372O572418N899811N328827M989319
1762F94415436M914093N017700N126266N053330M686737M040222L251953K522126K026443
1771G31054306J840668J916198K113038K268600K272186K102356J822129J534576J328888
1780G48252945J245727J268921J348725J429443J473236J464081J400452J286392J126480
1789G60296402R32617P27844N46723M24728L80707M05655M61273M97208M72564L75672
1799G65521393K31781R3918K1515N6839K08435M45251P04041R10339J001434R49326
$$ plain form
1809 770144272 770920105 771467514 771823425 772105103 772466049 773031998 773846741 774852295 775917892 776903152
1819 776903152 777724762 778394318 779000778 779653397 780408859 781228333 781988907 782543335 782800827 782781143
1829 782781143 782616196 782496567 782589111 782973709 783620987 784425354 785262985 786046524 786744690 787364578
1839 787364578 787914581 788373566 788689499 788804245 788695602 788404007 788032608 787717819 787580719 787684708
1849 787684708 788014145 788480759 788957825 789322739 789500122 789488602 789361877 789244385 789267654 789519272
1859 789519272 790006409 790647430 791299744 791810760 792074738 792066727 791839218 791485748 791090317 790690918
1869 790690918 790274887 789806976 789270859 788694763 788147659 787703018 787394409 787189255 787002029 786739120
1879 786739120 786355362 785886841 785440063 785138550 785055847 785167923 785354462 785451736 785331497 784967194
$$ packed form
1809G70144272P75833N47409L55911K81678L60946N65949Q14743J005554J065597R85260
1819G76903152Q21610O69556O06460O52619P55462Q19474P60574N54428K57492j9684
1829G82781143j64947j19629R2544L84598O47278Q04367Q37631P83539O98166O19888
1839G87364578N50003M58985L15933J14746j08643k91595l71399l14789j37100J03989
1849G87684708L29437M66614M77066L64914J77383j1520j26725j17492K3269K51618
1859G89519272M87137O41021O52314N11016K63978q011k27509l53470l95431l99399
1869G90690918m16031m67911n36117n76096n47104m44641l08609k05154j87226k62909
1879G86739120l83758m68521m46778l01513q2703J12076J86539R7274j20239l64303
$$ plain form
1889 784967194 784452362 783961105 783667450 783662186 783907700 784255295 784514618 784544907 784322510 783952332
1899 783952332 783615723 783481369 783620529 783970108 784362717 784610062 784599915 784358215 784044342 783878326
1909 783878326 784035263 784558792 785334396 786140518 786749268 787030182 787004547 786823654 786685104 786728668
1919 786728668 786968384 787292480 787531509 787555771 787349091 787020493 786746140 786672668 786835632 787136612
1929 787136612 787392807 787433319 787192917 786750717 786293869 786023254 786048279 786327057 786681747 786883926
1939 786883926 786765900 786302795 785622253 784939423 784446793 784218063 784174042 784125214 783873825 783318481
1949 783318481 782512665 781644516 780949860 780602951 780638351 780943222 781323395 781604919 781721649 781742020
1959 781742020 781821289 782108994 782655792 783372879 784065857 784523163 784619064 784374542 783946762 783553009
$$ packed form
1889G84967194n14832m91257k93655n264K45514L47595K59323L0289k22397l70178
1899G83952332l36609j34354J39160L49579L92609K47345j0147k41700l13873j66016
1909G83878326J56937N23529P75604Q06122O08750K80914k5635j80893j38550M3564
1919G86728668K39716L24096K39029K4262k06680l28598k74353p3472J62964L00980
1929G87136612K56195M0512k40402m42200m56848k70615K5025K78778L54690K02179
1939G86883926j18026m63105o80542o82830m92630k28730m4021m8828k51389n55344
1949G83318481q05816q68149o94656l46909L5400L04871L80173K81524J16730K0371
1959G81742020P9269K87705N46798P17087O92978M57306R5901k44522m27780l93753
$$ plain form
1969 783553009 783367081 783439941 783686142 783938980 784046249 783956375 783748703 783594971 783670883 784064026
1979 784064026 784725571 785491028 786156693 786578522 786737061 786738968 786756897 786935272 787313843 787807159
1989 787807159 788250656 788488922 788461075 788238373 787993164 787913666 788109665 788553925 789093399 789522858
1999 789522858 789686432 789553986 789235916 788925476 788800583 788933868 789256134 789593964 789759140 789647293
2009 789647293 789291687 788846893 788509903 788418350 788579483 788866806 789084549 789069214 788774338 788295441
2019 788295441 787824020 787549973 787566605 787824097 788154907 788360596 788313675 788022385 787627487 787330856
2029 787330856 787291336 787543869 787979507 788398819 788611984 788531876 788217850 787842941 787605743 787629089
2039 787629089 787897110 788265839 788537140 788561554 788316574 787917480 787560196 787418976 787557144 787891846
$$ packed form
1969G83553009j85928P2860K46201K52838J07269q9874k07672j53732P5912L93143
1979G84064026O61545P65457O65665M21829J58539J907J7929J78375L78571M93316
1989G87807159M43497K38266k7847k22702k45209p9498J95999M44260N39474M29459
1999G89522858J63574j32446l18070l10440j24893J33285L22266L37830J65176j11847
2009G89647293l55606m44794l36990r1553J61133K87323K17743j5335k94876m78897
2019G88295441m71421k74047J6632K57492L30810K05689m6921k91290l94898k96631
2029G87330856l9520K52533M35638M19312K13165q0108l14026l74909k37198K3346
2039G87629089K68021L68729K71301K4414k44980l99094l57284j41220J38168L34702
$$ plain form
2049 787891846 788235245 788388214 788241119 787829208 787315445 786906967 786750336 786857147 787098846 787272568
2059 787272568 787205811 786844940 786283875 785716400 785339050 785250549 785404053 785632401 785735550 785584869
2069 785584869 785189667 784693756 784300537 784169006 784330826 784674683 785002975 785134735 784998856 784671326
2079 784671326 784336929 784193268 784348373 784763947 785271301 785655899 785763931 785578690 785226746 784912186
2089 784912186 784813080 784990082 785358200 785731735 785921631 785833054 785515060 785135651 784895859 784926758
2099 784926758 785221786 785640259 785978851 786074982 785889893 785528259 785182877 785036926 785168686 785511856
2109 785511856 785889893 786107254 786049805 785744781 785347519 785062027 785038223 785294647 785708771 786079483
2119 786079483 786227798 786087189 785735397 785353775 785133667 785180740 785460739 785818863 786060486 786049347
$$ packed form
2049G87891846L43399J52969j47095m11911n13763m08478j56631J06811K41699J73722
2059G87272568o6757l60871n61065n67475l77350q8501J53504K28348J03149j50681
2069G85584869l95202m95911l93219j31531J61820L43857L28292J31760j35879l27530
2079G84671326l34397j43661J55105M15574N07354L84598J08032j85241l51944l14560
2089G84912186r9106J77002L68118L73535J89896q8577l17994l79409k39792L0899
2099G84926758K95028M18473L38592R6131j85089l61634l45382j45951J31760L43170
2109G85511856L78037K17361n7449l05024l97262k85492k3804K56424M14124L70712
2119G86079483J48315j40609l51792l81622k20108M7073K79999L58124K41623j1139
$$ plain form
2129 786049347 785778275 785371628 785022125 784892654 785034027 785359573 785690155 785846481 785740662 785421906
2139 785421906 785052261 784825134 784867249 785175705 785619049 786005325 786177673 786092834 785840988 785596008
2149 785596008 785524750 785699310 786059189 786442261 786666718 786626816 786346130 785967407 785680695 785626526
2159 785626526 785825424 786166611 786464844 786554413 786371918 785988770 785573807 785307770 785291214 785496368
2169 785496368 785781250 785965271 785921021 785640182 785237122 784889145 784745636 784852142 785126038 785400314
2179 785400314 785508728 785371933 785037537 784656982 784408493 784407730 784649582 785012589 785319824 785428696
2189 785428696 785302124 785023727 784754333 784647980 784772339 785075607 785411072 785613098 785580521 785327606
2199 785327606 784975891 784692154 784603653 784732971 784987030 785205002 785240021 785034943 784651794 784241104
$$ packed form
2129G86049347k71072m06647l49503j29471J41373L25546L30582J56326j05819l18756
2139G85421906l69645k27127M2115L08456M43344L86276J72348q4839k51846k44980
2149G85596008p1258J74560L59879L83072K24457l9902k80686l78723k86712n4169
2159G85626526J98898L41187K98233Q9569j82495l83148m14963k66037j6556K05154
2169G85496368K84882J84021m4250k80839m03060l47977j43509J06506K73896K74276
2179G85400314J08414j36795l34396l80555k48489p63K41852L63007L07235J08872
2189G85428696j26572k78397k69394j06353J24359L03268L35465K02026l2577k52915
2199G85327606l51715k83737q8501J29318K54059K17972L5019k05078l83149m10690
$$ plain form
2209 784241104 783966141 783920898 784082718 784325790 784485321 784442139 784182205 783803864 783465576 783304596
2219 783304596 783366318 783580627 783797302 783860931 783688812 783310852 782853241 782473373 782281647 782287064 782396698
2230 782396698 782465286 782372589 782085724 781678314 781293564 781073074 781084442 781286621 781548615 781713715
2240 781713715 781676178 781433487 781086502 780787964 780667114 780764389 781012726 781272049 781399765 781322708
2250 781322708 781072006 780765762 780548019 780514145 780663452 780899353 781077499 781079636 780871277 780518875
2260 780518875 780155182 779912872 779859161 779964523 780120697 780197372 780111084 779868698 779564819 779333649
2270 779333649 779281769 779431000 779705963 779970474 780094757 780022812 779801788 779560776 779445953 779546890
2280 779546890 779847641 780231857 780536041 780627518 780466309 780121078 779732513 779441833 779321594 779343719
$$ packed form
2209G84241104k74963m5243J61820K43072J59531m3182k59934l78341l38288j60980
2219G83304596O1722K14309K16675O3629j72119l77960m57611l79868j91726N417J09634
2230G82396698O8588r2697k86865m07410l84750k20490J1368K02179K61994J65100
2240G81713715l7537k42691l46985k98538j20850R7275K48337K59323J27716p7057
2250G81322708k50702l06244k17743l3874J49307K35901J78146K137k08359l52402
2260G80518875l63693k42310n3711J05362J56174P6675q6288k42386l03879k31170
2270G79333649n1880J49231K74963K64511J24283p1945k21024k41012j14823J00937
2280G79546890L00751L84216L04184R1477j61209l45231l88565k90680j20239K2125
$$ plain form
2290 779343719 779399033 779356461 779131775 778730850 778245621 777807922 777523499 777421570 777441559 777466583 777380600
2301 777380600 777125778 776726837 776273880 775870285 775576248 775373459 775174942 774875793 774416885 773827591
2311 773827591 773222122 772743301 772480469 772406387 772369080 772150650 771570892 770581284 769302292 767976761
2321 767976761 766862183 766109467 765695877 765441513 765103073 764494476 763573380 762450638 761326218
2330 761326218 760389709 759735870 759338455 759076843 758792114 758336945 757598801 756506805 755044861 753286896
2340 753286896 751442184 749875259 749059677 749451828 751319656 754592285 758808899 763204880 766915283
2349 766915283 769222794 769753799 768551636 766010818 762710876 759226303 755982132 753193359 750888214
2358 750888214 748978424 747339935 745876770 744551620 743391418 742469711 741875610 741676483 741884842
$$ packed form
2290G79343719N5314m2572k24686m00925m85229m37699k84423j01929J9989K5024q5983
2301G77380600k54822l98941m52957m03595k94037k02789j98517k99149m58908n89294
2311G73827591o05469m78821k62832p4082l7307k18430n79758r89608j278992j325531
2321G67976761j114578p52716m13590k54364l38440o08597r21096j122742j124420
2330G61326218r36509o53839l97415k61612k84729m55169p38144j091996j461944j757965
2340G53286896j844712j566925q15582L92151J867828L272629M216614M395981L710403
2349G66915283K307511N31005j202163k540818l299942l484573l244171k788773k305145
2358G50888214j909790j638489j463165j325150j160202r21707n94101j99127K08359
$$ plain form
2367 741884842 742445526 743248978 744174118 745139542 746140442 747249985 748578491 750211716 752155533
2376 752155533 754320145 756550980 758689270 760634613 762372284 763956680 765458298 766908646 768269424
2385 768269424 769448776 770347977 770919724 771201248 771306992 771383133 771545258 771831436 772191925 772520523
2395 772520523 772711487 772714233 772559662 772345810 772190781 772174301 772300339 772494659 772643204 772650223 772487030
2406 772487030 772208862 771927795 771758041 771757584 771899567 772085876 772196808 772154007 771960068 771698074 771489639
2417 771489639 771432114 771548233 771774597 771992416 772087860 772008514 771788330 771528168 771342621 771299820 771386032
2428 771386032 771511612 771556702 771432953 771128922 770719986 770330429 770074539 770000687 770068741 770172501
2438 770172501 770195007 770069656 769814911 769525604 769323959 769296799 769449310 769700623 769924164 770011673
$$ packed form
2367G41884842N60684Q03452R25140R65424J000900J109543J328506J633225J943817
2376G52155533K164612K230835K138290J945343J737671J584396J501618J450348J360778
2385G68269424J179352Q99201N71747K81524J05744P6141J62125K86178L60489L28598
2395G72520523J90964K746j54571k13852j55029j6480J26038J94320J48545P019j63193
2406G72487030k78168k81067j69754m57J41983J86309J10932m2801j93939k61994k08435
2417G71489639n7525J16119K26364K17819R5444p9346k20184k60162j85547m2801Q6212
2428G71386032J25580M5090j23749l04031m08936l89557k55890p3852O8054J03760
2438G70172501K2506j25351k54745k89307k01645k7160J52511K51313K23541Q7509
$$ plain form
2448 770011673 769927063 769726181 769527130 769449310 769552002 769802856 770093384 770292587 770312958 770153275
2458 770153275 769898453 769675293 769587555 769664230 769844971 770012207 770050507 769906464 769615097 769281311
2468 769281311 769026413 768925781 768970032 769070435 769104309 768978729 768679276 768278198 767898788 767652740
2478 767652740 767584534 767647858 767730942 767713470 767528915 767198410 766819763 766516953 766376648 766403275 766516800
2489 766516800 766594696 766533737 766303787 765962143 765623932 765403214 765354385 765443878 765567017 765600586 765464554
2500 765464554 765162735 764779434 764438248 764239197 764209442 764290848 764369888 764336700 764139862 763813324 763458252
2511 763458252 763191910 763087540 763137970 763259811 763336563 763279266 763071442 762778091 762510452 762369156
2521 762369156 762390518 762527924 762675781 762723160 762612915 762371368 762096329 761907730 761886902 762034225
$$ packed form
2448G70011673q4610k00882j99051p7820J02692K50854K90528J99203K0371j59683
2458G70153275k54822k23160q7738P6675J80741J67236L8300j44043k91367l33786
2468G69281311k54898j00632M4251J00403L3874j25580k99453m01078l79410k46048
2478G67652740o8206O3324Q3084j7472j84555l30505l78647l02810j40305K6627J13525
2489G66516800P7896o0959k29950l41644l38211k20718m8829Q9493J23139L3569j36032
2500G65464554l01819l83301l41186j99051k9755Q1406P9040l3188j96838l26538l55072
2511G63458252k66342j04370N0430J21841P6752n7297k07824k93351k67639j41296
2521G62369156K1362J37406J47857M7379j10245k41547k75039j88599k0828J47323
$$ plain form
2531 762034225 762269363 762471085 762538376 762441177 762234802 762031403 761941376 762017288 762225952 762465973 762618713
2542 762618713 762609100 762443695 762207031 762019043 761972885 762088928 762304306 762505569 762587891 762507477 762303467
2553 762303467 762075653 761931763 761930847 762051926 762205048 762278519 762197189 761961899 761651230 761380768 761245270
2564 761245270 761270294 761399460 761522751 761532516 761377640 761089478 760764618 760515976 760414963 760455093 760554581
2575 760554581 760598679 760495300 760223312 759841385 759458923 759181061 759056702 759055557 759086075 759044418 758867874
2586 758867874 758567886 758222504 757934799 757778320 757756882 757802277 757808228 757684784 757405624 757020569 756630402
2597 756630402 756336060 756186905 756156616 756159058 756092682 755894775 755572891 755201187 754881821 754692307 754646683
2608 754646683 754687881 754718628 754650803 754450073 754153595 753850098 753634644 753560715 753612213 753712769 753763504
$$ packed form
2531G62034225K35138K01722O7291r7199k06375k03399r0027P5912K08664K40021J52740
2542G62618713r613j65405k36664j87988m6158J16043K15378K01263Q2322q0414k04010
2553G62303467k27814j43890r16J21079J53122P3471q1330k35290l10669k70462j35498
2564G61245270K5024J29166J23291R765j54876k88162l24860k48642j01013M0130R9488
2575G60554581M4098j03379k71988l81927l82462k77862j24359j145L0518m1657j76544
2586G58867874k99988l45382k87705j56479k1438M5395N951j23444k79160l85055l90167
2597G56630402k94342j49155l0289K442o6376j97907l21884l71704l19366j89514m5624
2608G54646683M1198L0747o7825k00730k96478l03497k15454p3929N1498J00556N0735
$$ plain form
2619 753763504 753692780 753491135 753214569 752955551 752795792 752764664 752826080 752897034 752890930 752761154 752523880
2630 752523880 752249603 752024307 751906738 751897354 751939392 751949997 751863556 751668243 751412659 751182709 751057053
2641 751057053 751067657 751181564 751317749 751386566 751335449 751174088 750969467 750811157 750766373 750845718 750999451
2652 750999451 751142349 751199188 751140823 750999222 750848923 750767746 750796051 750915604 751059341 751145554 751120605
2663 751120605 750986176 750798340 750639267 750574799 750620956 750736465 750842972 750865250 750769043 750577164 750357590
2674 750357590 750188980 750120468 750147705 750216064 750248108 750184021 750010681 749768219 749528427 749358978 749288101
2685 749288101 749291229 749303589 749253159 749096527 748839722 748534775 748251648 748043747 747920609 747845764 747756042
2696 747756042 747596359 747348404 747040176 746731339 746482544 746322784 746234894 746162720 746039200 745819550
$$ packed form
2619G53763504p0724k01645k76566k59018j59759l1128O1416P0954o104j29776k37274
2630G52523880k74277k25296j17569r384M2038J0605q6441j95313k55584k29950j25656
2641G51057053J0604J13907J36185O8817n1117j61361k04621j58310m4784P9345J53733
2652G50999451J42898N6839n8365j41601j50299q1177K8305J19553J43737Q6213k4949
2663G51120605j34429j87836j59073o4468M6157J15509J06507K2278r6207j91879k19574
2674G50357590j68610o8512K7237O8359L2044o4087j73340k42462k39792j69449p0877
2685G49288101L128J2360n0430j56632k56805l04947k83127k07901j23138p4845q9722
2696G47756042j59683k47955l08228l08837k48795j59760q7890p2174j23520k19650
$$ plain form
2706 745819550 745502930 745131683 744768372 744464264 744232635 744043274 743838120 743562927 743195038 742756348
2716 742756348 742302856 741896439 741574402 741329803 741115646 740867844 740537872 740116959 739640274 739169464
2726 739169464 738761826 738441162 738187180 737944870 737653809 737277298 736821976 736332626 735870590 735482101
2736 735482101 735176010 734921646 734664688 734358597 733987732 733577499 733181000 732852097 732617340 732461700
2746 732461700 732334442 732174225 731937027 731616516 731245117 730875473 730552979 730292816 730072174 729842377
2756 729842377 729553757 729179916 728730927 728246994 727780151 727368011 727017746 726705399 726389542 726033401
2766 726033401 725623245 725173950 724718781 724291153 723904495 723543854 723171234 722743301 722232132 721638107
2776 721638107 720990982 720336761 719717484 719155121 718645401 718164368 717686386 717199860 716715393 716262512
$$ packed form
2706G45819550l16620l71247l63311l04108k31629j89361k05154k75193l67889m38690
2716G42756348m53492m06417l22037k44599k14157k47802l29972m20913m76685m70810
2726G39169464m07638l20664k53982k42310k91061l76511m55322m89350m62036l88489
2736G35482101l06091k54364k56958l06091l70865m10233l96499l28903k34757j55640
2746G32461700j27258j60217k37198l20511l71399l69644l22494k60163k20642k29797
2756G29842377k88620l73841m48989m83933m66843m12140l50265l12347l15857l56141
2766G26033401m10156m49295m55169m27628l86658l60641l72620m27933n11169n94025
2776G21638107o47125o54221o19277n62363n09720m81033m77982m86526m84467m52881
$$ plain form
2786 716262512 715874023 715568237 715336838 715145645 714947281 714700546 714386902 714016266 713619690 713232117
2796 713232117 712874985 712546082 712221451 711870041 711470108 711023331 710555420 710105820 709709854 709382172
2806 709382172 709110336 708861008 708595352 708288498 707941132 707579880 707244720 706971588 706775131 706643066
2816 706643066 706542358 706433868 706290894 706108170 705902863 705701599 705524826 705372314 705221939 705037842
2826 705037842 704786530 704453659 704051590 703613281 703178329 702774429 702403870 702044983 701661682 701223526
2836 701223526 700719299 700163269 699586868 699021759 698482742 697958221 697413712 696806946 696107941 695310822
2846 695310822 694437180 693524017 692604446 691693115 690779724 689837189 688836975 687767792 686643219
2855 686643219 685495758 684361572 683259125 682176895 681073990 679894943 678592606 677147141 675574951
$$ packed form
2786G16262512l88489l05786k31399j91193j98364k46735l13644l70636l96576l87573
2796G13232117l57132l28903l24631l51410l99933m46777m67911m49600l95966l27682
2806G09382172k71836k49328k65656l06854l47366l61252l35160k73132j96457j32065
2816G06643066j00708j08490j42974j82724k05307k01264j76773j52512j50375j84097
2826G05037842k51312l32871m02069m38309m34952m03900l70559l58887l83301m38156
2836G01223526n04227n56030n76401n65109n39017n24521n44509o06766o99005p97119
2846F95310822q73642r13163r19571r11331r13391r42535j000214j069183j124573
2855F86643219j147461j134186j102447j082230j102905j179047j302337j445465j572190
$$ plain form
2864 675574951 673920212 672236633 670566483 668928146 667316513 665716171 664119186 662535934 660996094
2873 660996094 659533691 658168030 656887894 655646362 654373093 652996674 651467896 649772415 647929764
2882 647929764 645976334 643943253 641840439 639650993 637343864 634891357 632286644 629549217 626715164
2891 626715164 623819580 620876961 617874489 614779892 611563911 608223419 604798851 601370392 598038940
2900 598038940 594895782 591997871 589355202 586940041 584707603 582620583 580664902 578849258 577190704
2909 577190704 575694122 574337959 573072548 571832466 570556526 569204750 567765083 566246948 564665527
2918 564665527 563027344 561322937 559532738 557641373 555653992 553604965 551555405 549577942 547736397
2927 547736397 546070786 544590111 543280144 542117920 541088791 540196152 539460869 538911057 538567429
$$ packed form
2864F75574951j654739j683579j670150j638337j611633j600342j596985j583252j539840
2873F60996094j462403j365661j280136j241532j273269j376419j528778j695481j842651
2882F47929764j953430k033081k102814k189446k307129k452507k604713k737427k834053
2891F26715164k895584k942619l002472l094597l215981l340492l424568l428459l331452
2900E98038940l143158k897911k642669k415161k232438k087020j955681j815644j658554
2909E77190704j496582j356163j265411j240082j275940j351776j439667j518135j581421
2918E64665527j638183j704407j790199j891365j987381k049027k049560j977463j841545
2927E47736397j665611j480675j309967j162224j029129q92639p35283n49812l43628
$$ plain form
2936 538567429 538431702 538483200 538684769 538993378 539371109 539790077 540228424 540662613 541059647 541376495
2946 541376495 541567001 541595802 541451569 541152496 540740509 540267296 539776230 539290390 538812485 538334503
2956 538334503 537853775 537382431 536947746 536578941 536286316 536045456 535792618 535436516 534883041 534061775
2966 534061775 532943573 531541138 529895172 528053322 526054955 523929901 521714058 519473534 517323608
2975 517323608 515431595 513993835 513197594 513174438 513969154 515531731 517738075 520428810 523450165
2984 523450165 526682053 530043297 533479729 536944313 540383987 543742752 546976814 550074158 553063736
2993 553063736 556007118 558971100 561996078 565071602 568133926 571085777 573830910 576308937 578512764
3002 578512764 580485611 582297783 584016418 585680351 587293243 588831139 590261917 591563301 592730904
$$ packed form
2936E38567429j35727N1498K01569L08609L77731M18968M38347M34189L97034L16848
2946E41376495J90506K8801j44233k99073m11987m73213m91066m85840m77905m77982
2956E38334503m80728m71344m34685l68805k92625k40860k52838l56102n53475q21266
2966E34061775j118202j402435j645966j841850j998367k125054k215843k240524k149926
2975E17323608j892013j437760p96241k3156P94716J562577K206344K690735L021355
2984E23450165L231888L361244L436432L464584L439674L358765L234062L097344K989578
2993E53063736K943382K963982L024978L075524L062324K951851K745133K478027K203827
3002E78512764J972847J812172J718635J663933J612892J537896J430778J301384J167603
$$ plain form
3011 592730904 593773422 594698906 595501633 596156769 596627274 596879616 596900597 596705055 596332512 595831108
3021 595831108 595239182 594574356 593833885 593009186 592102776 591139717 590162735 589214401 588313599 587440796
3031 587440796 586542015 585554466 584442520 583225365 581984749 580840073 579904823 579239426 578822441
3040 578822441 578553619 578286400 577875824 577221527 576286888 575090408 573677139 572084808 570324783
3049 570324783 568382301 566235199 563879051 561344986 558698845 556024818 553398933 550864944 548424721
3058 548424721 546042862 543665352 541240883 538736382 536141777 533463326 530714531 527906380 525046539
3067 525046539 522144547 519218063 516296005 513412399 510594254 507846375 505144119 502436600 499661522
3076 499661522 496766357 493725662 490548401 487271271 483945847 480623055 477345695 474149475 471071472
$$ packed form
3011E92730904J042518R25484Q02727O55136M70505K52342K0981j95542l72543n01404
3021E95831108n91926o64826p40471q24699r06410r63059r76982r48334r00802q72803
3031E87440796q98781r87549j111946j217155j240616j144676r35250o65397m16985
3040E78822441k68822k67219m10576o54297r34639j196480j413269j592331j760025
3049E70324783j942482k147102k356148k534065k646141k674027k625885k533989k440223
3058E48424721k381859k377510k424469k504501k594605k678451k748795k808151k859841
3067E25046539k901992k926484k922058k883606k818145k747879k702256k707519k775078
3076D99661522k895165l040695l177261l277130l325424l322792l277360l196220l078003
$$ plain form
3085 471071472 468155518 465451050 463003120 460833473 458927612 457228012 455643044 454065094 452394142
3094 452394142 450557861 448521500 446288528 443892555 441386566 438831940 436290169 433817062 431459389
3103 431459389 429252434 427219696 425373344 423717880 422252541 420974998 419883995 418980217 418265839
3112 418265839 417743416 417412796 417267838 417293968 417466660 417754898 418128090 418565445 419064407 419643593
3122 419643593 420337563 421185150 422214203 423431740 424822502 426356735 428006020 429754753 431606712
3131 431606712 433577805 435682678 437919464 440261536 442659988 445056267 447399979 449661484 451837463
3140 451837463 453945389 456010780 458055382 460086899 462098961 464073639 465988350 467821617 469555702
3149 469555702 471176186 472671204 474030495 475245667 476312637 477233353 478016853 478677483 479232368
$$ packed form
3085D71071472k915954k704468k447930k169647j905861j699600j584968j577950j670952
3094D52394142j836281k036361k232972k395973k505989k554626k541771k473107k357673
3103D31459389k206955k032738j846352j655464j465339j277543j091003r03778p14378
3112D18265839n22423l30620j44958K6130J72692K88238L73192M37355M98962N79186
3122D19643593O93970Q47587J029053J217537J390762J534233J649285J748733J851959
3131D31606712J971093K104873K236786K342072K398452K396279K343712K261505K175979
3140D51837463K107926K065391K044602K031517K012062J974678J914711J833267J734085
3149D69555702J620484J495018J359291J215172J066970R20716P83500O60630N54885
$$ plain form
3158 479232368 479695702 480074921 480367889 480563698 480646477 480601807 480422401 480111313 479681778 479151115
3168 479151115 478534698 477840233 477066269 476207161 475259972 474231682 473142815 472023087 470904198
3177 470904198 469809837 468749809 467718849 466703300 465688782 464667969 463643150 462622833 461615257
3186 461615257 460621529 459632378 458629646 457592278 456502724 455351753 454139709 452872581 451557999
3195 451557999 450199699 448795586 447338867 445820389 444233475 442575531 440848045 439054794 437198257
3204 437198257 435277634 433288803 431226158 429086533 426872101 424590683 422253799 419871559 417448273
3213 417448273 414980736 412459679 409874840 407221832 404505997 401743088 398954468 396161346 393379517
3222 393379517 390617867 387881508 385177422 382518730 379925041 377419090 375018539 372731018 370552597
$$ packed form
3158D79232368M63334L79219K92968J95809Q2779m4670j79406l11088m29535n30663
3168D79151115o16417o94465p73964q59108r47189j028290j088867j119728j118889
3177D70904198j094361j060028j030960j015549j014518j020813j024819j020317j007576
3186D61615257r93728r89151j002732j037368j089554j150971j212044j267128j314582
3195D51557999j358300j404113j456719j518478j586914j657944j727486j793251j856537
3204D37198257j920623j988831k062645k139625k214432k281418k336884k382240k423286
3213D17448273k467537k521057k584839k653008k715835k762909k788620k793122k781829
3222C93379517k761650k736359k704086k658692k593689k505951k400551k287521k178421
$$ plain form
3231 370552597 368471909 366479073 364572639 362765617 361082458 359553452 358205910 357058754 356121216
3240 356121216 355395889 354884186 354590988 354527206 354708519 355153503 355880203 356904640 358239670 359894028
3250 359894028 361871300 364170036 366783257 369701080 372912712 376408958 380183258 384229622 388539886
3259 388539886 393101578 397897034 402905388 408104820 413474045 418990097 424625244 430342407 436094398
3268 436094398 441828537 447495308 453058586 458501434 463826180 469046783 474177971 479226646 484188499
3277 484188499 489052200 493807602 498452682 502995415 507449226 511823807 516117592 520315590 524393921
3286 524393921 528330345 532113304 535747757 539250298 542641296 545933151 549123917 552197227 555130730
3295 555130730 557905426 560514526 562965012 565272255 567451210 569508018 571436653 573223495 574854813
$$ packed form
3231C70552597k080688j992836j906434j807022j683159j529006j347542j147156r37538
3240C56121216p25327n11703k93198o3782J81313M44984P26700J024437J335030J654358
3250C59894028J977272K298736K613221K917823L211632L496246L774300M046364M310264
3259C88539886M561692M795456N008354N199432N369225N516052N635147N717163N751991
3268D36094398N734139N666771N563278N442848N324746N220603N131188N048675M961853
3277D84188499M863701M755402M645080M542733M453811M374581M293785M197998M078331
3286E24393921L936424L782959L634453L502541L390998L291855L190766L073310K933503
3295E55130730K774696K609100K450486K307243K178955K056808J928635J786842J631318
$$ plain form
3304 574854813 576327438 577653236 578858643 579976768 581037102 582057152 583039246 583974800 584852371
3313 584852371 585667877 586429482 587156219 587870369 588587952 589310760 590024910 590707664 591337051 591902466
3323 591902466 592408104 592869110 593302116 593714714 594100571 594442711 594723701 594938278 595099030 595235329
3333 595235329 595381355 595561485 595779190 596015434 596237640 596414490 596530609 596592216 596622696 596649437
3343 596649437 596688156 596732559 596754227 596711617 596565285 596290512 595884666 595363693 594752617 594074097 593340836
3354 593340836 592556610 591723557 590854034 589977989 589143219 588406906 587821045 587418556 587206726 587168999
3364 587168999 587275124 587493057 587797203 588168678 588590851 589041710 589491234 589905396 590254402 590521927
3374 590521927 590709610 590831604 590905457 590940781 590933418 590868225 590728798 590509682 590224304 589904976 589594879
$$ packed form
3304E74854813J472625J325798J205407J118125J060334J020050R82094R35554Q77571
3313E84852371Q15506P61605P26737P14150P17583P22808P14150O82754O29387N65415
3323E91902466N05638M61006M33006M12598L85857L42140K80990K14577J60752J36299
3333E95235329J46026J80130K17705K36244K22206J76850J16119O1607L0480K6741
3343E96649437L8719M4403K1668m2610j46332k74773m05846n20973o11076o78520p33261
3354E93340836p84226q33053q69523q76045q34770p36313n85861m02489k11830l7727
3364E87168999J06125K17933L04146L71475M22173M50859M49524M14162L49006K67525
3374E90521927J87683J21994P3853L5324p363o5193j39427k19116k85378l19328l10097
$$ plain form
3385 589594879 589335403 589155045 589064026 589055977 589115562 589227676 589383392 589580612 589819450 590096054 590396576
3396 590396576 590699081 590977592 591212807 591399422 591547966 591679916 591816292 591965866 592120247 592256584
3406 592256584 592350464 592389259 592380905 592353249 592340889 592368774 592438011 592523575 592584457 592582397 592500153 592350006
3418 592350006 592170105 592008514 591903648 591870155 591896439 591953316 592010536 592051659 592080116 592115440 592181053
3429 592181053 592290344 592440109 592613029 592788353 592956238 593125534 593320656 593569794 593887482 594263077
3439 594263077 594660683 595032158 595338326 595566673 595738792 595902138 596110039 596400757 596782379 597233238
3449 597233238 597713928 598185120 598623772 599027710 599411354 599793129 600183563 600579262 600965500 601325569
3459 601325569 601651535 601951599 602248497 602570305 602937317 603351593 603793945 604232368 604636955 604995842
$$ packed form
3385E89594879k59476j80358r1019q049N9585J12114J55716J97220K38838K76604L00522
3396E90396576L02505K78511K35215J86615J48544J31950J36376J49574J54381J36337
3406E92256584R3880L8795q354k7656j2360K7885O9237Q5564O0882k060q2244j50147
3418E92350006j79901j61591j04866l3493K6284N6877N7220M1123K8457L5324O5613
3429E92181053J09291J49765J72920J75324J67885J69296J95122K49138L17688L75595
3439E94263077L97606L71475L06168K28347J72119J63346K07901K90718L81622M50859
3449E97233238M80690M71192M38652M03938L83644L81775L90434L95699L86238L60069
3459F01325569L25966L00064K96898L21808L67012M14276M42352M38423M04587L58887
$$ plain form
3469 604995842 605322380 605650330 606017342 606445808 606930580 607440071 607931175 608370667 608750381 609090271
3479 609090271 609425507 609787750 610189247 610619049 611053009 611469841 611864548 612251968 612658348 613107338
3489 613107338 613608971 614156342 614731865 615316086 615896225 616468010 617031593 617586517 618127556 618645134
3499 618645134 619129372 619573975 619981155 620361595 620733109 621117783 621536369 622003593 622524376 623093414
3509 623093414 623697929 624324532 624964676 625618439 626291656 626990089 627712021 628444519 629164352 629846077
3519 629846077 630468483 631020393 631502113 631924095 632305336 632672501 633057976 633494911 634008827 634608231
3529 634608231 635280457 635996399 636724777 637448845 638175964 638933945 639752579 640642319 641579590 642509537
3539 642509537 643366241 644098206 644688187 645157928 645554657 645931473 646329880 646772995 647269058 647819061
$$ packed form
3469F04995842L26538L27950L67012M28466M84772N09491M91104M39492L79714L39890
3479F09090271L35236L62243M01497M29802M33960M16832L94707L87420M06380M48990
3489F13107338N01633N47371N75523N84221N80139N71785N63583N54924N41039N17578
3499F18645134M84238M44603M07180L80440L71514L84674M18586M67224N20783N69038
3509F23093414O04515O26603O40144O53763O73217O98433P21932P32498P19833O81725
3519F29846077O22406N51910M81720M21982L81241L67165L85475M36935N13916N99404
3529F34608231O72226P15942P28378P24068P27119P57981Q18634Q89740R37271R29947
3539F42509537Q56704P31965N89981M69741L96729L76816L98407M43115M96063N50003
$$ plain form
3549 647819061 648420181 649069214 649761887 650497437 651287079 652158661 653152313 654298630 655587463 656942978
3559 656942978 658220825 659240494 659846878 659974442 659692078 659197311 658762512 658647385 659013138 659871140
3569 659871140 661089172 662448120 663731232 664806519 665671539 666445160 667308960 668424835 669857178
3578 669857178 671535721 673267746 674802017 675915985 676497421 676587906 676371536 676113358 676070786 676409683
3588 676409683 677159348 678216934 679399567 680519028 681450119 682166519 682736893 683288498 683957596
3597 683957596 684846420 685999527 687396088 688955002 690547714 692015991 693203735 694002838 694401855
3606 694401855 694516754 694577179 694855728 695556488 696709747 698125763 699449310 700306091 700485992 700077362
3616 700077362 699473877 699236450 699852448 701500473 703928757 706512985 708479767 709203262 708451996
$$ packed form
3549F47819061O01120O49033O92673P35550P89642Q71582R93652J146317J288833J355515
3559F56942978J277847J019669O06384J27564k82364m94767m34799j15127L65753Q58002
3569F59871140J218032J358948J283112J075287Q65020P73621Q63800J115875J432343
3578F69857178J678543J732025J534271J113968N81436R0485k16370k58178m2572L38897
3588F76409683P49665J057586J182633J119461R31091P16400N70374N51605O69098
3597F83957596Q88824J153107J396561J558914J592712J468277J187744P99103L99017
3606F94401855J14899O0425K78549P00760J153259J416016J323547Q56781J79901m08630
3616G00077362o03485k37427O15998J648025K428284K584228J966782P23495p51266
$$ plain form
3625 708451996 706480408 703930969 701595535 700135117 699872894 700730820 702321014 704136505 705761414
3634 705761414 707016449 707996521 708992691 710337143 712232437 714628296 717195282 719407959 720715637
3643 720715637 720741119 719430161 717094879 714325256 711797180 710049515 709318542 709491348 710193787
3652 710193787 710973663 711494370 711664276 711648254 711771011 712359009 713593979 715436783 717645645 719870071
3662 719870071 721775894 723145065 723914948 724150925 723972321 723472748 722671051 721516647 719941483
3671 719941483 717940445 715637665 713309937 711349335 710171738 710099335 711252060 713487015 716405716
3680 716405716 719432449 721944122 723418579 723562012 722380219 720175323 717467804 714864349 712908096
3689 712908096 711950760 712080154 713120575 714698639 716356201 717677307 718395233 718456345 718024902
$$ packed form
3625G08451996j971588k549439k335434j460418k62223Q57926J590194J815491J624909
3634G05761414J255035R80072R96170J344452J895294K395859K566986K212677J307678
3643G20715637K5482j310958k335282k769623k528076j747665p30973J72806P02439
3652G10193787P79876N20707J69906j6022J22757N87998J234970J842804K208862K224426
3662G19870071J905823J369171P69883K35977j78604m99573q01697j154404j575164
3671G19941483k001038k302780k327728j960602j177597p2403J152725K234955K918701
3680G16405716L026733K511673J474457J43433j181793k204896k707519k603455j956253
3689G12908096r57336J29394J040421J578064J657562J321106P17926O1112m31443
$$ plain form
3698 718024902 717428055 717050171 717204971 718017426 719358521 720860138 722021637 722379074 721682434
3707 721682434 720011902 717778244 715599136 714090576 713654022 714345551 715876846 717743835 719419327
3716 719419327 720530853 720949097 720773315 720241318 719625931 719164505 719036026 719359589 720179977 721423492
3726 721423492 722851791 724063644 724590225 724076462 722476959 720162277 717853012 716374359 716325455
3735 716325455 717811813 720378418 723188858 725371628 726367950 726115723 724985657 723521957 722135239
3744 722135239 720917511 719670944 718116989 716150589 713982925 712088623 710982208 710956345 711925354
3753 711925354 713461456 714999847 716099243 716619492 716732407 716775131 717035751 717590256 718267746 718748474
3763 718748474 718738022 718117676 717008438 715724335 714646683 714081650 714156570 714790649 715740967 716696701
$$ packed form
3698G18024902n96847l77884J54800Q12455J341095J501617J161499L57437o96640
3707G21682434j670532k233658k179108j508560m36554O91529J531295J866989J675492
3716G19419327J111526M18244j75782n31997o15387m61426j28479L23563Q20388J243515
3726G21423492J428299J211853N26581n13763j599503k314682k309265j478653m8904
3735G16325455J486358K566605K810440K182770R96322k52227j130066j463700j386718
3744G22135239j217728j246567j553955j966400k167664j894302j106415k5863R69009
3753G11925354J536102J538391J099396N20249J12915M2724K60620N54505O77490M80728
3763G18748474j0452o20346j109238j284103j077652n65033P4920O34079R50318R55734
$$ plain form
3773 716696701 717383804 717644577 717467270 716962280 716302414 715654678 715131302 714776917 714586639 714538116
3783 714538116 714616013 714818726 715151978 715619278 716222992 716967697 717858963 718883667 719977570 721002579
3793 721002579 721758804 722037811 721703644 720757217 719347534 717715225 716099701 714660797 713459091
3802 713459091 712505798 711840286 711577988 711883087 712874985 714517212 716563339 718602371 720189438
3811 720189438 720999298 720924454 720074387 718689499 717030487 715302277 713650970 712204590 711111679
3820 711111679 710533142 710584793 711269073 712450790 713898773 715378113 716732788 717909012 718904419
3829 718904419 719681931 720114975 720009689 719202194 717673111 715605469 713344116 711276398 709702988
3838 709702988 708778687 708549042 709046249 710354309 712572861 715668869 719302750 722751007 725026550
$$ packed form
3773G16696701O87103K60773j77307n04990o59866o47736n23376l54385j90278m8523
3783G14538116P7897K02713L33252M67300O03714P44705Q91266J024704J093903J025009
3793G21002579P56225K79007l34167r46427j409683j632309j615524j438904j201706
3802G13459091r53293o65512k62298L05099R91898J642227K046127K039032J587067
3811G20189438Q09860p4844q50067j384888j659012j728210j651307j446380j092911
3820G11111679n78537N1651O84280J181717J447983J479340J354675J176224R95407
3829G18904419P77512M33044j05286q07495j529083k067642k261353k067718j573410
3838G09702988r24301k29645M97207J308060K218552L096008L633881L448257K275543
$$ plain form
3847 725026550 725198441 722790375 718070297 712069778 706285858 702170792 700623245 701701584 704677200
3856 704677200 708387604 711717300 713980637 715061035 715275803 715085449 714811020 714504166 714004822
3865 714004822 713122711 711818542 710279999 708860779 707926483 707699814 708181229 709172821 710376968
3874 710376968 711506882 712363968 712856140 712977905 712777252 712331314 711734161 711086273 710475235 709954910
3884 709954910 709532166 709177094 708858185 708584976 708434219 708536301 709021683 709946671 711230011 712634659
3894 712634659 713812790 714398880 714127655 712927475 710958328 708573456 706220016 704313354 703130493
3903 703130493 702758484 703109055 703980942 705137787 706365204 707495804 708405762 709005508 709241943
3912 709241943 709112396 708677826 708056107 707391739 706810608 706384354 706123657 705999908 705976105 706028748
$$ packed form
3847G25026550J71891k408066m720078o000519n783920m115066j547547J078339K975616
3856G04677200L710404L329696K263337J080398K14768j90354k74429l06854m99344
3865G14004822q82111j304169j538543j419220r34296k26669M81415R91592J204147
3874G10376968J129914Q57086M92172J21765k00653m45938n97153o47888o11038n20325
3884G09954910m22744l55072l18909k73209j50757J02082M85382R24988J283340J404648
3894G12634659J178131N86090k71225j200180j969147k384872k353440j906662j182861
3903G03130493l72009L50571Q71887J156845J227417J130600R09958N99746K36435
3912G09241943j29547m34570o21719o64368n81131m26254k60697j23749k3803N2643
$$ plain form
3922 706028748 706141510 706284485 706398163 706403503 706234894 705880737 705402145 704913406 704534836 704342880
3932 704342880 704343643 704482803 704678497 704855881 704964981 704980164 704892731 704709396 704455948 704176636 703921432
3943 703921432 703719864 703562088 703403320 703194733 702922592 702627487 702381744 702241211 702198868 702183304
3953 702183304 702102127 701904984 701621246 701337204 701131210 701012115 700911560 700740433 700468216 700160294
3963 700160294 699936752 699872437 699916534 699898758 699636917 699072495 698336563 697680893 697306519 697214813 697190628
3974 697190628 696951675 696364670 695564957 694872208 694540024 694521484 694442368 693843765 692545624 690850372
3984 690850372 689385452 688624878 688409882 687867126 685908813 682082748 677183914 673020401 671151047
3993 671151047 671083603 668942642 657626724 628842316 576423111 499517403 404073448
$$ packed form
3922G06028748J12762J42975J13678N340j68609l54157m78592m88739l78570j91956
3932G04342880P63J39160J95694J77384J09100J5183q7433j83335k53448k79312k55204
3943G03921432k01568j57776j58768k08587k72141k95105k45743j40533m2343j5564
3953G02183304q1177j97143k83738k84042k05994j19095j00555j71127k72217l07922
3963G00160294k23542o4315M4097j7776k61841n64422p35932o55670l74374r1706k4185
3974F97190628k38953n87005p99713o92749l32184j8540p9116n98603j298141j695252
3984F90850372j464920p60574k14996n42756j958313l826065m898834m163513j869354
3993F71151047o7444k140961j1315918k8784408n2419205p6905708r5443955
$$ plain form
4000 404073448
$$ packed form
4000D04073448
##END=$$ End of the data block
